{"text_format":"1","workbook":"xlsx","n_sheets":15,"sheets":["HOME","1-Hidden","1 - Project Structuring","2 - Risk Identification","3 - Rating Scale","4 - Unmit. Risk Assessment","5 - Unmit. Risk Register","6 - Unmit. Project Performance","7 - Unmit. Risk Ranking Plots","8 - Risk Mitigation Strategies","9 - Mit. Strategies Register","10 - Mit. Risk Register","11 - Mit. Project Performance","12 - Mit. Risk Ranking Plots","13 - Summary Report"],"not_rendered":{"charts":8,"images":7,"macros":1,"external_links":0,"defined_names":40,"comments":0,"pivot_tables":0},"unopened":[],"bounds":{"document_bytes":16777216,"sheet_cells":100000,"rows_first":2000,"rows_last":500,"rows_between":2000,"halvings":0,"cell_chars":16384,"cell_head_chars":4096},"cells_cut":0,"cells_raw":0,"read":"whole","date_system":"1900"}

{"sheet":"HOME","index":0,"n_rows":45,"n_cols":25,"rows_kept":45,"cut":false,"hidden":false,"merged":[]}
[null,null,null,null,null,null,null,"SHRP2 Risk Management Template"]
["HELP",null,null,null,null,null,null,null,null,"Home"]
[]
[]
[]
[]
[]
[null," ",null,null,null,null,"PROJECT INFORMATION"]
{"$rows_left_out":38}
{"sheet":"1-Hidden","index":1,"n_rows":121,"n_cols":9,"rows_kept":121,"cut":false,"hidden":true,"merged":[[22,0,22,1],[23,0,23,1],[39,0,39,1],[0,0,0,6],[1,0,1,1],[2,0,2,1],[3,0,3,1],[20,0,20,6],[21,0,21,1]]}
["Design-Bid-Build"]
["Project Start Date",null,41674]
["Target Date for Start of Operations",null,41764]
["Schedule Value"]
[]
[null,"Months/Date","Early Start","Early Finish","Late Start","Late Finish","Float",null,3]
["Planning",0,{"$f":"'1 - Project Structuring'!$E$15","v":40148},{"$f":"IF(OR(C7=\"\",B7=\"\"),\"\",C7+(B7*30.4))","v":40148},{"$f":"IF(OR(F7=\"\",B7=\"\"),\"\",F7-(B7*30.4))","v":40148},{"$f":"IF(E8 = \"\", \"\",E8)","v":40148},{"$f":"IF(OR(F7 =\"\",D7 =\"\"),\"\",(F7-D7)/30.4)","v":0},null,2]
["Scoping",0,{"$f":"IF(D7=\"\",\"\",D7)","v":40148},{"$f":"IF(OR(C8=\"\",B8=\"\"),\"\",C8+(B8*30.4))","v":40148},{"$f":"IF(OR(F8=\"\",B8=\"\"),\"\",F8-(B8*30.4))","v":40148},{"$f":"IF(E10 = \"\", \"\",E10)","v":40148},0,null,42522]
{"$rows_left_out":114}
{"sheet":"1 - Project Structuring","index":2,"n_rows":113,"n_cols":10,"rows_kept":113,"cut":false,"hidden":false,"merged":[]}
[" ",null,null,"SHRP2 Risk Management Template"]
[" ","HELP",null,"Step 01 - Project Structuring"]
[]
[]
[]
[null,null,"ANALYSIS  - Select the \"Analysis\" button on the left to enter values in the \"Analysis\" portion of this sheet"]
[null,null,"Project Delivery Method","Design-Build",null,"Include Operations, Maintenance, & Replacement?",null,null,null,"Yes"]
[]
{"$rows_left_out":106}
{"sheet":"2 - Risk Identification","index":3,"n_rows":66,"n_cols":6,"rows_kept":66,"cut":false,"hidden":false,"merged":[]}
[" ",null,null,"SHRP2 Risk Management Template"]
[" ","HELP",null,"Step 02 - Risk Identification "]
[]
[]
[]
[]
[null,null,"Risk Label","Description of Risk \nTable Below Fills by Selecting \"Create List of Risks\" Button Above","Project Phase","Retire Risk?"]
[null,null,"PL-1","Project funding delayed or reduced.","Planning","No"]
{"$rows_left_out":59}
{"sheet":"3 - Rating Scale","index":4,"n_rows":48,"n_cols":9,"rows_kept":48,"cut":false,"hidden":false,"merged":[]}
[" ",null,null,null,"SHRP2 Risk Management Template"]
["HELP",null,null,null,"Step 03 - Rating Scale"]
[]
[]
[null,null,{"$f":"\"Base Cost through Construction\"","v":"Base Cost through Construction"},{"$f":"SUM('1 - Project Structuring'!D99:D108)","v":16.04},"(CY $M)"]
[null,null,"Base Schedule",{"$f":"'1 - Project Structuring'!D112","v":35.000000000000242},"Months"]
[null,null,"Base Disruption through Construction",{"$f":"SUM('1 - Project Structuring'!F85:F92)","v":0.7},"M-Hr"]
[]
{"$rows_left_out":41}
{"sheet":"4 - Unmit. Risk Assessment","index":5,"n_rows":67,"n_cols":20,"rows_kept":67,"cut":false,"hidden":false,"merged":[]}
[null,null,null,"SHRP2 Risk Management Template"]
["HELP",null,null,"Step 04 - Unmitigated Risk Assessment"]
[]
[]
[]
[]
["Risk",null,"Probability of Occurrence",null,null,null,"Mean Cost Change (CY $M)",null,null,null,null,null,"Mean Duration Change (months)",null,null,null,null,"Mean Disruption Change (M-Hr)"]
[" Label","Risk Description","Adjectival","Numerical","Mean Value","Risk Type","Adjectival","Numerical","Mean Value","Affected\n Phase","Risk \nType","Adjectival","Numerical","Mean \nValue","Affected \nPhase","Risk \nType","Adjectival","Numerical","Mean\n Value","Affected \nPhase"]
{"$rows_left_out":60}
{"sheet":"5 - Unmit. Risk Register","index":6,"n_rows":104,"n_cols":22,"rows_kept":104,"cut":false,"hidden":false,"merged":[]}
[null,null,null,"SHRP2 Risk Management Template"]
["HELP",null,"Step 05 - Unmitigated Risk Register"]
[null,"NOTE: Risks and opportunities are sorted by total severity, though the order should be identical whether using raw severity or percent of total severity"]
["Risk Label","Risk Description","Risk Type","Mean Cost Impact        (CY $M)","Mean Duration Impact (months)","Mean Disruption Impact    (M-Hr)","Mean Change to Critical Path Schedule","Mean Severity     (YOE $M)","Percent of Total Severity","Risk Ranking based on Mean Severity ","Select Risk for Mitigation"]
["SC-6","Provide new lighting throughout project.","Threat",0.57750000000000012,0,0,0,0.61716339357451888,8.2144690317082616E-2,1,"Yes",null,null,null,null,null,null,null,null,null,{"$f":"ABS(Table2[[#This Row],[Mean Severity     (YOE $M)]])","v":0.61716339357451888},{"$f":"LEFT(Table2[[#This Row],[Risk Label]],2)","v":"SC"}]
["PR-1","Uncertainty in construction-cost inflation rate","Threat",0.57750000000000012,0,0,0,0.61716339357451888,8.2144690317082616E-2,2,"Yes",null,null,null,null,null,null,null,null,null,{"$f":"ABS(Table2[[#This Row],[Mean Severity     (YOE $M)]])","v":0.61716339357451888},{"$f":"LEFT(Table2[[#This Row],[Risk Label]],2)","v":"PR"}]
["RR-1","Uncertainty in ROW inflation rate","Threat",0.57750000000000012,0,0,0,0.60364846664440241,8.0345848229410474E-2,3,"No",null,null,null,null,null,null,null,null,null,{"$f":"ABS(Table2[[#This Row],[Mean Severity     (YOE $M)]])","v":0.60364846664440241},{"$f":"LEFT(Table2[[#This Row],[Risk Label]],2)","v":"RR"}]
["RR-3","Unwilling sellers","Threat",0.57750000000000012,0,0,0,0.60364846664440241,8.0345848229410474E-2,4,"Yes",null,null,null,null,null,null,null,null,null,{"$f":"ABS(Table2[[#This Row],[Mean Severity     (YOE $M)]])","v":0.60364846664440241},{"$f":"LEFT(Table2[[#This Row],[Risk Label]],2)","v":"RR"}]
{"$rows_left_out":97}
{"sheet":"6 - Unmit. Project Performance","index":7,"n_rows":40,"n_cols":14,"rows_kept":40,"cut":false,"hidden":false,"merged":[]}
[null,null,null,"SHRP2 Risk Management Template"]
["HELP",null,null,"Step 06 - Unmitigated Project Performance"]
[null,"Schedule Duration Assumption:"]
[null,"Some risks in a phase will occur concurrently, while others will occur sequentially."]
[]
["Unmitigated Project Cost, Duration, and Disruption Performance"]
["Project Phase","Base",null,null,null,"Risk",null,null,"Total (Base + Risk)"]
[null,"Cost \n(CY $M)","Duration (months)","Disruption   (M-hrs)","Cost \n(CY $M)","Duration (months)","Disruption \n(M-hrs)","Cost \n(CY $M)","Duration (months)","Disruption   (M-hrs)","Cost \n(YOE $M)"]
{"$rows_left_out":33}
{"sheet":"7 - Unmit. Risk Ranking Plots","index":8,"n_rows":2,"n_cols":13,"rows_kept":2,"cut":false,"hidden":false,"merged":[]}
[null,null,null,null,null,null,null,null,null,null,null,null,"SHRP2 Risk Management Template"]
["HELP",null,null,null,null,null,null,null,null,null,null,null,"Step 07 - Unmitigated Risk Ranking Plots"]

{"sheet":"8 - Risk Mitigation Strategies","index":9,"n_rows":976,"n_cols":45,"rows_kept":976,"cut":false,"hidden":false,"merged":[]}
[null,null,null,null,null,"SHRP2 Risk Management Template"]
["HELP",null,null,null,null,"Step 08 - Risk Mitigation Strategies"]
[]
[]
[]
["Risk Mitigation Label","Risk Mitigation Actions",null,"Implementation Needs of Risk Mitigation Actions",null,null,null,null,null,null,null,null,"Consequences of Risk Mitigation Actions",null,null,null,"Effectiveness of Risk Mitigation Actions",null,null,null,null,null,"Mitigated Severity",null,null,null,"Risk Mitigation Consequences Performance ",null,null,null,null,null,"Unmitigated Severity"]
[null,null,"Cost",null,"Schedule",null,"Disruption",null,"New ","Probability",null,null,"Percentage Mitigated, if implemented"]
[null,null,"Mean \nCost \n(CY $M)","Affected \nPhase","Mean Duration (months)","Affected\nPhase","Mean \nDisruption \n(M-Hr)","Affected Phase","Adjectival  (VL, L, M, H, VH)","Numerical","Cost (%)","Mean Cost (CY $M)","Duration (%)","Mean Duration (months)","Disruption (%)","Mean Disruption (M-Hr)","Mitigated\nSeverity (%)","Benefit/Cost Ratio","Action Selected",null,"Mean Cost Change (YOE $M)","Mean Duration Change (YOE $M)","Mean Disruption Change (YOE $M)","Mean Change to Crit. Path (YOE $M)","Mean Severity  (YOE $M)","Cost \n(CY $M)","Duration\n(Months)","Disruption\n(M-Hr)","Mean change to critical path ","Mean Severity (YOE $M)","Mean Cost Change (YOE $M)","Mean Duration Change (YOE $M)","Mean Disruption Change (YOE $M)","Mean Change to Crit. Path (YOE $M)","Mean Severity  (YOE $M)"]
{"$rows_left_out":969}
{"sheet":"9 - Mit. Strategies Register","index":10,"n_rows":16,"n_cols":19,"rows_kept":16,"cut":false,"hidden":false,"merged":[]}
[null,null,null,null,"SHRP2 Risk Management Template"]
["HELP",null,null,null,"Step 09 - Mitigation Strategies Register"]
[null,null,"NOTE: The order of the risks here is similar to the order of the"]
[null,null,"risks selected for mitigation in Step 05- Unmitigated Risk Register"]
[null,null,"Risk ","Risk Mitigation",null,null,"Implementation Effort",null,null,null,null,"Mitigated Risk Effort",null,null,"Effectiveness of Mitigation Actions"]
["Risk ","Risk Description","Mitigation","Action Description"]
["Label",null,"Label",null,"Mean Cost Change (YOE $M)","Mean Duration Change (YOE $M)","Mean Disruption Change (YOE $M)","Mean Change to Crit. Path (YOE $M)","Mean Severity  (YOE $M)","Mean Cost Change (YOE $M)","Mean Duration Change (YOE $M)","Mean Disruption Change (YOE $M)","Mean Change to Crit. Path (YOE $M)","Mean Severity  (YOE $M)","Mitigated Severity %","Benefit/Cost Ratio","Responsibility","Schedule /Milestone","Comments"]
[]
{"$rows_left_out":9}
{"sheet":"10 - Mit. Risk Register","index":11,"n_rows":104,"n_cols":22,"rows_kept":104,"cut":false,"hidden":false,"merged":[]}
[null,null,null,"SHRP2 Risk Management Template"]
["HELP",null,null,"Step 10 - Mitigated Risk Register"]
[null,"NOTE: Risks and opportunities are sorted by total severity, though the order should be identical whether using raw severity or percent of total severity"]
["Risk Label","Risk Description","Risk Type","Mean Cost Impact     (CY $M)","Mean Duration Impact (months)","Mean Disruption Impact   \n(M-Hr)","Mean Change to Critical Path Schedule","Mean Severity  (YOE $M)","Percent of Total Mean Severity ","Risk Ranking based on Mean Severity","Retire Risk ?"]
["RR-8","QDOT helps City pay for water and sewer-line relocation","Threat",0.90825,0,0,0,0.94937440663165085,0.15572163780448056,1,"No",null,null,null,null,null,null,null,null,null,{"$f":"ABS(Table245[[#This Row],[Mean Severity  (YOE $M)]])","v":0.94937440663165085},{"$f":"LEFT(Table245[[#This Row],[Risk Label]],2)","v":"RR"}]
["PR-1","Uncertainty in construction-cost inflation rate","Threat",0.57750000000000012,0,0,0,0.61716339357451888,0.1012305511598687,2,"No",null,null,null,null,null,null,null,null,null,{"$f":"ABS(Table245[[#This Row],[Mean Severity  (YOE $M)]])","v":0.61716339357451888},{"$f":"LEFT(Table245[[#This Row],[Risk Label]],2)","v":"PR"}]
["RR-1","Uncertainty in ROW inflation rate","Threat",0.57750000000000012,0,0,0,0.60364846664440241,9.9013758141577271E-2,3,"No",null,null,null,null,null,null,null,null,null,{"$f":"ABS(Table245[[#This Row],[Mean Severity  (YOE $M)]])","v":0.60364846664440241},{"$f":"LEFT(Table245[[#This Row],[Risk Label]],2)","v":"RR"}]
["PD-13","Change in environmental documentation.","Threat",0.13125000000000001,1,0,0.9999999999998086,0.37949026879033604,6.2246091504151932E-2,4,"No",null,null,null,null,null,null,null,null,null,{"$f":"ABS(Table245[[#This Row],[Mean Severity  (YOE $M)]])","v":0.37949026879033604},{"$f":"LEFT(Table245[[#This Row],[Risk Label]],2)","v":"PD"}]
{"$rows_left_out":97}
{"sheet":"11 - Mit. Project Performance","index":12,"n_rows":41,"n_cols":14,"rows_kept":41,"cut":false,"hidden":false,"merged":[]}
[null,null,null,null,null,"SHRP2 Risk Management Template"]
["HELP",null,null,null,null,"Step 11 - Mitigated Project Performance"]
[null,"Schedule Duration Assumption:"]
[null,"Some risks in a phase will occur concurrently, while others will occur sequentially."]
[]
[]
["Mitigated Project Cost, Duration, and Disruption Performance"]
["Project Phase",null,"Base + Implementation",null,null,"Residual Risk",null,null,"Total (Base + Implementation + Residual Risk)"]
{"$rows_left_out":34}
{"sheet":"12 - Mit. Risk Ranking Plots","index":13,"n_rows":2,"n_cols":13,"rows_kept":2,"cut":false,"hidden":false,"merged":[]}
[null,null,null,null,null,null,null,null,null,null,null,null,"SHRP2 Risk Management Template"]
["HELP",null,null,null,null,null,null,null,null,null,null,null,"Step 12 - Mitigated Risk Ranking Plots"]

{"sheet":"13 - Summary Report","index":14,"n_rows":441,"n_cols":147,"rows_kept":441,"cut":false,"hidden":false,"merged":[]}
[null,null,null,null,null,null,"SHRP2 Risk Management Template",null,null,null,null,null,null,null,null,null,null,null,null,null,null,null,null,null,null,null,null,null,null,null,null,null,null,null,null,null,null,null,null,null,null,null,null,null,null,null,null,null,null,null,null,null,null,"UNMITIGATED PERFORMANCE RESULTS",null,null,null,null,null,null,null,null,null,null,null,null,null,null,null,null,null,null,null,null,null,null,null,null,null,null,null,null,null,null,null,null,null,null,null,null,null,null,null,null,null,null,null,null,null,null,null,"MITIGATED PERFORMANCE RESULTS"]
["HELP",null,null,null,null,null,"Summary Report",null,null,null,null,null,null,null,null,null,null,null,null,null,null,null,null,null,null,null,null,null,null,null,null,null,null,null,null,null,null,null,null,null,null,null,null,null,null,null,null,null,null,null,null,null,null,null,null,null,null,null,null,"Project Performance",null,null,null,null,null,null,null,null,null,null,null,null,null,null,null,null,null,null,null,null,null,null,null,null,null,null,null,null,null,null,null,null,null,null,null,null,null,null,null,null,null,null,null,null,null,"Project Performance"]
[null,null,null,null,null,null,null,null,null,null,null,null,null,null,null,null,null,null,"PROJECT INFORMATION",null,null,null,null,null,null,null,null,null,null,null,null,null,null,null,null,null,null,null,null,null,null,null,null,null,null,null,null,null,null,null,null,null,null,"Project Phase",null,"Base",null,null,"Risk",null,null,"Total (Base + Risk) ",null,null,null,null,null,null,null,null,null,null,null,null,null,null,null,null,null,null,null,null,null,null,null,null,null,null,null,null,null,null,null,null,null,null,null,null,null,null,null,"Project Phase",null,"Base + Implementation",null,null,"Residual Risk",null,null,null,"Total"]
[null,null,null,null,null,null,null,null,null,null,null,null,null,null,null,null,"Information Type",null,"Value",null,null,null,null,null,null,null,null,null,null,null,null,null,null,null,null,null,null,null,null,null,null,null,null,null,null,null,null,null,null,null,null,null,null,null,"Cost \n(CY $M)","Duration (months)","Disruption (M-hrs)","Cost \n(CY $M)","Duration (months)","Disruption (M-hrs)","Cost \n(CY $M)","Duration (months)","Disruption (M-hrs)","Cost \n(YOE $M)",null,null,null,null,null,null,null,null,null,null,null,null,null,null,null,null,null,null,null,null,null,null,null,null,null,null,null,null,null,null,null,null,null,null,null,null,null,null,"Cost \n(CY $M)","Duration (months)","Disruption (M-hrs)","Cost \n(CY $M)","Duration (months)","Disruption (M-hrs)","Cost \n(CY $M)","Duration (months)","Disruption (M-hrs)","Cost \n(YOE $M)"]
[null,null,null,"Note: Click on \"Update Report\" to ensure that this  ",null,null,null,null,null,null,null,null,null,null,null,null,"Agency",null,{"$f":"IF(HOME!F10 = \"\",\"\",HOME!F10)","v":"Federal Highway Administration"},null,null,null,null,null,null,null,"PROJECT STRUCTURING"]
[null,null,null,"summary is populated with the latest data and charts",null,null,null,null,null,null,null,null,null,null,null,null,"District Region",null,{"$f":"IF(HOME!F12 = \"\",\"\",HOME!F12)","v":"QDOT District 1"},null,null,null,null,null,null,null,null,"Base Cost"]
[null,null,null,null,null,null,null,null,null,null,null,null,null,null,null,null,"Project Name",null,{"$f":"IF(HOME!F14 = \"\",\"\",HOME!F14)","v":"QDOT Example"},null,null,null,null,null,null,null,null,"Total Unesc ","Total Esc","Duration",null,null,null,null,null,null,null,null,null,null,null,null,null,null,null,null,null,null,null,null,null,null,null,{"$f":"IF('6 - Unmit. Project Performance'!A9=\"\",\"\",'6 - Unmit. Project Performance'!A9)","v":"Planning"},{"$f":"IF('6 - Unmit. Project Performance'!B9=\"\",\"\",'6 - Unmit. Project Performance'!B9)","v":""},{"$f":"IF('6 - Unmit. Project Performance'!C9=\"\",\"\",'6 - Unmit. Project Performance'!C9)","v":0},{"$f":"IF('6 - Unmit. Project Performance'!D9=\"\",\"\",'6 - Unmit. Project Performance'!D9)","v":0},{"$f":"IF('6 - Unmit. Project Performance'!E9=\"\",\"\",'6 - Unmit. Project Performance'!E9)","v":0},{"$f":"IF('6 - Unmit. Project Performance'!F9=\"\",\"\",'6 - Unmit. Project Performance'!F9)","v":0},{"$f":"IF('6 - Unmit. Project Performance'!G9=\"\",\"\",'6 - Unmit. Project Performance'!G9)","v":0},{"$f":"IF('6 - Unmit. Project Performance'!H9=\"\",\"\",'6 - Unmit. Project Performance'!H9)","v":0},{"$f":"IF('6 - Unmit. Project Performance'!I9=\"\",\"\",'6 - Unmit. Project Performance'!I9)","v":0},{"$f":"IF('6 - Unmit. Project Performance'!J9=\"\",\"\",'6 - Unmit. Project Performance'!J9)","v":0},{"$f":"IF('6 - Unmit. Project Performance'!K9=\"\",\"\",'6 - Unmit. Project Performance'!K9)","v":""},null,null,null,null,null,null,null,null,null,null,null,null,null,null,null,null,null,null,null,null,null,null,null,null,null,null,null,null,null,null,null,null,null,null,null,null,null,{"$f":"IF('11 - Mit. Project Performance'!A10=\"\",\"\",'11 - Mit. Project Performance'!A10)","v":"Planning"},{"$f":"IF('11 - Mit. Project Performance'!B10=\"\",\"\",'11 - Mit. Project Performance'!B10)","v":0},{"$f":"IF('11 - Mit. Project Performance'!C10=\"\",\"\",'11 - Mit. Project Performance'!C10)","v":0},{"$f":"IF('11 - Mit. Project Performance'!D10=\"\",\"\",'11 - Mit. Project Performance'!D10)","v":0},{"$f":"IF('11 - Mit. Project Performance'!E10=\"\",\"\",'11 - Mit. Project Performance'!E10)","v":0},{"$f":"IF('11 - Mit. Project Performance'!F10=\"\",\"\",'11 - Mit. Project Performance'!F10)","v":0},{"$f":"IF('11 - Mit. Project Performance'!G10=\"\",\"\",'11 - Mit. Project Performance'!G10)","v":0},{"$f":"IF('11 - Mit. Project Performance'!H10=\"\",\"\",'11 - Mit. Project Performance'!H10)","v":0},{"$f":"IF('11 - Mit. Project Performance'!I10=\"\",\"\",'11 - Mit. Project Performance'!I10)","v":0},{"$f":"IF('11 - Mit. Project Performance'!J10=\"\",\"\",'11 - Mit. Project Performance'!J10)","v":0},{"$f":"IF('11 - Mit. Project Performance'!K10=\"\",\"\",'11 - Mit. Project Performance'!K10)","v":0}]
[null,null,null,null,null,null,"REPORT SUMMARY",null,null,null,null,null,null,null,null,null,"Project Description",null,{"$f":"IF(HOME!F16 = \"\",\"\",HOME!F16)","v":"QDOT Example R09 Guidebook"},null,null,null,null,null,null,null,"Project Phase","Cost ($M)"," Cost ($M)"," (months)",null,null,null,null,null,null,null,null,null,null,null,null,null,null,null,null,null,null,null,null,null,null,null,{"$f":"IF('6 - Unmit. Project Performance'!A10=\"\",\"\",'6 - Unmit. Project Performance'!A10)","v":"Scoping"},{"$f":"IF('6 - Unmit. Project Performance'!B10=\"\",\"\",'6 - Unmit. Project Performance'!B10)","v":""},{"$f":"IF('6 - Unmit. Project Performance'!C10=\"\",\"\",'6 - Unmit. Project Performance'!C10)","v":0},{"$f":"IF('6 - Unmit. Project Performance'!D10=\"\",\"\",'6 - Unmit. Project Performance'!D10)","v":0},{"$f":"IF('6 - Unmit. Project Performance'!E10=\"\",\"\",'6 - Unmit. Project Performance'!E10)","v":0},{"$f":"IF('6 - Unmit. Project Performance'!F10=\"\",\"\",'6 - Unmit. Project Performance'!F10)","v":0},{"$f":"IF('6 - Unmit. Project Performance'!G10=\"\",\"\",'6 - Unmit. Project Performance'!G10)","v":0},{"$f":"IF('6 - Unmit. Project Performance'!H10=\"\",\"\",'6 - Unmit. Project Performance'!H10)","v":0},{"$f":"IF('6 - Unmit. Project Performance'!I10=\"\",\"\",'6 - Unmit. Project Performance'!I10)","v":0},{"$f":"IF('6 - Unmit. Project Performance'!J10=\"\",\"\",'6 - Unmit. Project Performance'!J10)","v":0},{"$f":"IF('6 - Unmit. Project Performance'!K10=\"\",\"\",'6 - Unmit. Project Performance'!K10)","v":0},null,null,null,null,null,null,null,null,null,null,null,null,null,null,null,null,null,null,null,null,null,null,null,null,null,null,null,null,null,null,null,null,null,null,null,null,null,{"$f":"IF('11 - Mit. Project Performance'!A11=\"\",\"\",'11 - Mit. Project Performance'!A11)","v":"Scoping"},{"$f":"IF('11 - Mit. Project Performance'!B11=\"\",\"\",'11 - Mit. Project Performance'!B11)","v":0},{"$f":"IF('11 - Mit. Project Performance'!C11=\"\",\"\",'11 - Mit. Project Performance'!C11)","v":0},{"$f":"IF('11 - Mit. Project Performance'!D11=\"\",\"\",'11 - Mit. Project Performance'!D11)","v":0},{"$f":"IF('11 - Mit. Project Performance'!E11=\"\",\"\",'11 - Mit. Project Performance'!E11)","v":0},{"$f":"IF('11 - Mit. Project Performance'!F11=\"\",\"\",'11 - Mit. Project Performance'!F11)","v":0},{"$f":"IF('11 - Mit. Project Performance'!G11=\"\",\"\",'11 - Mit. Project Performance'!G11)","v":0},{"$f":"IF('11 - Mit. Project Performance'!H11=\"\",\"\",'11 - Mit. Project Performance'!H11)","v":0},{"$f":"IF('11 - Mit. Project Performance'!I11=\"\",\"\",'11 - Mit. Project Performance'!I11)","v":0},{"$f":"IF('11 - Mit. Project Performance'!J11=\"\",\"\",'11 - Mit. Project Performance'!J11)","v":0},{"$f":"IF('11 - Mit. Project Performance'!K11=\"\",\"\",'11 - Mit. Project Performance'!K11)","v":0}]
{"$rows_left_out":433}