{"text_format":"1","workbook":"xlsx","n_sheets":15,"sheets":["HOME","1-Hidden","1 - Project Structuring","2 - Risk Identification","3 - Rating Scale","4 - Unmit. Risk Assessment","5 - Unmit. Risk Register","6 - Unmit. Project Performance","7 - Unmit. Risk Ranking Plots","8 - Risk Mitigation Strategies","9 - Mit. Strategies Register","10 - Mit. Risk Register","11 - Mit. Project Performance","12 - Mit. Risk Ranking Plots","13 - Summary Report"],"not_rendered":{"charts":8,"images":7,"macros":1,"external_links":0,"defined_names":40,"comments":0,"pivot_tables":0},"unopened":[],"bounds":{"document_bytes":16777216,"sheet_cells":100000,"rows_first":2000,"rows_last":500,"rows_between":2000,"halvings":0,"cell_chars":16384,"cell_head_chars":4096},"cells_cut":0,"cells_raw":0,"read":"whole","date_system":"1900"}

{"sheet":"HOME","index":0,"n_rows":45,"n_cols":25,"rows_kept":45,"cut":false,"hidden":false,"merged":[]}
[null,null,null,null,null,null,null,"SHRP2 Risk Management Template"]
["HELP",null,null,null,null,null,null,null,null,"Home"]
[]
[]
[]
[]
[]
[null," ",null,null,null,null,"PROJECT INFORMATION"]
[]
[null,"AGENCY :",null,null,null,"Federal Highway Administration",null,null,null,null,null,null,null,"FACILITATOR :",null,null,"Carlos F Figueroa"]
[]
[null,"LOCATION :",null,null,null,"QDOT District 1",null,null,null,null,null,null,null,"PROJECT MANAGER :",null,null,"Luis Millan"]
[]
[null,"PROJECT NAME :",null,null,null,"QDOT Example",null,null,null,null,null,null,null,"DATE :",null,null,42247]
[]
[null,"PROJECT DESCRIPTION :",null,null,null,"QDOT Example R09 Guidebook",null,null,null,null,null,null,null,"VERSION :",null,null,1,null,null,null,null,null,null,null," "]
[]
[]
[]
[null,"RISK MANAGEMENT TEMPLATE STEPS"]
[]
[]
[null,null,null,null,null,null,null,"Enter base project information (schedule, cost, etc.)."]
[]
[null,null,null,null,null,null,null,"Create list of potential risks."]
[]
[null,null,null,null,null,null,null,"Enter values for scales used to assess risk severity."]
[]
[null,null,null,null,null,null,null,"Enter severity information for each risk to assess risk impact."]
[]
[null,null,null,null,null,null,null,"View unmitigated risks ranked by mean severity value."]
[]
[null,null,null,null,null,null,null,"View impact of unmitigated risks on project performance and schedule."]
[]
[null,null,null,null,null,null,null,"View graphical ranking of unmitigated risks."]
[]
[null,null,null,null,null,null,null,"Enter mitigation strategies for risks selected to be mitigated."]
[]
[null,null,null,null,null,null,null,"View summary of mitigation strategies selected for each mitigated risk."]
[]
[null,null,null,null,null,null,null,"View mitigated risks ranked by mean severity value."]
[]
[null,null,null,null,null,null,null,"View impact of mitigated risks on project performance and schedule."]
[]
[null,null,null,null,null,null,null,"View graphical ranking of mitigated risks."]

{"sheet":"1-Hidden","index":1,"n_rows":121,"n_cols":9,"rows_kept":121,"cut":false,"hidden":true,"merged":[[22,0,22,1],[23,0,23,1],[39,0,39,1],[0,0,0,6],[1,0,1,1],[2,0,2,1],[3,0,3,1],[20,0,20,6],[21,0,21,1]]}
["Design-Bid-Build"]
["Project Start Date",null,41674]
["Target Date for Start of Operations",null,41764]
["Schedule Value"]
[]
[null,"Months/Date","Early Start","Early Finish","Late Start","Late Finish","Float",null,3]
["Planning",0,{"$f":"'1 - Project Structuring'!$E$15","v":40148},{"$f":"IF(OR(C7=\"\",B7=\"\"),\"\",C7+(B7*30.4))","v":40148},{"$f":"IF(OR(F7=\"\",B7=\"\"),\"\",F7-(B7*30.4))","v":40148},{"$f":"IF(E8 = \"\", \"\",E8)","v":40148},{"$f":"IF(OR(F7 =\"\",D7 =\"\"),\"\",(F7-D7)/30.4)","v":0},null,2]
["Scoping",0,{"$f":"IF(D7=\"\",\"\",D7)","v":40148},{"$f":"IF(OR(C8=\"\",B8=\"\"),\"\",C8+(B8*30.4))","v":40148},{"$f":"IF(OR(F8=\"\",B8=\"\"),\"\",F8-(B8*30.4))","v":40148},{"$f":"IF(E10 = \"\", \"\",E10)","v":40148},0,null,42522]
["Design Funding Date",40148,null,{"$f":"IF(B9 =\"\", \"\",B9)","v":40148},null,{"$f":"IF(E10 = \"\", \"\",E10)","v":40148},{"$f":"IF(OR(F9 =\"\",D9 =\"\"),\"\",(F9-D9)/30.4)","v":0},null,6]
["Prelim Design/Environmental Process",12,{"$f":"IF(OR(D9=\"\",D8=\"\"),\"\",MAX(D9,D8))","v":40148},{"$f":"IF(OR(C10=\"\",B10=\"\"),\"\",C10+(B10*30.4))","v":40512.800000000003},{"$f":"IF(OR(F10=\"\",B10=\"\"),\"\",F10-(B10*30.4))","v":40148},{"$f":"IF(OR(E11=\"\",E13=\"\",E14=\"\"),\"\",MIN(E11,E13,E14))","v":40512.800000000003},{"$f":"IF(OR(F10 =\"\",D10 =\"\"),\"\",(F10-D10)/30.4)","v":0},null,6]
["Environmental Permits",6,{"$f":"IF(D10=\"\",\"\",D10)","v":40512.800000000003},{"$f":"IF(OR(C11=\"\",B11=\"\"),\"\",C11+(B11*30.4))","v":40695.200000000004},40695.200000000004,{"$f":"IF(E16 = \"\", \"\",E16)","v":40877.600000000006},{"$f":"IF(OR(F11 =\"\",D11 =\"\"),\"\",(F11-D11)/30.4)","v":6.000000000000048},null,42736]
["ROW/Util/RR Funding Date",40148,null,{"$f":"IF(B12=\"\",\"\",B12)","v":40148},-1179621.5999999999,{"$f":"IF(OR(F13=\"\", ),\"\",F13-('1 - Project Structuring'!$J$42*30.4))","v":40877.600000000006},24.000000000000192,null,5]
["ROW/Util/RR",12,{"$f":"IF(D10=\"\",\"\",D10)","v":40512.800000000003},{"$f":"IF(OR(C13=\"\",B13=\"\",),\"\",MAX(C13 +(B13*30.4),D12+('1 - Project Structuring'!$J$42*30.4)))","v":40877.600000000006},40512.800000000003,{"$f":"IF(E16=\"\",\"\",E16)","v":40877.600000000006},0,null,4]
["Final Design",6,{"$f":"IF(D10=\"\",\"\",D10)","v":40512.800000000003},{"$f":"IF(OR(C14=\"\",B14=\"\"),\"\",C14+(B14*30.4))","v":40695.200000000004},40695.200000000004,{"$f":"IF(E16=\"\",\"\",E16)","v":40877.600000000006},6.000000000000048,null,43101]
["Construction Funding Date",40148,null,{"$f":"IF(B15=\"\",\"\",B15)","v":40148},-1179621.5999999999,{"$f":"IF(E16=\"\",\"\",E16)","v":40877.600000000006},24.000000000000192,null,8]
["Procurement",6,{"$f":"IF(OR(D15=\"\",D11=\"\",D13=\"\",D14=\"\"),\"\",MAX(D15,D11,D13,D14))","v":40877.600000000006},{"$f":"IF(OR(C16=\"\",B16=\"\"),\"\",C16+(B16*30.4))","v":41060.000000000007},40877.600000000006,{"$f":"IF(E17=\"\",\"\",E17)","v":41060.000000000007},0,null,23]
["Construction",16,{"$f":"IF(D16=\"\",\"\",D16)","v":41060.000000000007},{"$f":"IF(OR(C17=\"\",B17=\"\"),\"\",C17+(B17*30.4))","v":41546.400000000009},41060.000000000007,{"$f":"IF(E18=\"\",\"\",E18)","v":41546.400000000009},0]
["Operations & Maintenance",{"$f":"'1 - Project Structuring'!D65 *12","v":600},{"$f":"IF(D17=\"\",\"\",D17)","v":41546.400000000009},{"$f":"IF(OR(C18=\"\",B18=\"\"),\"\",C18+(B18*30.4))","v":59786.400000000009},41546.400000000009,{"$f":"IF(E19=\"\",\"\",E19)","v":59786.400000000009}]
["Replacement",0,{"$f":"IF(D18=\"\",\"\",D18)","v":59786.400000000009},{"$f":"IF(OR(C19=\"\",B19=\"\"),\"\",C19+(B19*30.4))","v":59786.400000000009},59786.400000000009,{"$f":"IF(D19=\"\",\"\",D19)","v":59786.400000000009}]
[]
["Design-Build"]
["Project Start Date"]
["Target Date for Start of Operations"]
["Schedule Value"]
[]
[null,"Months/Date","Early Start","Early Finish","Late Start","Late Finish","Float"]
["Planning",0,{"$f":"'1 - Project Structuring'!$E$15","v":40148},{"$f":"IF(OR(C27=\"\",B27=\"\"),\"\",C27+(B27*30.4))","v":40148},{"$f":"IF(OR(F27=\"\",B27=\"\"),\"\",F27-(B27*30.4))","v":40148},{"$f":"IF(E28 = \"\", \"\",E28)","v":40148},{"$f":"IF(OR(F27 =\"\",D27 =\"\"),\"\",(F27-D27)/30.4)","v":0},null,3]
["Scoping",0,{"$f":"IF(D27=\"\",\"\",D27)","v":40148},{"$f":"IF(OR(C28=\"\",B28=\"\"),\"\",C28+(B28*30.4))","v":40148},{"$f":"IF(OR(F28=\"\",B28=\"\"),\"\",F28-(B28*30.4))","v":40148},{"$f":"IF(E30 = \"\", \"\",E30)","v":40148},{"$f":"IF(OR(F28 =\"\",D28 =\"\"),\"\",(F28-D28)/30.4)","v":0},null,2]
["Design Funding Date",40148,null,{"$f":"IF(B29 =\"\", \"\",B29)","v":40148},null,{"$f":"IF(E30 = \"\", \"\",E30)","v":40148},0,null,43101]
["Prelim Design/Environmental Process",12,{"$f":"IF(OR(D29=\"\",D28=\"\"),\"\",MAX(D29,D28))","v":40148},{"$f":"IF(OR(C30=\"\",B30=\"\"),\"\",C30+(B30*30.4))","v":40512.800000000003},{"$f":"IF(OR(F30=\"\",B30=\"\"),\"\",F30-(B30*30.4))","v":40148},{"$f":"IF(OR(E31=\"\",E33=\"\",E35=\"\"),\"\",MIN(E31,E33,E35))","v":40512.800000000003},0,null,6]
["Environmental Permits",6,{"$f":"IF(D30=\"\",\"\",D30)","v":40512.800000000003},{"$f":"IF(OR(C31=\"\",B31=\"\"),\"\",C31+(B31*30.4))","v":40695.200000000004},{"$f":"IF(OR(F31=\"\",B31=\"\"),\"\",F31-(B31*30.4))","v":40512.800000000003},{"$f":"IF(OR(E37=\"\",F35=\"\",F33=\"\"),\"\",MIN(E37,F35-('1 - Project Structuring'!$J$39*30.4)+('1 - Project Structuring'!$J$38*30.4),F33-('1 - Project Structuring'!$J$41*30.4)+('1 - Project Structuring'!$J$40*30.4)))","v":40695.200000000004},0,null,6]
["ROW/Util/RR Funding Date",40148,null,{"$f":"IF(B32=\"\",\"\",B32)","v":40148},null,{"$f":"IF(OR(F33=\"\"),\"\",F33-('1 - Project Structuring'!$J$42*30.4))","v":40877.600000000006},24.000000000000192,null,43282]
["ROW/Util/RR",12,{"$f":"IF(D30=\"\",\"\",D30)","v":40512.800000000003},{"$f":"IF(OR(C33=\"\",B33=\"\",D32=\"\"),\"\",MAX(C33+(B33*30.4),D32+('1 - Project Structuring'!$J$42*30.4),D31-('1 - Project Structuring'!$J$40*30.4)+('1 - Project Structuring'!$J$41*30.4)))","v":40877.600000000006},{"$f":"IF(OR(F33=\"\",B33=\"\"),\"\",F33-(B33*30.4))","v":40512.800000000003},{"$f":"IF(OR(E37=\"\",F37=\"\"),\"\",MIN(E37+('1 - Project Structuring'!$J$43*30.4),F37-('1 - Project Structuring'!$J$46*30.4),F35-('1 - Project Structuring'!$J$48*30.4)+('1 - Project Structuring'!$J$47*30.4)))","v":40877.600000000006},0,null,3]
["Construction Funding Date",40148,null,{"$f":"IF(B34=\"\",\"\",B34)","v":40148},null,{"$f":"IF(E35=\"\",\"\",E35)","v":40512.800000000003},12.000000000000096,null,43831]
["Procurement",6,{"$f":"IF(OR(D34=\"\",D30=\"\"),\"\",MAX(D34,D30))","v":40512.800000000003},{"$f":"IF(OR(C35=\"\",B35=\"\",D31=\"\",D33=\"\"),\"\",MAX(C35+(B35*30.4),D31-('1 - Project Structuring'!$J$38*30.4)+('1 - Project Structuring'!$J$39*30.4),D33-('1 - Project Structuring'!$J$47*30.4)+('1 - Project Structuring'!$J$48*30.4)))","v":40695.200000000004},{"$f":"IF(OR(F35=\"\",B35=\"\"),\"\",F35-(B35*30.4))","v":40512.800000000003},{"$f":"IF(E36=\"\",\"\",E36)","v":40695.200000000004},0,null,8]
["Final Design",6,{"$f":"IF(D35=\"\",\"\",D35)","v":40695.200000000004},{"$f":"IF(OR(C36=\"\",B36=\"\"),\"\",C36+(B36*30.4))","v":40877.600000000006},{"$f":"IF(OR(F36=\"\",B36=\"\",E37=\"\"),\"\",MIN(F36-(B36*30.4),E37-('1 - Project Structuring'!$J$44*30.4)))","v":40695.200000000004},{"$f":"IF(OR(F37=\"\"),\"\",F37-('1 - Project Structuring'!$J$45*30.4))","v":41034.825000000004},5.171874999999952,null,10]
["Construction",16.171875,{"$f":"IF(OR(D31=\"\",C36=\"\",,D33=\"\"),\"\",MAX(D31,C36+('1 - Project Structuring'!$J$44*30.4),D33-('1 - Project Structuring'!$J$43*30.4)))","v":40725.600000000006},{"$f":"IF(OR(C37=\"\",B37=\"\",D36=\"\",D33=\"\"),\"\",MAX(C37+(B37*30.4),D36+('1 - Project Structuring'!$J$45*30.4),D33+('1 - Project Structuring'!$J$46*30.4)))","v":41217.225000000006},{"$f":"IF(OR(F37=\"\",B37=\"\"),\"\",F37-(B37*30.4))","v":40725.600000000006},{"$f":"IF(D37=\"\",\"\",D37)","v":41217.225000000006},0,null,18]
["Operations & Maintenance",600,{"$f":"IF(OR(C37=\"\",B37=\"\"),\"\",C37+(B37*30.4))","v":41217.225000000006},{"$f":"IF(OR(C38=\"\",B38=\"\"),\"\",C38+(B38*30.4))","v":59457.225000000006},{"$f":"IF(OR(F38=\"\",B38=\"\"),\"\",F38-(B38*30.4))","v":41217.225000000006},{"$f":"IF(E39=\"\",\"\",E39)","v":59457.225000000006}]
["Replacement",0,{"$f":"IF(D38=\"\",\"\",D38)","v":59457.225000000006},{"$f":"IF(OR(C39=\"\",B39=\"\"),\"\",C39+(B39*30.4))","v":59457.225000000006},{"$f":"IF(OR(F39=\"\",B39=\"\"),\"\",F39-(B39*30.4))","v":59457.225000000006},{"$f":"IF(D39=\"\",\"\",D39)","v":59457.225000000006}]
["Risk Brainstorm Help Table"]
["Planning","PL"]
["Scoping","SC"]
["Design Funding","F1"]
["Prelim Design/Environmental Process","PD"]
["Environmental Permits","EP"]
["ROW/Util/RR Funding","F2"]
["ROW/Util/RR","RR"]
["Final Design","FD"]
["Construction Funding","F3"]
["Procurement","PR"]
["Construction","CR"]
["Operations & Maintenance","OM"]
["Replacement","RP"]
[]
["Risk Type List"]
["Threat"]
["Opportunity"]
[]
[]
["Impact of Probability of Risk","Rating",0.30000000000000004]
["Definite",4,{"$f":"1-(($B$61-$B61)*(1-$C$60)/4)","v":1}]
["Almost Certain",3,{"$f":"1-(($B$61-$B62)*(1-$C$60)/4)","v":0.82499999999999996}]
["More Likely",2,{"$f":"1-(($B$61-$B63)*(1-$C$60)/4)","v":0.65}]
["Slightly More Likely",1,0.47500000000000009]
["No Change",0,0.30000000000000004]
["Slightly Less Likely",-1,{"$f":"$C$60-(((ABS(B66))/4)*$C$60)","v":0.22500000000000003}]
["Less Likely",-2,{"$f":"$C$60-(((ABS(B67))/4)*$C$60)","v":0.15000000000000002}]
["Rare",-3,7.5000000000000011E-2]
["Eliminate ",-4,0]
[]
["Strategy Select"]
["Yes"]
["No"]
[]
["Phases - Cost & Disruption"]
["Planning"]
["Scoping"]
["Prelim Design/Environmental Process"]
["Environmental Permits"]
["ROW/Util/RR"]
["Final Design"]
["Procurement"]
["Construction"]
["Operations & Maintenance"]
["Replacement"]
[]
["Phases - Duration"]
["Planning"]
["Scoping"]
["Design Funding"]
["Prelim Design/Environmental Process"]
["Environmental Permits"]
["ROW/Util/RR Funding"]
["ROW/Util/RR"]
["Final Design"]
["Construction Funding"]
["Procurement"]
["Construction"]
[]
["Input for copying charts"]
["Copy Thrt_Unmit?",true]
["Copy Opp_Unmit?",true]
["Copy Thrt_Mit?",true]
["Copy Opp_Mit?",true]
[]
["Start Row - Risk Mitigation",67]
[]
["Sheet Names"]
["1 - Project Structuring"]
["2 - Risk Identification"]
["3 - Risk Scale"]
["4 - Unmit. Risk Assessment"]
["5 - Unmit. Risk Register"]
["6 - Unmit. Project Performance"]
["7 - Unmit. Risk Ranking Plots"]
["8 - Risk Mitigation Strategies"]
["9 - Mit. Strategies Register"]
["10 - Mit. Risk Register"]
["11 - Mit. Project Performance"]
["12 - Mit. Risk Ranking Plots"]
["13 - Summary Report"]

{"sheet":"1 - Project Structuring","index":2,"n_rows":113,"n_cols":10,"rows_kept":113,"cut":false,"hidden":false,"merged":[]}
[" ",null,null,"SHRP2 Risk Management Template"]
[" ","HELP",null,"Step 01 - Project Structuring"]
[]
[]
[]
[null,null,"ANALYSIS  - Select the \"Analysis\" button on the left to enter values in the \"Analysis\" portion of this sheet"]
[null,null,"Project Delivery Method","Design-Build",null,"Include Operations, Maintenance, & Replacement?",null,null,null,"Yes"]
[]
[null,null,"Selected Perfomance Measures","Schedule"]
[null,null,null,"Cost"]
[null,null,null,"Disruption"]
[]
[]
[null,null,"SCHEDULE"]
[null,null,"Project Start Date",null,40148]
[null,null,"Target Date for Start of Operations"," (Open to Traffic Date)",41212]
[null,null,"Schedule Value ($M/month)",null,0.1]
[]
[null,null,"Project Phase","Months/Date","Early Start","Early Finish","Late Start","Late Finish","Float (months)"]
[null,null,"Planning",0,{"$f":"'1 - Project Structuring'!$E$15","v":40148},{"$f":"IF(OR(E20=\"\",D20=\"\"),\"\",E20+(D20*30.4))","v":40148},{"$f":"IF(OR(H20=\"\",D20=\"\"),\"\",H20-(D20*30.4))","v":40148},{"$f":"IF(G21 = \"\", \"\",G21)","v":40148},{"$f":"IF(OR(H20 =\"\",F20 =\"\"),\"\",(H20-F20)/30.4)","v":0}]
[null,null,"Scoping",0,{"$f":"IF(F20=\"\",\"\",F20)","v":40148},{"$f":"IF(OR(E21=\"\",D21=\"\"),\"\",E21+(D21*30.4))","v":40148},{"$f":"IF(OR(H21=\"\",D21=\"\"),\"\",H21-(D21*30.4))","v":40148},{"$f":"IF(G23 = \"\", \"\",G23)","v":40148},{"$f":"IF(OR(H21 =\"\",F21 =\"\"),\"\",(H21-F21)/30.4)","v":0}]
[null,null,"Design Funding Date",40148,null,{"$f":"IF(D22 =\"\", \"\",D22)","v":40148},null,{"$f":"IF(G23 = \"\", \"\",G23)","v":40148},0]
[null,null,"Prelim Design/Environmental Process",12,{"$f":"IF(OR(F22=\"\",F21=\"\"),\"\",MAX(F22,F21))","v":40148},{"$f":"IF(OR(E23=\"\",D23=\"\"),\"\",E23+(D23*30.4))","v":40512.800000000003},{"$f":"IF(OR(H23=\"\",D23=\"\"),\"\",H23-(D23*30.4))","v":40148},{"$f":"IF(OR(G24=\"\",G26=\"\",G28=\"\"),\"\",MIN(G24,G26,G28))","v":40512.800000000003},0]
[null,null,"Environmental Permits",6,{"$f":"IF(F23=\"\",\"\",F23)","v":40512.800000000003},{"$f":"IF(OR(E24=\"\",D24=\"\"),\"\",E24+(D24*30.4))","v":40695.200000000004},{"$f":"IF(OR(H24=\"\",D24=\"\"),\"\",H24-(D24*30.4))","v":40512.800000000003},{"$f":"IF(OR(G30=\"\",H28=\"\",H26=\"\"),\"\",MIN(G30,H28-('1 - Project Structuring'!$J$39*30.4)+('1 - Project Structuring'!$J$38*30.4),H26-('1 - Project Structuring'!$J$41*30.4)+('1 - Project Structuring'!$J$40*30.4)))","v":40695.200000000004},0]
[null,null,"ROW/Util/RR Funding Date",40148,null,{"$f":"IF(D25=\"\",\"\",D25)","v":40148},null,{"$f":"IF(OR(H26=\"\"),\"\",H26-('1 - Project Structuring'!$J$42*30.4))","v":40877.600000000006},24.000000000000192]
[null,null,"ROW/Util/RR",12,{"$f":"IF(F23=\"\",\"\",F23)","v":40512.800000000003},{"$f":"IF(OR(E26=\"\",D26=\"\",F25=\"\"),\"\",MAX(E26+(D26*30.4),F25+('1 - Project Structuring'!$J$42*30.4),F24-('1 - Project Structuring'!$J$40*30.4)+('1 - Project Structuring'!$J$41*30.4)))","v":40877.600000000006},{"$f":"IF(OR(H26=\"\",D26=\"\"),\"\",H26-(D26*30.4))","v":40512.800000000003},{"$f":"IF(OR(G30=\"\",H30=\"\"),\"\",MIN(G30+('1 - Project Structuring'!$J$43*30.4),H30-('1 - Project Structuring'!$J$46*30.4),H28-('1 - Project Structuring'!$J$48*30.4)+('1 - Project Structuring'!$J$47*30.4)))","v":40877.600000000006},0]
[null,null,"Construction Funding Date",40148,null,{"$f":"IF(D27=\"\",\"\",D27)","v":40148},null,{"$f":"IF(G28=\"\",\"\",G28)","v":40512.800000000003},12.000000000000096]
[null,null,"Procurement",6,{"$f":"IF(OR(F27=\"\",F23=\"\"),\"\",MAX(F27,F23))","v":40512.800000000003},{"$f":"IF(OR(E28=\"\",D28=\"\",F24=\"\",F26=\"\"),\"\",MAX(E28+(D28*30.4),F24-('1 - Project Structuring'!$J$38*30.4)+('1 - Project Structuring'!$J$39*30.4),F26-('1 - Project Structuring'!$J$47*30.4)+('1 - Project Structuring'!$J$48*30.4)))","v":40695.200000000004},{"$f":"IF(OR(H28=\"\",D28=\"\"),\"\",H28-(D28*30.4))","v":40512.800000000003},{"$f":"IF(G29=\"\",\"\",G29)","v":40695.200000000004},0]
[null,null,"Final Design",6,{"$f":"IF(F28=\"\",\"\",F28)","v":40695.200000000004},{"$f":"IF(OR(E29=\"\",D29=\"\"),\"\",E29+(D29*30.4))","v":40877.600000000006},{"$f":"IF(OR(H29=\"\",D29=\"\",G30=\"\"),\"\",MIN(H29-(D29*30.4),G30-('1 - Project Structuring'!$J$44*30.4)))","v":40695.200000000004},{"$f":"IF(OR(H30=\"\"),\"\",H30-('1 - Project Structuring'!$J$45*30.4))","v":41029.600000000006},5]
[null,null,"Construction",16,{"$f":"IF(OR(F24=\"\",E29=\"\",,F26=\"\"),\"\",MAX(F24,E29+('1 - Project Structuring'!$J$44*30.4),F26-('1 - Project Structuring'!$J$43*30.4)))","v":40725.600000000006},{"$f":"IF(OR(E30=\"\",D30=\"\",F29=\"\",F26=\"\"),\"\",MAX(E30+(D30*30.4),F29+('1 - Project Structuring'!$J$45*30.4),F26+('1 - Project Structuring'!$J$46*30.4)))","v":41212.000000000007},{"$f":"IF(OR(H30=\"\",D30=\"\"),\"\",H30-(D30*30.4))","v":40725.600000000006},{"$f":"IF(F30=\"\",\"\",F30)","v":41212.000000000007},0]
[null,null,"Operations & Maintenance",600,{"$f":"IF(OR(E30=\"\",D30=\"\"),\"\",E30+(D30*30.4))","v":41212.000000000007},{"$f":"IF(OR(E31=\"\",D31=\"\"),\"\",E31+(D31*30.4))","v":59452.000000000007},{"$f":"IF(OR(H31=\"\",D31=\"\"),\"\",H31-(D31*30.4))","v":41212.000000000007},{"$f":"IF(G32=\"\",\"\",G32)","v":59452.000000000007}]
[null,null,"Replacement",0,{"$f":"IF(F31=\"\",\"\",F31)","v":59452.000000000007},{"$f":"IF(OR(E32=\"\",D32=\"\"),\"\",E32+(D32*30.4))","v":59452.000000000007},{"$f":"IF(OR(H32=\"\",D32=\"\"),\"\",H32-(D32*30.4))","v":59452.000000000007},{"$f":"IF(F32=\"\",\"\",F32)","v":59452.000000000007}]
[]
[null,null,"SCHEDULE LAG"]
[null,null,"Include Schedule  Lag?","Yes"]
[]
[null,null," ","Schedule Lag Parameters - Description",null,null,null,null,null,"Months"]
[null,null,"Lag A - Time  remaining from the finish of Environmental permitting to Lag B ",null,null,null,null,null,null,0]
[null,null,"Lag B - Time remaining after completion of Environmental Permitting to finish of Procurement",null,null,null,null,null,null,0]
[null,null,"Lag C - Lag remaining from finish of Environmental permits to Lag D",null,null,null,null,null,null,0]
[null,null,"Lag D - Time remaining after the completion of Environmental Permitting to the completion of ROW/Utilities/RR ",null,null,null,null,null,null,0]
[null,null,"Lag E - Time remaining to finish ROW/Utilities/RR after the ROW/Utilities/RR funding date ",null,null,null,null,null,null,0]
[null,null,"Lag F - Time elapsed from the completion of ROW/Utilities/RR to start of Construction ",null,null,null,null,null,null,6]
[null,null,"Lag G - Time elapsed after the start of Final Design to start of Construction ",null,null,null,null,null,null,1]
[null,null,"Lag H - Time remaining after the finish of Final Design to finish of Construction ",null,null,null,null,null,null,6]
[null,null,"Lag I - Time remaining after finish of ROW/UTL/RR to finish of Construction ",null,null,null,null,null,null,10]
[null,null,"Lag J - Time remaining after finish of ROW/Utilities/RR to Lag K ",null,null,null,null,null,null,6]
[null,null,"Lag K - Time remaining from finish of ROW/Utilities/RR to finish of Procurement ",null,null,null,null,null,null,0]
[]
[]
[null,null,"BASE COST (in Current Year and Year of Expenditure Dollars)"]
[null,null,"Project Phase","Base Cost \n(CY $M)","Base Cost + Overhead Cost (CY $M)","Base Cost + Overhead Cost (YOE $M)"]
[null,null,"Planning",null,0,0,null,"Cost Inflation Rate (percent/year)"]
[null,null,"Scoping",null,0,0,null,"Preconstruction",null,3]
[null,null,"Prelim Design/Environmental Process",1.19,1.1912,1.2089139502725612,null,"ROW/Utility/RR",null,3]
[null,null,"Environmental Permits",null,6.0000000000000006E-4,6.2255540988980342E-4,null,"Construction",null,3]
[null,null,"ROW/Util/RR",3,3.0011999999999999,3.1370905248366756]
[null,null,"Procurement",null,6.0000000000000006E-4,6.2255540988980342E-4,null," "]
[null,null,"Final Design",null,6.0000000000000006E-4,6.3181323021611489E-4,null,"Overhead Rate                                    ","  (CY $ M/month)"]
[null,null,"Construction",11.85,11.8536,12.667719484112402,null,"Preconstruction",null,0.1]
[null,null,"Total",16.04,16.047800000000002,17.015600883271635,null,"Construction",null,0.22500000000000001]
[]
[]
[",",null,"OPERATION, MAINTENANCE & REPLACEMENT"]
[null,null,"Facility Performance Period",50,"years"]
[null,null,"Discount Rate to convert CY $ to YOE $ (Net Discount Rate)",5,"%"]
[]
[null,null," "," ","Operations & Maintenance",null,"Replacement"]
[null,null,"Facility Asset Type","Asset Life Expectancy      (yr)","Agency O&M Costs (CY $M/yr)","Disruption\n(Million-Hr/yr)","Agency Costs (CY $M/event)","Disruption \n(Million-Hr/event)"]
[null,null,"Asset 1",50,null,2.8000000000000001E-2]
[null,null,"Asset 2",50,null,null,null,0.7]
[null,null,"Asset 3"]
[null,null,"Asset 4"]
[null,null,"Asset 5"]
[null,null,"Total YOE $M",null,0,14,0,7]
[null,null,"Total CY $M",null,0,5.0999999999999996,0,6.6]
[]
[]
[null,null,"DISRUPTION"]
[null,null,"Disruption Value",null,10,"$M/M-hr"]
[null,null,"Agency/User Cost Discount Factor",null,1]
[]
[null,null,"Project Phase"," ","Disruption"]
[null,null,null,"M Veh-Hours/Day","No. of Days","M-Hrs","Cost ($M)"]
[null,null,"Planning",null,null,0,0]
[null,null,"Scoping",null,null,0,0]
[null,null,"Prelim Design/Environmental Process",null,null,0,0]
[null,null,"Environmental Permits",null,null,0,0]
[null,null,"ROW/Util/RR",0.02,10,0.2,2]
[null,null,"Procurement",null,null,0,0]
[null,null,"Final Design",null,null,0,0]
[null,null,"Construction",0.05,10,0.5,5]
[null,null,"Operations & Maintenance",null,null,1.4,14]
[null,null,"Replacement",null,null,0.7,7]
[null,null,"Total Disruption through OMR",null,null,2.8,28]
[]
[null,null,"SUMMARY"]
[null,null,"Project Phase","Total CY Cost ($M)","Total YOE Cost ($M)","Duration (months)","Early Start","Early Finish"]
[null,null,"Planning",null,0,0,40148,40148]
[null,null,"Scoping",null,0,0,40148,40148]
[null,null,"Prelim Design/Environmental Process",1.19,1.2089139502725612,12,40148,40512.800000000003]
[null,null,"Environmental Permits",null,6.2255540988980342E-4,6,40512.800000000003,40695.200000000004]
[null,null,"ROW/Util/RR",3,3.1370905248366756,12,40512.800000000003,40877.600000000006]
[null,null,"Final Design",null,6.2255540988980342E-4,6,40695.200000000004,40877.600000000006]
[null,null,"Procurement",null,6.3181323021611489E-4,6,40512.800000000003,40695.200000000004]
[null,null,"Construction",11.85,12.667719484112402,16,40725.600000000006,41212.000000000007]
[null,null,"Operations & Maintenance",0,0,600,41212.000000000007,59474.5]
[null,null,"Replacement",0,0,0]
[]
[null,null,"Base Cost (YOE $M)",17.015600883271635,"(through Operations, Maintenance, & Replacement)"]
[null,null,"Base Construction Completion Date",41212.000000000007]
[null,null,"Months to Construction Completion",35.000000000000242]
[null,null,"Base Disruption ($M)",18.7,"(through Operations, Maintenance, & Replacement)"]

{"sheet":"2 - Risk Identification","index":3,"n_rows":66,"n_cols":6,"rows_kept":66,"cut":false,"hidden":false,"merged":[]}
[" ",null,null,"SHRP2 Risk Management Template"]
[" ","HELP",null,"Step 02 - Risk Identification "]
[]
[]
[]
[]
[null,null,"Risk Label","Description of Risk \nTable Below Fills by Selecting \"Create List of Risks\" Button Above","Project Phase","Retire Risk?"]
[null,null,"PL-1","Project funding delayed or reduced.","Planning","No"]
[null,null,"PL-2","Opposition to removing access to US-555 fro 12th St.","Planning","No"]
[null,null,"PL-3","Opposition to \"splitting\" alignment of SH-111 in the interchange area.","Planning","No"]
[null,null,"PL-4","Other stakeholder issues not captured separately.","Planning","No"]
[null,null,"SC-1","Change in East-West project limits. ","Scoping","No"]
[null,null,"SC-2","Change in North-South project limits. ","Scoping","No"]
[null,null,"SC-3","Additional local improvements required. ","Scoping","No"]
[null,null,"SC-4","Increased aestethetics for US-555/SH-111 interchange. ","Scoping","No"]
[null,null,"SC-5","Replace culvert over Wandering Creek. ","Scoping","No"]
[null,null,"SC-6","Provide new lighting throughout project.","Scoping","No"]
[null,null,"SC-7","ITS added to this project. ","Scoping","No"]
[null,null,"PD-1","Shift alignment of US 555 at east end of project","Prelim Design/Environmental Process","No"]
[null,null,"PD-2","Split alignment of SH-111 at US-555 interchange. ","Prelim Design/Environmental Process","No"]
[null,null,"PD-3","Change in configuration of SH 111 / US 555 interchange.","Prelim Design/Environmental Process","No"]
[null,null,"PD-4","Ground improvement required in interchange area. ","Prelim Design/Environmental Process","No"]
[null,null,"PD-5","Shoulders required on US-555. ","Prelim Design/Environmental Process","No"]
[null,null,"PD-6","Shoulders required on SH-111.","Prelim Design/Environmental Process","No"]
[null,null,"PD-7","Additional cost for signalized intersections.","Prelim Design/Environmental Process","No"]
[null,null,"PD-8","Change in pavement section and/or type.","Prelim Design/Environmental Process","No"]
[null,null,"PD-9","Rehabilitate instead of reconstruct existing roadway (e.g., overlay instead).","Prelim Design/Environmental Process","No"]
[null,null,"PD-10","Change in stormwater design standards.","Prelim Design/Environmental Process","No"]
[null,null,"PD-11","Cannot use City sewer system for project runoff (or City charges for use).","Prelim Design/Environmental Process","No"]
[null,null,"PD-12","Structures impacted by Main Street realignment are eligible for Historic Register.","Prelim Design/Environmental Process","No"]
[null,null,"PD-13","Change in environmental documentation.","Prelim Design/Environmental Process","No"]
[null,null,"PD-14","Delays completing environmental documentation.","Prelim Design/Environmental Process","No"]
[null,null,"PD-15","Encounter unanticipated contamination in interchange area.","Prelim Design/Environmental Process","No"]
[null,null,"PD-16","Additional wetland mitigation required for planned alignment.","Prelim Design/Environmental Process","No"]
[null,null,"EP-1","Challenge to environmental determination or permits","Environmental Permits","No"]
[null,null,"EP-2","Delay obtaining the 404 permit","Environmental Permits","No"]
[null,null,"RR-1","Uncertainty in ROW inflation rate","ROW/Util/RR","No"]
[null,null,"RR-2","Accelerating pace of development in interchange area","ROW/Util/RR","No"]
[null,null,"RR-3","Unwilling sellers","ROW/Util/RR","No"]
[null,null,"RR-4","Additional relocation or demolition required","ROW/Util/RR","No"]
[null,null,"RR-5","Additional ROW required for planned project","ROW/Util/RR","No"]
[null,null,"RR-6","Other delays to ROW planning","ROW/Util/RR","No"]
[null,null,"RR-7","Telecom utility wants a cost-sharing agreement","ROW/Util/RR","No"]
[null,null,"RR-8","QDOT helps City pay for water and sewer-line relocation","ROW/Util/RR","No"]
[null,null,"RR-9","Other utility relocations not completed on time","ROW/Util/RR","No"]
[null,null,"RR-10","Damage existing utility or encounter unanticipated utility during construction","ROW/Util/RR","No"]
[null,null,"PR-1","Uncertainty in construction-cost inflation rate","Procurement","No"]
[null,null,"PR-2","Uncertain Design/Build contracting market conditions at time of bid","Procurement","No"]
[null,null,"PR-3","Material-supply issues","Procurement","No"]
[null,null,"PR-4","Change in project delivery method","Procurement","No"]
[null,null,"PR-5","Accelerate pre-construction activities to reach NTP sooner","Procurement","No"]
[null,null,"PR-6","Use incentives to accelerate D/B construction","Procurement","No"]
[null,null,"PR-7","Issues with D/B design or submittals","Procurement","No"]
[null,null,"PR-8","Other problems with D/B contract procurement","Procurement","No"]
[null,null,"CR-1","D/B construction phasing significantly different than assumed","Construction","No"]
[null,null,"CR-2","Additional Maintenance of Traffic required","Construction","No"]
[null,null,"CR-3","Problems with planned accelerated bridge construction (ABC) technique","Construction","No"]
[null,null,"CR-4","Unable to construct interchange embankments as rapidly as assumed","Construction","No"]
[null,null,"CR-5","Difficult foundation installation","Construction","No"]
[null,null,"CR-6","Severe weather event significantly impacts construction","Construction","No"]
[null,null,"CR-7","Colder-than-usual winter ","Construction","No"]
[null,null,"CR-8","Significant accident during construction","Construction","No"]
[null,null,"CR-9","Limited construction staging area in vicinity of interchange","Construction","No"]
[null,null,"CR-10","Fish window in Wandering Creek","Construction","No"]
[null,null,"CR-11","Non-compliance with permits during construction","Construction","No"]
[null,null,"CR-12","Extended overheads as a function of project delays","Construction","No"]

{"sheet":"3 - Rating Scale","index":4,"n_rows":48,"n_cols":9,"rows_kept":48,"cut":false,"hidden":false,"merged":[]}
[" ",null,null,null,"SHRP2 Risk Management Template"]
["HELP",null,null,null,"Step 03 - Rating Scale"]
[]
[]
[null,null,{"$f":"\"Base Cost through Construction\"","v":"Base Cost through Construction"},{"$f":"SUM('1 - Project Structuring'!D99:D108)","v":16.04},"(CY $M)"]
[null,null,"Base Schedule",{"$f":"'1 - Project Structuring'!D112","v":35.000000000000242},"Months"]
[null,null,"Base Disruption through Construction",{"$f":"SUM('1 - Project Structuring'!F85:F92)","v":0.7},"M-Hr"]
[]
[null,null,"Data Entry Type","Absolute"]
[]
[null,null,"COST CHANGE"]
[null,null,"Adjectival Rating","       Percent of Base Cost",null,"    Absolute Value (CY $M)",null,"   Expected Mean Value"]
[null,null,null,"Low","High","Low","High","Percent","Absolute"]
[null,null,"VH",24.937655860349128,49.875311720698257,4,8,37.406483790523694,6]
[null,null,"H",9.9750623441396513,24.937655860349128,1.6,4,17.456359102244392,2.8]
[null,null,"M",3.117206982543641,9.9750623441396513,0.5,1.6,6.546134663341646,1.05]
[null,null,"L",1.2468827930174564,3.117206982543641,0.2,0.5,2.1820448877805489,0.35]
[null,null,"VL",0,1.2468827930174564,0,0.2,0.62344139650872821,0.1]
[]
[]
[null,null,"DURATION CHANGE"]
[null,null,"Adjectival Rating","    Percent of Base Schedule",null,"   Absolute Value (months)",null,"   Expected Mean Value"]
[null,null,null,"Low","High","Low","High","Percent","Absolute"]
[null,null,"VH",34.28571428571405,68.5714285714281,12,24,51.428571428571075,18]
[null,null,"H",11.428571428571349,34.28571428571405,4,12,22.857142857142698,8]
[null,null,"M",2.8571428571428372,11.428571428571349,1,4,7.1428571428570926,2.5]
[null,null,"L",0.71428571428570931,2.8571428571428372,0.25,1,1.7857142857142732,0.625]
[null,null,"VL",0,0.71428571428570931,0,0.25,0.35714285714285465,0.125]
[]
[]
[null,null,"DISRUPTION CHANGE"]
[null,null,"Adjectival Rating","    Percent of Base Disruption",null,"Absolute Value (M person-Hrs)",null,"   Expected Mean Value"]
[null,null,null,"Low","High","Low","High","Percent","Absolute"]
[null,null,"VH",28.571428571428577,57.142857142857153,0.2,0.4,42.857142857142861,0.30000000000000004]
[null,null,"H",14.285714285714288,28.571428571428577,0.1,0.2,21.428571428571431,0.15000000000000002]
[null,null,"M",0,14.285714285714288,0,0.1,7.1428571428571441,0.05]
[null,null,"L",0,0,0,0,0,0]
[null,null,"VL",0,0,0,0,0,0]
[]
[]
[null,null,"PROBABILITY OF OCCURRENCE"]
[null,null,"Adjectival Rating",null,"Probability Range","Mean Probability"]
[null,null,null,"Low","High"]
[null,null,"VH",0.7,1,0.85]
[null,null,"H",0.4,0.7,0.55000000000000004]
[null,null,"M",0.2,0.4,0.30000000000000004]
[null,null,"L",0.05,0.2,0.125]
[null,null,"VL",0,0.05,2.5000000000000001E-2]

{"sheet":"4 - Unmit. Risk Assessment","index":5,"n_rows":67,"n_cols":20,"rows_kept":67,"cut":false,"hidden":false,"merged":[]}
[null,null,null,"SHRP2 Risk Management Template"]
["HELP",null,null,"Step 04 - Unmitigated Risk Assessment"]
[]
[]
[]
[]
["Risk",null,"Probability of Occurrence",null,null,null,"Mean Cost Change (CY $M)",null,null,null,null,null,"Mean Duration Change (months)",null,null,null,null,"Mean Disruption Change (M-Hr)"]
[" Label","Risk Description","Adjectival","Numerical","Mean Value","Risk Type","Adjectival","Numerical","Mean Value","Affected\n Phase","Risk \nType","Adjectival","Numerical","Mean \nValue","Affected \nPhase","Risk \nType","Adjectival","Numerical","Mean\n Value","Affected \nPhase"]
["PL-1","Project funding delayed or reduced.",null,null,0,null,null,null,0,null,null,null,null,0,null,null,null,null,0]
["PL-2","Opposition to removing access to US-555 fro 12th St.","L",null,0.125,"Threat","VL",null,0.1,"Construction",null,null,0,0,null,null,null,0,0]
["PL-3","Opposition to \"splitting\" alignment of SH-111 in the interchange area.",null,null,0,null,null,null,0,null,null,null,null,0,null,null,null,null,0]
["PL-4","Other stakeholder issues not captured separately.",null,null,0,null,null,null,0,null,null,null,null,0,null,null,null,null,0]
["SC-1","Change in East-West project limits. ",null,null,0,null,null,null,0,null,null,null,null,0,null,null,null,null,0]
["SC-2","Change in North-South project limits. ",null,null,0,null,null,null,0,null,null,null,null,0,null,null,null,null,0]
["SC-3","Additional local improvements required. ","M",null,0.30000000000000004,"Threat","L",null,0.35,"Construction","Threat","L",null,0.625,"Prelim Design/Environmental Process",null,null,0,0]
["SC-4","Increased aestethetics for US-555/SH-111 interchange. ",null,null,0,null,null,null,0,null,null,null,null,0,null,null,null,null,0]
["SC-5","Replace culvert over Wandering Creek. ","M",null,0.30000000000000004,"Threat","L",null,0.35,"Construction",null,null,0,0,null,null,null,0,0]
["SC-6","Provide new lighting throughout project.","H",null,0.55000000000000004,"Threat","M",null,1.05,"Construction",null,null,0,0,null,null,null,0,0]
["SC-7","ITS added to this project. ",null,null,0,null,null,null,0,null,null,null,null,0,null,null,null,null,0]
["PD-1","Shift alignment of US 555 at east end of project","VL",null,2.5000000000000001E-2,"Threat","M",null,1.05,"ROW/Util/RR","Threat","M",null,2.5,"ROW/Util/RR",null,null,0,0]
["PD-2","Split alignment of SH-111 at US-555 interchange. ",null,null,0,null,null,null,0,null,null,null,null,0,null,null,null,null,0]
["PD-3","Change in configuration of SH 111 / US 555 interchange.",null,0,0,null,null,0,0,null,null,null,0,0,null,null,null,0,0]
["PD-4","Ground improvement required in interchange area. ","L",null,0.125,"Threat","M",null,1.05,"Construction","Threat","L",null,0.625,"Construction",null,null,0,0]
["PD-5","Shoulders required on US-555. ","VL",null,2.5000000000000001E-2,"Threat","H",null,2.8,"Construction","Threat","M",null,2.5,"Construction",null,null,0,0]
["PD-6","Shoulders required on SH-111.","VL",null,2.5000000000000001E-2,"Threat","H",null,2.8,"Construction","Threat","M",null,2.5,"Construction",null,null,0,0]
["PD-7","Additional cost for signalized intersections.",null,null,0,null,null,null,0,null,null,null,null,0,null,null,null,null,0]
["PD-8","Change in pavement section and/or type.","M",null,0.30000000000000004,"Opportunity","M",null,-1.05,"Construction",null,null,0,0,null,null,null,0,0]
["PD-9","Rehabilitate instead of reconstruct existing roadway (e.g., overlay instead).",null,null,0,null,null,null,0,null,null,null,null,0,null,null,null,null,0]
["PD-10","Change in stormwater design standards.",null,null,0,null,null,null,0,null,null,null,null,0,null,null,null,null,0]
["PD-11","Cannot use City sewer system for project runoff (or City charges for use).","M",null,0.30000000000000004,"Threat","M",null,1.05,"ROW/Util/RR","Threat","L",null,0.625,"ROW/Util/RR",null,null,0,0]
["PD-12","Structures impacted by Main Street realignment are eligible for Historic Register.","L",null,0.125,"Threat","M",null,1.05,"ROW/Util/RR","Threat","M",null,2.5,"ROW/Util/RR",null,null,0,0]
["PD-13","Change in environmental documentation.","L",null,0.125,"Threat","M",null,1.05,"Prelim Design/Environmental Process","Threat","H",null,8,"Prelim Design/Environmental Process",null,null,0,0]
["PD-14","Delays completing environmental documentation.","M",null,0.30000000000000004,null,null,null,0,null,"Threat","M",null,2.5,"Prelim Design/Environmental Process",null,null,0,0]
["PD-15","Encounter unanticipated contamination in interchange area.","M",null,0.30000000000000004,"Threat","VL",null,0.1,"Construction",null,null,0,0,null,null,null,0,0]
["PD-16","Additional wetland mitigation required for planned alignment.","M",null,0.30000000000000004,"Threat","L",null,0.35,"Construction",null,null,0,0,null,null,null,0,0]
["EP-1","Challenge to environmental determination or permits",null,null,0,null,null,null,0,null,null,null,null,0,null,null,null,null,0]
["EP-2","Delay obtaining the 404 permit","L",null,0.125,null,null,null,0,null,"Threat","M",null,2.5,"Environmental Permits",null,null,0,0]
["RR-1","Uncertainty in ROW inflation rate","H",null,0.55000000000000004,"Threat","M",null,1.05,"ROW/Util/RR",null,null,0,0,null,null,null,0,0]
["RR-2","Accelerating pace of development in interchange area","M",null,0.30000000000000004,"Threat","M",null,1.05,"ROW/Util/RR","Threat","M",null,2.5,"ROW/Util/RR",null,null,0,0]
["RR-3","Unwilling sellers","H",null,0.55000000000000004,"Threat","M",null,1.05,"ROW/Util/RR",null,null,0,0,null,null,null,0,0]
["RR-4","Additional relocation or demolition required",null,null,0,null,null,null,0,null,null,null,null,0,null,null,null,null,0]
["RR-5","Additional ROW required for planned project",null,null,0,null,null,null,0,null,null,null,null,0,null,null,null,null,0]
["RR-6","Other delays to ROW planning","M",null,0.30000000000000004,null,null,null,0,null,"Threat","L",null,0.625,"ROW/Util/RR",null,null,0,0]
["RR-7","Telecom utility wants a cost-sharing agreement","M",null,0.30000000000000004,"Threat","L",null,0.35,"ROW/Util/RR",null,null,0,0,null,null,null,0,0]
["RR-8","QDOT helps City pay for water and sewer-line relocation","H",null,0.55000000000000004,"Threat","M",null,1.05,"ROW/Util/RR",null,null,0,0,null,null,null,0,0]
["RR-9","Other utility relocations not completed on time",null,null,0,null,null,null,0,null,null,null,null,0,null,null,null,null,0]
["RR-10","Damage existing utility or encounter unanticipated utility during construction",null,null,0,null,null,null,0,null,null,null,null,0,null,null,null,null,0]
["PR-1","Uncertainty in construction-cost inflation rate","H",null,0.55000000000000004,"Threat","M",null,1.05,"Construction",null,null,0,0,null,null,null,0,0]
["PR-2","Uncertain Design/Build contracting market conditions at time of bid",null,0.25,0.25,"Threat",null,1.1850000000000001,1.1850000000000001,"Construction","Threat",null,1,1,"Procurement",null,null,0,0]
["PR-3","Material-supply issues",null,null,0,null,null,null,0,null,null,null,null,0,null,null,null,null,0]
["PR-4","Change in project delivery method",null,null,0,null,null,null,0,null,null,null,null,0,null,null,null,null,0]
["PR-5","Accelerate pre-construction activities to reach NTP sooner",null,null,0,null,null,null,0,null,null,null,null,0,null,null,null,null,0]
["PR-6","Use incentives to accelerate D/B construction",null,null,0,null,null,null,0,null,null,null,null,0,null,null,null,null,0]
["PR-7","Issues with D/B design or submittals","M",null,0.30000000000000004,null,null,null,0,null,"Threat","M",null,2.5,"Final Design",null,null,0,0]
["PR-8","Other problems with D/B contract procurement","L",null,0.125,null,null,null,0,null,"Threat","L",null,0.625,"Procurement",null,null,0,0]
["CR-1","D/B construction phasing significantly different than assumed",null,0.25,0.25,null,null,null,0,null,"Opportunity",null,2,-2,"Construction","Opportunity",null,0.1,-0.1,"Construction"]
["CR-2","Additional Maintenance of Traffic required","H",null,0.55000000000000004,"Threat","L",null,0.35,"Construction","Threat","VL",null,0.125,"Construction","Threat","M",null,0.05,"Construction"]
["CR-3","Problems with planned accelerated bridge construction (ABC) technique","H",null,0.55000000000000004,"Threat","L",null,0.35,"Construction","Threat","L",null,0.625,"Construction","Threat","L",null,0,"Construction"]
["CR-4","Unable to construct interchange embankments as rapidly as assumed","M",null,0.30000000000000004,"Threat","L",null,0.35,"Construction","Threat","M",null,2.5,"Construction",null,"L",null,0,"Construction"]
["CR-5","Difficult foundation installation","L",null,0.125,"Threat","L",null,0.35,"Construction","Threat","L",null,0.625,"Construction","Threat","VL",null,0,"Construction"]
["CR-6","Severe weather event significantly impacts construction",null,null,0,null,null,null,0,null,null,null,null,0,null,null,null,null,0]
["CR-7","Colder-than-usual winter ","L",null,0.125,null,null,null,0,null,"Threat","VL",null,0.125,"Construction","Threat","VL",null,0,"Construction"]
["CR-8","Significant accident during construction",null,null,0,null,null,null,0,null,null,null,null,0,null,null,null,null,0]
["CR-9","Limited construction staging area in vicinity of interchange","M",null,0.30000000000000004,"Threat","VL",null,0.1,"Construction",null,null,0,0,null,null,null,0,0]
["CR-10","Fish window in Wandering Creek",null,null,0,null,null,null,0,null,null,null,null,0,null,null,null,null,0]
["CR-11","Non-compliance with permits during construction",null,null,0,null,null,null,0,null,null,null,null,0,null,null,null,null,0]
["CR-12","Extended overheads as a function of project delays",null,null,0,null,null,null,0,null,null,null,null,0,null,null,null,null,0]

{"sheet":"5 - Unmit. Risk Register","index":6,"n_rows":104,"n_cols":22,"rows_kept":104,"cut":false,"hidden":false,"merged":[]}
[null,null,null,"SHRP2 Risk Management Template"]
["HELP",null,"Step 05 - Unmitigated Risk Register"]
[null,"NOTE: Risks and opportunities are sorted by total severity, though the order should be identical whether using raw severity or percent of total severity"]
["Risk Label","Risk Description","Risk Type","Mean Cost Impact        (CY $M)","Mean Duration Impact (months)","Mean Disruption Impact    (M-Hr)","Mean Change to Critical Path Schedule","Mean Severity     (YOE $M)","Percent of Total Severity","Risk Ranking based on Mean Severity ","Select Risk for Mitigation"]
["SC-6","Provide new lighting throughout project.","Threat",0.57750000000000012,0,0,0,0.61716339357451888,8.2144690317082616E-2,1,"Yes",null,null,null,null,null,null,null,null,null,{"$f":"ABS(Table2[[#This Row],[Mean Severity     (YOE $M)]])","v":0.61716339357451888},{"$f":"LEFT(Table2[[#This Row],[Risk Label]],2)","v":"SC"}]
["PR-1","Uncertainty in construction-cost inflation rate","Threat",0.57750000000000012,0,0,0,0.61716339357451888,8.2144690317082616E-2,2,"Yes",null,null,null,null,null,null,null,null,null,{"$f":"ABS(Table2[[#This Row],[Mean Severity     (YOE $M)]])","v":0.61716339357451888},{"$f":"LEFT(Table2[[#This Row],[Risk Label]],2)","v":"PR"}]
["RR-1","Uncertainty in ROW inflation rate","Threat",0.57750000000000012,0,0,0,0.60364846664440241,8.0345848229410474E-2,3,"No",null,null,null,null,null,null,null,null,null,{"$f":"ABS(Table2[[#This Row],[Mean Severity     (YOE $M)]])","v":0.60364846664440241},{"$f":"LEFT(Table2[[#This Row],[Risk Label]],2)","v":"RR"}]
["RR-3","Unwilling sellers","Threat",0.57750000000000012,0,0,0,0.60364846664440241,8.0345848229410474E-2,4,"Yes",null,null,null,null,null,null,null,null,null,{"$f":"ABS(Table2[[#This Row],[Mean Severity     (YOE $M)]])","v":0.60364846664440241},{"$f":"LEFT(Table2[[#This Row],[Risk Label]],2)","v":"RR"}]
["RR-8","QDOT helps City pay for water and sewer-line relocation","Threat",0.57750000000000012,0,0,0,0.60364846664440241,8.0345848229410474E-2,5,"Yes",null,null,null,null,null,null,null,null,null,{"$f":"ABS(Table2[[#This Row],[Mean Severity     (YOE $M)]])","v":0.60364846664440241},{"$f":"LEFT(Table2[[#This Row],[Risk Label]],2)","v":"RR"}]
["RR-2","Accelerating pace of development in interchange area","Threat",0.31500000000000006,0.75000000000000011,0,0.74999999999985645,0.51205073247056643,6.8154153800036144E-2,6,"Yes",null,null,null,null,null,null,null,null,null,{"$f":"ABS(Table2[[#This Row],[Mean Severity     (YOE $M)]])","v":0.51205073247056643},{"$f":"LEFT(Table2[[#This Row],[Risk Label]],2)","v":"RR"}]
["CR-2","Additional Maintenance of Traffic required","Threat",0.1925,6.8750000000000006E-2,2.7500000000000004E-2,6.8749999999885125E-2,0.50630970876113679,6.7390021287278515E-2,7,"Yes",null,null,null,null,null,null,null,null,null,{"$f":"ABS(Table2[[#This Row],[Mean Severity     (YOE $M)]])","v":0.50630970876113679},{"$f":"LEFT(Table2[[#This Row],[Risk Label]],2)","v":"CR"}]
["CR-4","Unable to construct interchange embankments as rapidly as assumed","Threat",0.10500000000000001,0.75000000000000011,0,0.74999999999985645,0.39150962528795719,5.2110085044363728E-2,8,"Yes",null,null,null,null,null,null,null,null,null,{"$f":"ABS(Table2[[#This Row],[Mean Severity     (YOE $M)]])","v":0.39150962528795719},{"$f":"LEFT(Table2[[#This Row],[Risk Label]],2)","v":"CR"}]
["PD-13","Change in environmental documentation.","Threat",0.13125000000000001,1,0,0.9999999999998086,0.37949026879033604,5.0510303969226955E-2,9,"No",null,null,null,null,null,null,null,null,null,{"$f":"ABS(Table2[[#This Row],[Mean Severity     (YOE $M)]])","v":0.37949026879033604},{"$f":"LEFT(Table2[[#This Row],[Risk Label]],2)","v":"PD"}]
["PR-2","Uncertain Design/Build contracting market conditions at time of bid","Threat",0.29625000000000001,0.25,0,0.24999999999995215,0.37535351374470216,4.9959700246324533E-2,10,"No",null,null,null,null,null,null,null,null,null,{"$f":"ABS(Table2[[#This Row],[Mean Severity     (YOE $M)]])","v":0.37535351374470216},{"$f":"LEFT(Table2[[#This Row],[Risk Label]],2)","v":"PR"}]
["PD-11","Cannot use City sewer system for project runoff (or City charges for use).","Threat",0.31500000000000006,0.18750000000000003,0,0.18749999999990427,0.37492763121006484,4.9903015113532359E-2,11,"Yes",null,null,null,null,null,null,null,null,null,{"$f":"ABS(Table2[[#This Row],[Mean Severity     (YOE $M)]])","v":0.37492763121006484},{"$f":"LEFT(Table2[[#This Row],[Risk Label]],2)","v":"PD"}]
["CR-3","Problems with planned accelerated bridge construction (ABC) technique","Threat",0.1925,0.34375,0,0.3437499999999043,0.33372372970696446,4.4418759624521291E-2,12,"Yes",null,null,null,null,null,null,null,null,null,{"$f":"ABS(Table2[[#This Row],[Mean Severity     (YOE $M)]])","v":0.33372372970696446},{"$f":"LEFT(Table2[[#This Row],[Risk Label]],2)","v":"CR"}]
["PD-12","Structures impacted by Main Street realignment are eligible for Historic Register.","Threat",0.13125000000000001,0.3125,0,0.3125,0.21316488261655067,2.8372329680145796E-2,13,"No",null,null,null,null,null,null,null,null,null,{"$f":"ABS(Table2[[#This Row],[Mean Severity     (YOE $M)]])","v":0.21316488261655067},{"$f":"LEFT(Table2[[#This Row],[Risk Label]],2)","v":"PD"}]
["PD-14","Delays completing environmental documentation.","Threat",0,0.75000000000000011,0,0.74999999999985645,0.18441227221618048,2.4545345932022771E-2,14,"Yes",null,null,null,null,null,null,null,null,null,{"$f":"ABS(Table2[[#This Row],[Mean Severity     (YOE $M)]])","v":0.18441227221618048},{"$f":"LEFT(Table2[[#This Row],[Risk Label]],2)","v":"PD"}]
["PD-4","Ground improvement required in interchange area. ","Threat",0.13125000000000001,7.8125E-2,0,7.8125E-2,0.16933020146133226,2.2537916385170127E-2,15,"No",null,null,null,null,null,null,null,null,null,{"$f":"ABS(Table2[[#This Row],[Mean Severity     (YOE $M)]])","v":0.16933020146133226},{"$f":"LEFT(Table2[[#This Row],[Risk Label]],2)","v":"PD"}]
["SC-3","Additional local improvements required. ","Threat",0.10500000000000001,0.18750000000000003,0,0.18749999999990427,0.15828216097404291,2.1067417852872788E-2,16,"No",null,null,null,null,null,null,null,null,null,{"$f":"ABS(Table2[[#This Row],[Mean Severity     (YOE $M)]])","v":0.15828216097404291},{"$f":"LEFT(Table2[[#This Row],[Risk Label]],2)","v":"SC"}]
["SC-5","Replace culvert over Wandering Creek. ","Threat",0.10500000000000001,0,0,0,0.11221152610445796,1.4935398239469565E-2,17,"No",null,null,null,null,null,null,null,null,null,{"$f":"ABS(Table2[[#This Row],[Mean Severity     (YOE $M)]])","v":0.11221152610445796},{"$f":"LEFT(Table2[[#This Row],[Risk Label]],2)","v":"SC"}]
["PD-16","Additional wetland mitigation required for planned alignment.","Threat",0.10500000000000001,0,0,0,0.11221152610445796,1.4935398239469565E-2,18,"No",null,null,null,null,null,null,null,null,null,{"$f":"ABS(Table2[[#This Row],[Mean Severity     (YOE $M)]])","v":0.11221152610445796},{"$f":"LEFT(Table2[[#This Row],[Risk Label]],2)","v":"PD"}]
["RR-7","Telecom utility wants a cost-sharing agreement","Threat",0.10500000000000001,0,0,0,0.10975426666261862,1.4608336041710994E-2,19,"No",null,null,null,null,null,null,null,null,null,{"$f":"ABS(Table2[[#This Row],[Mean Severity     (YOE $M)]])","v":0.10975426666261862},{"$f":"LEFT(Table2[[#This Row],[Risk Label]],2)","v":"RR"}]
["PD-5","Shoulders required on US-555. ","Threat",6.9999999999999993E-2,6.25E-2,0,6.2500000000047864E-2,9.8049624709276778E-2,1.3050443596145028E-2,20,"No",null,null,null,null,null,null,null,null,null,{"$f":"ABS(Table2[[#This Row],[Mean Severity     (YOE $M)]])","v":9.8049624709276778E-2},{"$f":"LEFT(Table2[[#This Row],[Risk Label]],2)","v":"PD"}]
["PD-6","Shoulders required on SH-111.","Threat",6.9999999999999993E-2,6.25E-2,0,6.2500000000047864E-2,9.8049624709276778E-2,1.3050443596145028E-2,21,"No",null,null,null,null,null,null,null,null,null,{"$f":"ABS(Table2[[#This Row],[Mean Severity     (YOE $M)]])","v":9.8049624709276778E-2},{"$f":"LEFT(Table2[[#This Row],[Risk Label]],2)","v":"PD"}]
["CR-5","Difficult foundation installation","Threat",4.3749999999999997E-2,7.8125E-2,0,7.8125E-2,7.5802599643183061E-2,1.0089355813627372E-2,22,"No",null,null,null,null,null,null,null,null,null,{"$f":"ABS(Table2[[#This Row],[Mean Severity     (YOE $M)]])","v":7.5802599643183061E-2},{"$f":"LEFT(Table2[[#This Row],[Risk Label]],2)","v":"CR"}]
["EP-2","Delay obtaining the 404 permit","Threat",0,0.3125,0,0.3125,7.3451630977436261E-2,9.7764409599539939E-3,23,"No",null,null,null,null,null,null,null,null,null,{"$f":"ABS(Table2[[#This Row],[Mean Severity     (YOE $M)]])","v":7.3451630977436261E-2},{"$f":"LEFT(Table2[[#This Row],[Risk Label]],2)","v":"EP"}]
["RR-6","Other delays to ROW planning","Threat",0,0.18750000000000003,0,0.18749999999990427,4.551272400547713E-2,6.0577614580527668E-3,24,"No",null,null,null,null,null,null,null,null,null,{"$f":"ABS(Table2[[#This Row],[Mean Severity     (YOE $M)]])","v":4.551272400547713E-2},{"$f":"LEFT(Table2[[#This Row],[Risk Label]],2)","v":"RR"}]
["PD-1","Shift alignment of US 555 at east end of project","Threat",2.6250000000000002E-2,6.25E-2,0,6.2499999999808528E-2,4.2611327308908681E-2,5.6715844170811287E-3,25,"No",null,null,null,null,null,null,null,null,null,{"$f":"ABS(Table2[[#This Row],[Mean Severity     (YOE $M)]])","v":4.2611327308908681E-2},{"$f":"LEFT(Table2[[#This Row],[Risk Label]],2)","v":"PD"}]
["PD-15","Encounter unanticipated contamination in interchange area.","Threat",3.0000000000000006E-2,0,0,0,3.2060436029845138E-2,4.2672566398484482E-3,26,"No",null,null,null,null,null,null,null,null,null,{"$f":"ABS(Table2[[#This Row],[Mean Severity     (YOE $M)]])","v":3.2060436029845138E-2},{"$f":"LEFT(Table2[[#This Row],[Risk Label]],2)","v":"PD"}]
["CR-9","Limited construction staging area in vicinity of interchange","Threat",3.0000000000000006E-2,0,0,0,3.2060436029845138E-2,4.2672566398484482E-3,27,"No",null,null,null,null,null,null,null,null,null,{"$f":"ABS(Table2[[#This Row],[Mean Severity     (YOE $M)]])","v":3.2060436029845138E-2},{"$f":"LEFT(Table2[[#This Row],[Risk Label]],2)","v":"CR"}]
["PR-8","Other problems with D/B contract procurement","Threat",0,7.8125E-2,0,7.8125E-2,1.8357521922402198E-2,2.4433933849686514E-3,28,"No",null,null,null,null,null,null,null,null,null,{"$f":"ABS(Table2[[#This Row],[Mean Severity     (YOE $M)]])","v":1.8357521922402198E-2},{"$f":"LEFT(Table2[[#This Row],[Risk Label]],2)","v":"PR"}]
["PL-2","Opposition to removing access to US-555 fro 12th St.","Threat",1.2500000000000001E-2,0,0,0,1.3358515012435471E-2,1.7780235999368529E-3,29,"No",null,null,null,null,null,null,null,null,null,{"$f":"ABS(Table2[[#This Row],[Mean Severity     (YOE $M)]])","v":1.3358515012435471E-2},{"$f":"LEFT(Table2[[#This Row],[Risk Label]],2)","v":"PL"}]
["CR-7","Colder-than-usual winter ","Threat",0,1.5625E-2,0,1.5624999999952132E-2,5.8071437477329509E-3,7.729331158503128E-4,30,"No",null,null,null,null,null,null,null,null,null,{"$f":"ABS(Table2[[#This Row],[Mean Severity     (YOE $M)]])","v":5.8071437477329509E-3},{"$f":"LEFT(Table2[[#This Row],[Risk Label]],2)","v":"CR"}]
["CR-1","D/B construction phasing significantly different than assumed","Opportunity",0,-0.5,-2.5000000000000001E-2,-0.50000000000014366,-0.43566608956405839,0.56411460935470881,1,"No",null,null,null,null,null,null,null,null,null,{"$f":"ABS(Table2[[#This Row],[Mean Severity     (YOE $M)]])","v":0.43566608956405839},{"$f":"LEFT(Table2[[#This Row],[Risk Label]],2)","v":"CR"}]
["PD-8","Change in pavement section and/or type.","Opportunity",-0.31500000000000006,0,0,0,-0.3366345783133739,0.43588539064529125,2,"No",null,null,null,null,null,null,null,null,null,{"$f":"ABS(Table2[[#This Row],[Mean Severity     (YOE $M)]])","v":0.3366345783133739},{"$f":"LEFT(Table2[[#This Row],[Risk Label]],2)","v":"PD"}]
["PL-1","Project funding delayed or reduced.","No Impact",0,0,0,0,0,0,null,"No",null,null,null,null,null,null,null,null,null,{"$f":"ABS(Table2[[#This Row],[Mean Severity     (YOE $M)]])","v":0},{"$f":"LEFT(Table2[[#This Row],[Risk Label]],2)","v":"PL"}]
["PL-3","Opposition to \"splitting\" alignment of SH-111 in the interchange area.","No Impact",0,0,0,0,0,0,null,"No",null,null,null,null,null,null,null,null,null,{"$f":"ABS(Table2[[#This Row],[Mean Severity     (YOE $M)]])","v":0},{"$f":"LEFT(Table2[[#This Row],[Risk Label]],2)","v":"PL"}]
["PL-4","Other stakeholder issues not captured separately.","No Impact",0,0,0,0,0,0,null,"No",null,null,null,null,null,null,null,null,null,{"$f":"ABS(Table2[[#This Row],[Mean Severity     (YOE $M)]])","v":0},{"$f":"LEFT(Table2[[#This Row],[Risk Label]],2)","v":"PL"}]
["SC-1","Change in East-West project limits. ","No Impact",0,0,0,0,0,0,null,"No",null,null,null,null,null,null,null,null,null,{"$f":"ABS(Table2[[#This Row],[Mean Severity     (YOE $M)]])","v":0},{"$f":"LEFT(Table2[[#This Row],[Risk Label]],2)","v":"SC"}]
["SC-2","Change in North-South project limits. ","No Impact",0,0,0,0,0,0,null,"No",null,null,null,null,null,null,null,null,null,{"$f":"ABS(Table2[[#This Row],[Mean Severity     (YOE $M)]])","v":0},{"$f":"LEFT(Table2[[#This Row],[Risk Label]],2)","v":"SC"}]
["SC-4","Increased aestethetics for US-555/SH-111 interchange. ","No Impact",0,0,0,0,0,0,null,"No",null,null,null,null,null,null,null,null,null,{"$f":"ABS(Table2[[#This Row],[Mean Severity     (YOE $M)]])","v":0},{"$f":"LEFT(Table2[[#This Row],[Risk Label]],2)","v":"SC"}]
["SC-7","ITS added to this project. ","No Impact",0,0,0,0,0,0,null,"No",null,null,null,null,null,null,null,null,null,{"$f":"ABS(Table2[[#This Row],[Mean Severity     (YOE $M)]])","v":0},{"$f":"LEFT(Table2[[#This Row],[Risk Label]],2)","v":"SC"}]
["PD-2","Split alignment of SH-111 at US-555 interchange. ","No Impact",0,0,0,0,0,0,null,"No",null,null,null,null,null,null,null,null,null,{"$f":"ABS(Table2[[#This Row],[Mean Severity     (YOE $M)]])","v":0},{"$f":"LEFT(Table2[[#This Row],[Risk Label]],2)","v":"PD"}]
["PD-3","Change in configuration of SH 111 / US 555 interchange.","No Impact",0,0,0,0,0,0,null,"No",null,null,null,null,null,null,null,null,null,{"$f":"ABS(Table2[[#This Row],[Mean Severity     (YOE $M)]])","v":0},{"$f":"LEFT(Table2[[#This Row],[Risk Label]],2)","v":"PD"}]
["PD-7","Additional cost for signalized intersections.","No Impact",0,0,0,0,0,0,null,"No",null,null,null,null,null,null,null,null,null,{"$f":"ABS(Table2[[#This Row],[Mean Severity     (YOE $M)]])","v":0},{"$f":"LEFT(Table2[[#This Row],[Risk Label]],2)","v":"PD"}]
["PD-9","Rehabilitate instead of reconstruct existing roadway (e.g., overlay instead).","No Impact",0,0,0,0,0,0,null,"No",null,null,null,null,null,null,null,null,null,{"$f":"ABS(Table2[[#This Row],[Mean Severity     (YOE $M)]])","v":0},{"$f":"LEFT(Table2[[#This Row],[Risk Label]],2)","v":"PD"}]
["PD-10","Change in stormwater design standards.","No Impact",0,0,0,0,0,0,null,"No",null,null,null,null,null,null,null,null,null,{"$f":"ABS(Table2[[#This Row],[Mean Severity     (YOE $M)]])","v":0},{"$f":"LEFT(Table2[[#This Row],[Risk Label]],2)","v":"PD"}]
["EP-1","Challenge to environmental determination or permits","No Impact",0,0,0,0,0,0,null,"No",null,null,null,null,null,null,null,null,null,{"$f":"ABS(Table2[[#This Row],[Mean Severity     (YOE $M)]])","v":0},{"$f":"LEFT(Table2[[#This Row],[Risk Label]],2)","v":"EP"}]
["RR-4","Additional relocation or demolition required","No Impact",0,0,0,0,0,0,null,"No",null,null,null,null,null,null,null,null,null,{"$f":"ABS(Table2[[#This Row],[Mean Severity     (YOE $M)]])","v":0},{"$f":"LEFT(Table2[[#This Row],[Risk Label]],2)","v":"RR"}]
["RR-5","Additional ROW required for planned project","No Impact",0,0,0,0,0,0,null,"No",null,null,null,null,null,null,null,null,null,{"$f":"ABS(Table2[[#This Row],[Mean Severity     (YOE $M)]])","v":0},{"$f":"LEFT(Table2[[#This Row],[Risk Label]],2)","v":"RR"}]
["RR-9","Other utility relocations not completed on time","No Impact",0,0,0,0,0,0,null,"No",null,null,null,null,null,null,null,null,null,{"$f":"ABS(Table2[[#This Row],[Mean Severity     (YOE $M)]])","v":0},{"$f":"LEFT(Table2[[#This Row],[Risk Label]],2)","v":"RR"}]
["RR-10","Damage existing utility or encounter unanticipated utility during construction","No Impact",0,0,0,0,0,0,null,"No",null,null,null,null,null,null,null,null,null,{"$f":"ABS(Table2[[#This Row],[Mean Severity     (YOE $M)]])","v":0},{"$f":"LEFT(Table2[[#This Row],[Risk Label]],2)","v":"RR"}]
["PR-3","Material-supply issues","No Impact",0,0,0,0,0,0,null,"No",null,null,null,null,null,null,null,null,null,{"$f":"ABS(Table2[[#This Row],[Mean Severity     (YOE $M)]])","v":0},{"$f":"LEFT(Table2[[#This Row],[Risk Label]],2)","v":"PR"}]
["PR-4","Change in project delivery method","No Impact",0,0,0,0,0,0,null,"No",null,null,null,null,null,null,null,null,null,{"$f":"ABS(Table2[[#This Row],[Mean Severity     (YOE $M)]])","v":0},{"$f":"LEFT(Table2[[#This Row],[Risk Label]],2)","v":"PR"}]
["PR-5","Accelerate pre-construction activities to reach NTP sooner","No Impact",0,0,0,0,0,0,null,"No",null,null,null,null,null,null,null,null,null,{"$f":"ABS(Table2[[#This Row],[Mean Severity     (YOE $M)]])","v":0},{"$f":"LEFT(Table2[[#This Row],[Risk Label]],2)","v":"PR"}]
["PR-6","Use incentives to accelerate D/B construction","No Impact",0,0,0,0,0,0,null,"No",null,null,null,null,null,null,null,null,null,{"$f":"ABS(Table2[[#This Row],[Mean Severity     (YOE $M)]])","v":0},{"$f":"LEFT(Table2[[#This Row],[Risk Label]],2)","v":"PR"}]
["PR-7","Issues with D/B design or submittals","No Impact",0,0.75000000000000011,0,0,0,0,null,"No",null,null,null,null,null,null,null,null,null,{"$f":"ABS(Table2[[#This Row],[Mean Severity     (YOE $M)]])","v":0},{"$f":"LEFT(Table2[[#This Row],[Risk Label]],2)","v":"PR"}]
["CR-6","Severe weather event significantly impacts construction","No Impact",0,0,0,0,0,0,null,"No",null,null,null,null,null,null,null,null,null,{"$f":"ABS(Table2[[#This Row],[Mean Severity     (YOE $M)]])","v":0},{"$f":"LEFT(Table2[[#This Row],[Risk Label]],2)","v":"CR"}]
["CR-8","Significant accident during construction","No Impact",0,0,0,0,0,0,null,"No",null,null,null,null,null,null,null,null,null,{"$f":"ABS(Table2[[#This Row],[Mean Severity     (YOE $M)]])","v":0},{"$f":"LEFT(Table2[[#This Row],[Risk Label]],2)","v":"CR"}]
["CR-10","Fish window in Wandering Creek","No Impact",0,0,0,0,0,0,null,"No",null,null,null,null,null,null,null,null,null,{"$f":"ABS(Table2[[#This Row],[Mean Severity     (YOE $M)]])","v":0},{"$f":"LEFT(Table2[[#This Row],[Risk Label]],2)","v":"CR"}]
["CR-11","Non-compliance with permits during construction","No Impact",0,0,0,0,0,0,null,"No",null,null,null,null,null,null,null,null,null,{"$f":"ABS(Table2[[#This Row],[Mean Severity     (YOE $M)]])","v":0},{"$f":"LEFT(Table2[[#This Row],[Risk Label]],2)","v":"CR"}]
["CR-12","Extended overheads as a function of project delays","No Impact",0,0,0,0,0,0,null,"No",null,null,null,null,null,null,null,null,null,{"$f":"ABS(Table2[[#This Row],[Mean Severity     (YOE $M)]])","v":0},{"$f":"LEFT(Table2[[#This Row],[Risk Label]],2)","v":"CR"}]
[null,null,null,null,null,null,null,null,null,null,null,null,null,null,null,null,null,null,null,null,{"$f":"ABS(Table2[[#This Row],[Mean Severity     (YOE $M)]])","v":0},{"$f":"LEFT(Table2[[#This Row],[Risk Label]],2)","v":""}]
[null,null,null,null,null,null,null,null,null,null,null,null,null,null,null,null,null,null,null,null,{"$f":"ABS(Table2[[#This Row],[Mean Severity     (YOE $M)]])","v":0},{"$f":"LEFT(Table2[[#This Row],[Risk Label]],2)","v":""}]
[null,null,null,null,null,null,null,null,null,null,null,null,null,null,null,null,null,null,null,null,{"$f":"ABS(Table2[[#This Row],[Mean Severity     (YOE $M)]])","v":0},{"$f":"LEFT(Table2[[#This Row],[Risk Label]],2)","v":""}]
[null,null,null,null,null,null,null,null,null,null,null,null,null,null,null,null,null,null,null,null,{"$f":"ABS(Table2[[#This Row],[Mean Severity     (YOE $M)]])","v":0},{"$f":"LEFT(Table2[[#This Row],[Risk Label]],2)","v":""}]
[null,null,null,null,null,null,null,null,null,null,null,null,null,null,null,null,null,null,null,null,{"$f":"ABS(Table2[[#This Row],[Mean Severity     (YOE $M)]])","v":0},{"$f":"LEFT(Table2[[#This Row],[Risk Label]],2)","v":""}]
[null,null,null,null,null,null,null,null,null,null,null,null,null,null,null,null,null,null,null,null,{"$f":"ABS(Table2[[#This Row],[Mean Severity     (YOE $M)]])","v":0},{"$f":"LEFT(Table2[[#This Row],[Risk Label]],2)","v":""}]
[null,null,null,null,null,null,null,null,null,null,null,null,null,null,null,null,null,null,null,null,{"$f":"ABS(Table2[[#This Row],[Mean Severity     (YOE $M)]])","v":0},{"$f":"LEFT(Table2[[#This Row],[Risk Label]],2)","v":""}]
[null,null,null,null,null,null,null,null,null,null,null,null,null,null,null,null,null,null,null,null,{"$f":"ABS(Table2[[#This Row],[Mean Severity     (YOE $M)]])","v":0},{"$f":"LEFT(Table2[[#This Row],[Risk Label]],2)","v":""}]
[null,null,null,null,null,null,null,null,null,null,null,null,null,null,null,null,null,null,null,null,{"$f":"ABS(Table2[[#This Row],[Mean Severity     (YOE $M)]])","v":0},{"$f":"LEFT(Table2[[#This Row],[Risk Label]],2)","v":""}]
[null,null,null,null,null,null,null,null,null,null,null,null,null,null,null,null,null,null,null,null,{"$f":"ABS(Table2[[#This Row],[Mean Severity     (YOE $M)]])","v":0},{"$f":"LEFT(Table2[[#This Row],[Risk Label]],2)","v":""}]
[null,null,null,null,null,null,null,null,null,null,null,null,null,null,null,null,null,null,null,null,{"$f":"ABS(Table2[[#This Row],[Mean Severity     (YOE $M)]])","v":0},{"$f":"LEFT(Table2[[#This Row],[Risk Label]],2)","v":""}]
[null,null,null,null,null,null,null,null,null,null,null,null,null,null,null,null,null,null,null,null,{"$f":"ABS(Table2[[#This Row],[Mean Severity     (YOE $M)]])","v":0},{"$f":"LEFT(Table2[[#This Row],[Risk Label]],2)","v":""}]
[null,null,null,null,null,null,null,null,null,null,null,null,null,null,null,null,null,null,null,null,{"$f":"ABS(Table2[[#This Row],[Mean Severity     (YOE $M)]])","v":0},{"$f":"LEFT(Table2[[#This Row],[Risk Label]],2)","v":""}]
[null,null,null,null,null,null,null,null,null,null,null,null,null,null,null,null,null,null,null,null,{"$f":"ABS(Table2[[#This Row],[Mean Severity     (YOE $M)]])","v":0},{"$f":"LEFT(Table2[[#This Row],[Risk Label]],2)","v":""}]
[null,null,null,null,null,null,null,null,null,null,null,null,null,null,null,null,null,null,null,null,{"$f":"ABS(Table2[[#This Row],[Mean Severity     (YOE $M)]])","v":0},{"$f":"LEFT(Table2[[#This Row],[Risk Label]],2)","v":""}]
[null,null,null,null,null,null,null,null,null,null,null,null,null,null,null,null,null,null,null,null,{"$f":"ABS(Table2[[#This Row],[Mean Severity     (YOE $M)]])","v":0},{"$f":"LEFT(Table2[[#This Row],[Risk Label]],2)","v":""}]
[null,null,null,null,null,null,null,null,null,null,null,null,null,null,null,null,null,null,null,null,{"$f":"ABS(Table2[[#This Row],[Mean Severity     (YOE $M)]])","v":0},{"$f":"LEFT(Table2[[#This Row],[Risk Label]],2)","v":""}]
[null,null,null,null,null,null,null,null,null,null,null,null,null,null,null,null,null,null,null,null,{"$f":"ABS(Table2[[#This Row],[Mean Severity     (YOE $M)]])","v":0},{"$f":"LEFT(Table2[[#This Row],[Risk Label]],2)","v":""}]
[null,null,null,null,null,null,null,null,null,null,null,null,null,null,null,null,null,null,null,null,{"$f":"ABS(Table2[[#This Row],[Mean Severity     (YOE $M)]])","v":0},{"$f":"LEFT(Table2[[#This Row],[Risk Label]],2)","v":""}]
[null,null,null,null,null,null,null,null,null,null,null,null,null,null,null,null,null,null,null,null,{"$f":"ABS(Table2[[#This Row],[Mean Severity     (YOE $M)]])","v":0},{"$f":"LEFT(Table2[[#This Row],[Risk Label]],2)","v":""}]
[null,null,null,null,null,null,null,null,null,null,null,null,null,null,null,null,null,null,null,null,{"$f":"ABS(Table2[[#This Row],[Mean Severity     (YOE $M)]])","v":0},{"$f":"LEFT(Table2[[#This Row],[Risk Label]],2)","v":""}]
[null,null,null,null,null,null,null,null,null,null,null,null,null,null,null,null,null,null,null,null,{"$f":"ABS(Table2[[#This Row],[Mean Severity     (YOE $M)]])","v":0},{"$f":"LEFT(Table2[[#This Row],[Risk Label]],2)","v":""}]
[null,null,null,null,null,null,null,null,null,null,null,null,null,null,null,null,null,null,null,null,{"$f":"ABS(Table2[[#This Row],[Mean Severity     (YOE $M)]])","v":0},{"$f":"LEFT(Table2[[#This Row],[Risk Label]],2)","v":""}]
[null,null,null,null,null,null,null,null,null,null,null,null,null,null,null,null,null,null,null,null,{"$f":"ABS(Table2[[#This Row],[Mean Severity     (YOE $M)]])","v":0},{"$f":"LEFT(Table2[[#This Row],[Risk Label]],2)","v":""}]
[null,null,null,null,null,null,null,null,null,null,null,null,null,null,null,null,null,null,null,null,{"$f":"ABS(Table2[[#This Row],[Mean Severity     (YOE $M)]])","v":0},{"$f":"LEFT(Table2[[#This Row],[Risk Label]],2)","v":""}]
[null,null,null,null,null,null,null,null,null,null,null,null,null,null,null,null,null,null,null,null,{"$f":"ABS(Table2[[#This Row],[Mean Severity     (YOE $M)]])","v":0},{"$f":"LEFT(Table2[[#This Row],[Risk Label]],2)","v":""}]
[null,null,null,null,null,null,null,null,null,null,null,null,null,null,null,null,null,null,null,null,{"$f":"ABS(Table2[[#This Row],[Mean Severity     (YOE $M)]])","v":0},{"$f":"LEFT(Table2[[#This Row],[Risk Label]],2)","v":""}]
[null,null,null,null,null,null,null,null,null,null,null,null,null,null,null,null,null,null,null,null,{"$f":"ABS(Table2[[#This Row],[Mean Severity     (YOE $M)]])","v":0},{"$f":"LEFT(Table2[[#This Row],[Risk Label]],2)","v":""}]
[null,null,null,null,null,null,null,null,null,null,null,null,null,null,null,null,null,null,null,null,{"$f":"ABS(Table2[[#This Row],[Mean Severity     (YOE $M)]])","v":0},{"$f":"LEFT(Table2[[#This Row],[Risk Label]],2)","v":""}]
[null,null,null,null,null,null,null,null,null,null,null,null,null,null,null,null,null,null,null,null,{"$f":"ABS(Table2[[#This Row],[Mean Severity     (YOE $M)]])","v":0},{"$f":"LEFT(Table2[[#This Row],[Risk Label]],2)","v":""}]
[null,null,null,null,null,null,null,null,null,null,null,null,null,null,null,null,null,null,null,null,{"$f":"ABS(Table2[[#This Row],[Mean Severity     (YOE $M)]])","v":0},{"$f":"LEFT(Table2[[#This Row],[Risk Label]],2)","v":""}]
[null,null,null,null,null,null,null,null,null,null,null,null,null,null,null,null,null,null,null,null,{"$f":"ABS(Table2[[#This Row],[Mean Severity     (YOE $M)]])","v":0},{"$f":"LEFT(Table2[[#This Row],[Risk Label]],2)","v":""}]
[null,null,null,null,null,null,null,null,null,null,null,null,null,null,null,null,null,null,null,null,{"$f":"ABS(Table2[[#This Row],[Mean Severity     (YOE $M)]])","v":0},{"$f":"LEFT(Table2[[#This Row],[Risk Label]],2)","v":""}]
[null,null,null,null,null,null,null,null,null,null,null,null,null,null,null,null,null,null,null,null,{"$f":"ABS(Table2[[#This Row],[Mean Severity     (YOE $M)]])","v":0},{"$f":"LEFT(Table2[[#This Row],[Risk Label]],2)","v":""}]
[null,null,null,null,null,null,null,null,null,null,null,null,null,null,null,null,null,null,null,null,{"$f":"ABS(Table2[[#This Row],[Mean Severity     (YOE $M)]])","v":0},{"$f":"LEFT(Table2[[#This Row],[Risk Label]],2)","v":""}]
[null,null,null,null,null,null,null,null,null,null,null,null,null,null,null,null,null,null,null,null,{"$f":"ABS(Table2[[#This Row],[Mean Severity     (YOE $M)]])","v":0},{"$f":"LEFT(Table2[[#This Row],[Risk Label]],2)","v":""}]
[null,null,null,null,null,null,null,null,null,null,null,null,null,null,null,null,null,null,null,null,{"$f":"ABS(Table2[[#This Row],[Mean Severity     (YOE $M)]])","v":0},{"$f":"LEFT(Table2[[#This Row],[Risk Label]],2)","v":""}]
[null,null,null,null,null,null,null,null,null,null,null,null,null,null,null,null,null,null,null,null,{"$f":"ABS(Table2[[#This Row],[Mean Severity     (YOE $M)]])","v":0},{"$f":"LEFT(Table2[[#This Row],[Risk Label]],2)","v":""}]
[null,null,null,null,null,null,null,null,null,null,null,null,null,null,null,null,null,null,null,null,{"$f":"ABS(Table2[[#This Row],[Mean Severity     (YOE $M)]])","v":0},{"$f":"LEFT(Table2[[#This Row],[Risk Label]],2)","v":""}]
[null,null,null,null,null,null,null,null,null,null,null,null,null,null,null,null,null,null,null,null,{"$f":"ABS(Table2[[#This Row],[Mean Severity     (YOE $M)]])","v":0},{"$f":"LEFT(Table2[[#This Row],[Risk Label]],2)","v":""}]
[null,null,null,null,null,null,null,null,null,null,null,null,null,null,null,null,null,null,null,null,{"$f":"ABS(Table2[[#This Row],[Mean Severity     (YOE $M)]])","v":0},{"$f":"LEFT(Table2[[#This Row],[Risk Label]],2)","v":""}]

{"sheet":"6 - Unmit. Project Performance","index":7,"n_rows":40,"n_cols":14,"rows_kept":40,"cut":false,"hidden":false,"merged":[]}
[null,null,null,"SHRP2 Risk Management Template"]
["HELP",null,null,"Step 06 - Unmitigated Project Performance"]
[null,"Schedule Duration Assumption:"]
[null,"Some risks in a phase will occur concurrently, while others will occur sequentially."]
[]
["Unmitigated Project Cost, Duration, and Disruption Performance"]
["Project Phase","Base",null,null,null,"Risk",null,null,"Total (Base + Risk)"]
[null,"Cost \n(CY $M)","Duration (months)","Disruption   (M-hrs)","Cost \n(CY $M)","Duration (months)","Disruption \n(M-hrs)","Cost \n(CY $M)","Duration (months)","Disruption   (M-hrs)","Cost \n(YOE $M)"]
["Planning",null,0,0,0,0,0,0,0,0]
["Scoping",null,0,0,0,0,0,0,0,0,0]
["Prelim Design/Environmental Process",1.19,12,0,0.13125000000000001,1.46875,0,1.32125,13.46875,0,1.3433226831215848]
["Environmental Permits",null,6,0,0,0.3125,0,0,6.3125,0,0]
["ROW/Util/RR",3,12,0.2,2.6250000000000004,1.125,0,5.625,13.125,0.2,5.9091488593201751]
["Final Design",null,6,0,0,0.75000000000000011,0,0,6.75,0,0]
["Procurement",null,6,0,0.25937499999997132,0.2890625,0,0.25937499999997132,6.2890625,0,0.27047377694869845]
["Construction",11.85,16,0.5,2.5210546874999871,0.85468750000000004,2.5000000000000022E-3,14.371054687499987,16.854687500000001,0.50249999999999995,15.47265000262917]
["Operations & Maintenance",0,600,1.4000000000000001,0,0,0,0,600,1.4000000000000001,0]
["Replacement",0,0,0.7,0,null,0,0,0,0.7]
["Total",16.04,null,2.8,5.5366796874999586,null,2.5000000000000022E-3,21.576679687499958,null,2.8025000000000002,22.995595322019629]
[]
[]
["Project Schedule Performance (Base vs. Unmitigated)"]
["Project Phase",null,null,"Base Project Schedule Performance",null,null,null,null,null,"Unmitigated Project Schedule Performance",null,null,null,"Mean "]
[null,"Duration\n(Months/Date)","Early Start","Early Finish","Late Start","Late Finish","Float (months)","Duration\n(Months / Date)","Early Start","Early Finish","Late Start","Late Finish","Float (months)","Severity YOE ($M)"]
["Planning",0,{"$f":"'1 - Project Structuring'!$E$15","v":40148},{"$f":"IF(OR(C25=\"\",B25=\"\"),\"\",C25+(B25*30.4))","v":40148},{"$f":"IF(OR(F25=\"\",B25=\"\"),\"\",F25-(B25*30.4))","v":40148},{"$f":"IF(E26 = \"\", \"\",E26)","v":40148},{"$f":"IF(OR(F25 =\"\",D25 =\"\"),\"\",(F25-D25)/30.4)","v":0},0,{"$f":"'1 - Project Structuring'!$E$15","v":40148},{"$f":"IF(OR(I25=\"\",H25=\"\"),\"\",I25+(H25*30.4))","v":40148},{"$f":"IF(OR(L25=\"\",H25=\"\"),\"\",L25-(H25*30.4))","v":40148},{"$f":"IF(K26 = \"\", \"\",K26)","v":40148},{"$f":"IF(OR(L25 =\"\",J25 =\"\"),\"\",(L25-J25)/30.4)","v":0},{"$f":"SUMIFS('5 - Unmit. Risk Register'!$H$5:$H$104,'5 - Unmit. Risk Register'!$V$5:$V$104,\"PL\")","v":1.3358515012435471E-2}]
["Scoping",0,{"$f":"IF(D25=\"\",\"\",D25)","v":40148},{"$f":"IF(OR(C26=\"\",B26=\"\"),\"\",C26+(B26*30.4))","v":40148},{"$f":"IF(OR(F26=\"\",B26=\"\"),\"\",F26-(B26*30.4))","v":40148},{"$f":"IF(E28 = \"\", \"\",E28)","v":40148},{"$f":"IF(OR(F26 =\"\",D26 =\"\"),\"\",(F26-D26)/30.4)","v":0},0,{"$f":"IF(J25=\"\",\"\",J25)","v":40148},{"$f":"IF(OR(I26=\"\",H26=\"\"),\"\",I26+(H26*30.4))","v":40148},{"$f":"IF(OR(L26=\"\",H26=\"\"),\"\",L26-(H26*30.4))","v":40148},{"$f":"IF(K28 = \"\", \"\",K28)","v":40148},{"$f":"IF(OR(L26 =\"\",J26 =\"\"),\"\",(L26-J26)/30.4)","v":0},{"$f":"SUMIFS('5 - Unmit. Risk Register'!$H$5:$H$104,'5 - Unmit. Risk Register'!$V$5:$V$104,\"SC\")","v":0.88765708065301974}]
["Design Funding Date",40148,null,{"$f":"IF(B27 =\"\", \"\",B27)","v":40148},null,{"$f":"IF(E28 = \"\", \"\",E28)","v":40148},0,40148,null,{"$f":"IF(H27 =\"\", \"\",H27)","v":40148},null,{"$f":"IF(K28 = \"\", \"\",K28)","v":40148},0,{"$f":"SUMIFS('5 - Unmit. Risk Register'!$H$5:$H$104,'5 - Unmit. Risk Register'!$V$5:$V$104,\"F1\")","v":0}]
["Prelim Design/Environmental Process",12,{"$f":"IF(OR(D27=\"\",D26=\"\"),\"\",MAX(D27,D26))","v":40148},{"$f":"IF(OR(C28=\"\",B28=\"\"),\"\",C28+(B28*30.4))","v":40512.800000000003},{"$f":"IF(OR(F28=\"\",B28=\"\"),\"\",F28-(B28*30.4))","v":40148},{"$f":"IF(OR(E29=\"\",E31=\"\",E33=\"\"),\"\",MIN(E29,E31,E33))","v":40512.800000000003},0,13.46875,{"$f":"IF(OR(J27=\"\",J26=\"\"),\"\",MAX(J27,J26))","v":40148},{"$f":"IF(OR(I28=\"\",H28=\"\"),\"\",I28+(H28*30.4))","v":40557.449999999997},{"$f":"IF(OR(L28=\"\",H28=\"\"),\"\",L28-(H28*30.4))","v":40148},{"$f":"IF(OR(K29=\"\",K31=\"\",K33=\"\"),\"\",MIN(K29,K31,K33))","v":40557.449999999997},0,{"$f":"SUMIFS('5 - Unmit. Risk Register'!$H$5:$H$104,'5 - Unmit. Risk Register'!$V$5:$V$104,\"PD\")","v":1.3676732168428556}]
["Environmental Permits",6,{"$f":"IF(D28=\"\",\"\",D28)","v":40512.800000000003},{"$f":"IF(OR(C29=\"\",B29=\"\"),\"\",C29+(B29*30.4))","v":40695.200000000004},{"$f":"IF(OR(F29=\"\",B29=\"\"),\"\",F29-(B29*30.4))","v":40512.800000000003},{"$f":"IF(OR(E35=\"\",F33=\"\",F31=\"\"),\"\",MIN(E35,F33-('1 - Project Structuring'!$J$39*30.4)+('1 - Project Structuring'!$J$38*30.4),F31-('1 - Project Structuring'!$J$41*30.4)+('1 - Project Structuring'!$J$40*30.4)))","v":40695.200000000004},0,6.3125,{"$f":"IF(J28=\"\",\"\",J28)","v":40557.449999999997},{"$f":"IF(OR(I29=\"\",H29=\"\"),\"\",I29+(H29*30.4))","v":40749.35},{"$f":"IF(OR(L29=\"\",H29=\"\"),\"\",L29-(H29*30.4))","v":40582.149999999994},{"$f":"IF(OR(K35=\"\",L33=\"\",L31=\"\"),\"\",MIN(K35,L33-('1 - Project Structuring'!$J$39*30.4)+('1 - Project Structuring'!$J$38*30.4),L31-('1 - Project Structuring'!$J$41*30.4)+('1 - Project Structuring'!$J$40*30.4)))","v":40774.049999999996},0.8124999999999043,{"$f":"SUMIFS('5 - Unmit. Risk Register'!$H$5:$H$104,'5 - Unmit. Risk Register'!$V$5:$V$104,\"EP\")","v":7.3451630977436261E-2}]
["ROW/Util/RR Funding Date",40148,null,{"$f":"IF(B30=\"\",\"\",B30)","v":40148},null,{"$f":"IF(OR(F31=\"\"),\"\",F31-('1 - Project Structuring'!$J$42*30.4))","v":40877.600000000006},24.000000000000192,40148,null,{"$f":"IF(H30=\"\",\"\",H30)","v":40148},null,{"$f":"IF(OR(L31=\"\"),\"\",L31-('1 - Project Structuring'!$J$42*30.4))","v":40956.449999999997},26.593749999999904,{"$f":"SUMIFS('5 - Unmit. Risk Register'!$H$5:$H$104,'5 - Unmit. Risk Register'!$V$5:$V$104,\"F2\")","v":0}]
["ROW/Util/RR",12,{"$f":"IF(D28=\"\",\"\",D28)","v":40512.800000000003},{"$f":"IF(OR(C31=\"\",B31=\"\",D30=\"\"),\"\",MAX(C31+(B31*30.4),D30+('1 - Project Structuring'!$J$42*30.4),D29-('1 - Project Structuring'!$J$40*30.4)+('1 - Project Structuring'!$J$41*30.4)))","v":40877.600000000006},{"$f":"IF(OR(F31=\"\",B31=\"\"),\"\",F31-(B31*30.4))","v":40512.800000000003},{"$f":"IF(OR(E35=\"\",F35=\"\"),\"\",MIN(E35+('1 - Project Structuring'!$J$43*30.4),F35-('1 - Project Structuring'!$J$46*30.4),F33-('1 - Project Structuring'!$J$48*30.4)+('1 - Project Structuring'!$J$47*30.4)))","v":40877.600000000006},0,13.125,{"$f":"IF(J28=\"\",\"\",J28)","v":40557.449999999997},{"$f":"IF(OR(I31=\"\",H31=\"\",J30=\"\"),\"\",MAX(I31+(H31*30.4),J30+('1 - Project Structuring'!$J$42*30.4),J29-('1 - Project Structuring'!$J$40*30.4)+('1 - Project Structuring'!$J$41*30.4)))","v":40956.449999999997},{"$f":"IF(OR(L31=\"\",H31=\"\"),\"\",L31-(H31*30.4))","v":40557.449999999997},{"$f":"IF(OR(K35=\"\",L35=\"\"),\"\",MIN(K35+('1 - Project Structuring'!$J$43*30.4),L35-('1 - Project Structuring'!$J$46*30.4),L33-('1 - Project Structuring'!$J$48*30.4)+('1 - Project Structuring'!$J$47*30.4)))","v":40956.449999999997},0,{"$f":"SUMIFS('5 - Unmit. Risk Register'!$H$5:$H$104,'5 - Unmit. Risk Register'!$V$5:$V$104,\"RR\")","v":2.4782631230718697}]
["Construction Funding Date",40148,null,{"$f":"IF(B32=\"\",\"\",B32)","v":40148},null,{"$f":"IF(E33=\"\",\"\",E33)","v":40512.800000000003},12.000000000000096,40148,null,{"$f":"IF(H32=\"\",\"\",H32)","v":40148},null,{"$f":"IF(K33=\"\",\"\",K33)","v":40582.862499999996},14.304687499999858,{"$f":"SUMIFS('5 - Unmit. Risk Register'!$H$5:$H$104,'5 - Unmit. Risk Register'!$V$5:$V$104,\"F3\")","v":0}]
["Procurement",6,{"$f":"IF(OR(D32=\"\",D28=\"\"),\"\",MAX(D32,D28))","v":40512.800000000003},{"$f":"IF(OR(C33=\"\",B33=\"\",D29=\"\",D31=\"\"),\"\",MAX(C33+(B33*30.4),D29-('1 - Project Structuring'!$J$38*30.4)+('1 - Project Structuring'!$J$39*30.4),D31-('1 - Project Structuring'!$J$47*30.4)+('1 - Project Structuring'!$J$48*30.4)))","v":40695.200000000004},{"$f":"IF(OR(F33=\"\",B33=\"\"),\"\",F33-(B33*30.4))","v":40512.800000000003},{"$f":"IF(E34=\"\",\"\",E34)","v":40695.200000000004},0,6.2890625,{"$f":"IF(OR(J32=\"\",J28=\"\"),\"\",MAX(J32,J28))","v":40557.449999999997},{"$f":"IF(OR(I33=\"\",H33=\"\",J29=\"\",J31=\"\"),\"\",MAX(I33+(H33*30.4),J29-('1 - Project Structuring'!$J$38*30.4)+('1 - Project Structuring'!$J$39*30.4),J31-('1 - Project Structuring'!$J$47*30.4)+('1 - Project Structuring'!$J$48*30.4)))","v":40774.049999999996},{"$f":"IF(OR(L33=\"\",H33=\"\"),\"\",L33-(H33*30.4))","v":40582.862499999996},{"$f":"IF(K34=\"\",\"\",K34)","v":40774.049999999996},0,{"$f":"SUMIFS('5 - Unmit. Risk Register'!$H$5:$H$104,'5 - Unmit. Risk Register'!$V$5:$V$104,\"PR\")","v":1.0108744292416232}]
["Final Design",6,{"$f":"IF(D33=\"\",\"\",D33)","v":40695.200000000004},{"$f":"IF(OR(C34=\"\",B34=\"\"),\"\",C34+(B34*30.4))","v":40877.600000000006},{"$f":"IF(OR(F34=\"\",B34=\"\",E35=\"\"),\"\",MIN(F34-(B34*30.4),E35-('1 - Project Structuring'!$J$44*30.4)))","v":40695.200000000004},{"$f":"IF(OR(F35=\"\"),\"\",F35-('1 - Project Structuring'!$J$45*30.4))","v":41029.600000000006},5,6.75,{"$f":"IF(J33=\"\",\"\",J33)","v":40774.049999999996},{"$f":"IF(OR(I34=\"\",H34=\"\"),\"\",I34+(H34*30.4))","v":40979.249999999993},{"$f":"IF(OR(L34=\"\",H34=\"\",K35=\"\"),\"\",MIN(L34-(H34*30.4),K35-('1 - Project Structuring'!$J$44*30.4)))","v":40774.049999999996},{"$f":"IF(OR(L35=\"\"),\"\",L35-('1 - Project Structuring'!$J$45*30.4))","v":41134.432499999995},5.104687500000086,{"$f":"SUMIFS('5 - Unmit. Risk Register'!$H$5:$H$104,'5 - Unmit. Risk Register'!$V$5:$V$104,\"FD\")","v":0}]
["Construction",16,{"$f":"IF(OR(D29=\"\",C34=\"\",,D31=\"\"),\"\",MAX(D29,C34+('1 - Project Structuring'!$J$44*30.4),D31-('1 - Project Structuring'!$J$43*30.4)))","v":40725.600000000006},{"$f":"IF(OR(C35=\"\",B35=\"\",D34=\"\",D31=\"\"),\"\",MAX(C35+(B35*30.4),D34+('1 - Project Structuring'!$J$45*30.4),D31+('1 - Project Structuring'!$J$46*30.4)))","v":41212.000000000007},{"$f":"IF(OR(F35=\"\",B35=\"\"),\"\",F35-(B35*30.4))","v":40725.600000000006},{"$f":"IF(D35=\"\",\"\",D35)","v":41212.000000000007},0,16.854687500000001,{"$f":"IF(OR(J29=\"\",I34=\"\",,J31=\"\"),\"\",MAX(J29,I34+('1 - Project Structuring'!$J$44*30.4),J31-('1 - Project Structuring'!$J$43*30.4)))","v":40804.449999999997},{"$f":"IF(OR(I35=\"\",H35=\"\",J34=\"\",J31=\"\"),\"\",MAX(I35+(H35*30.4),J34+('1 - Project Structuring'!$J$45*30.4),J31+('1 - Project Structuring'!$J$46*30.4)))","v":41316.832499999997},{"$f":"IF(OR(L35=\"\",H35=\"\"),\"\",L35-(H35*30.4))","v":40804.449999999997},{"$f":"IF(J35=\"\",\"\",J35)","v":41316.832499999997},0,{"$f":"SUMIFS('5 - Unmit. Risk Register'!$H$5:$H$104,'5 - Unmit. Risk Register'!$V$5:$V$104,\"CR\")","v":0.90954715361276117}]
["Operations & Maintenance",600,{"$f":"IF(OR(C35=\"\",B35=\"\"),\"\",C35+(B35*30.4))","v":41212.000000000007},{"$f":"IF(OR(C36=\"\",B36=\"\"),\"\",C36+(B36*30.4))","v":59452.000000000007},{"$f":"IF(OR(F36=\"\",B36=\"\"),\"\",F36-(B36*30.4))","v":41212.000000000007},{"$f":"IF(E37=\"\",\"\",E37)","v":59452.000000000007},null,600,{"$f":"IF(OR(I35=\"\",H35=\"\"),\"\",I35+(H35*30.4))","v":41316.832499999997},{"$f":"IF(OR(I36=\"\",H36=\"\"),\"\",I36+(H36*30.4))","v":59556.832499999997},{"$f":"IF(OR(L36=\"\",H36=\"\"),\"\",L36-(H36*30.4))","v":41316.832499999997},{"$f":"IF(K37=\"\",\"\",K37)","v":59556.832499999997}]
["Replacement",0,{"$f":"IF(D36=\"\",\"\",D36)","v":59452.000000000007},{"$f":"IF(OR(C37=\"\",B37=\"\"),\"\",C37+(B37*30.4))","v":59452.000000000007},{"$f":"IF(OR(F37=\"\",B37=\"\"),\"\",F37-(B37*30.4))","v":59452.000000000007},{"$f":"IF(D37=\"\",\"\",D37)","v":59452.000000000007},null,0,{"$f":"IF(J36=\"\",\"\",J36)","v":59556.832499999997},{"$f":"IF(OR(I37=\"\",H37=\"\"),\"\",I37+(H37*30.4))","v":59556.832499999997},{"$f":"IF(OR(L37=\"\",H37=\"\"),\"\",L37-(H37*30.4))","v":59556.832499999997},{"$f":"IF(J37=\"\",\"\",J37)","v":59556.832499999997}]
["Project Start Date",40148,null,null,null,null,null,40148,null,null,null,null,"Total",{"$f":"SUM('6 - Unmit. Project Performance'!$N$25:$N$37)","v":6.7408251494120019}]
["Construction Finish Date",41212.000000000007,null,null,null,null,null,41316.832499999997]
["Project Duration (months)",35.000000000000242,null,null,null,null,null,38.448437499999898]

{"sheet":"7 - Unmit. Risk Ranking Plots","index":8,"n_rows":2,"n_cols":13,"rows_kept":2,"cut":false,"hidden":false,"merged":[]}
[null,null,null,null,null,null,null,null,null,null,null,null,"SHRP2 Risk Management Template"]
["HELP",null,null,null,null,null,null,null,null,null,null,null,"Step 07 - Unmitigated Risk Ranking Plots"]

{"sheet":"8 - Risk Mitigation Strategies","index":9,"n_rows":976,"n_cols":45,"rows_kept":976,"cut":false,"hidden":false,"merged":[]}
[null,null,null,null,null,"SHRP2 Risk Management Template"]
["HELP",null,null,null,null,"Step 08 - Risk Mitigation Strategies"]
[]
[]
[]
["Risk Mitigation Label","Risk Mitigation Actions",null,"Implementation Needs of Risk Mitigation Actions",null,null,null,null,null,null,null,null,"Consequences of Risk Mitigation Actions",null,null,null,"Effectiveness of Risk Mitigation Actions",null,null,null,null,null,"Mitigated Severity",null,null,null,"Risk Mitigation Consequences Performance ",null,null,null,null,null,"Unmitigated Severity"]
[null,null,"Cost",null,"Schedule",null,"Disruption",null,"New ","Probability",null,null,"Percentage Mitigated, if implemented"]
[null,null,"Mean \nCost \n(CY $M)","Affected \nPhase","Mean Duration (months)","Affected\nPhase","Mean \nDisruption \n(M-Hr)","Affected Phase","Adjectival  (VL, L, M, H, VH)","Numerical","Cost (%)","Mean Cost (CY $M)","Duration (%)","Mean Duration (months)","Disruption (%)","Mean Disruption (M-Hr)","Mitigated\nSeverity (%)","Benefit/Cost Ratio","Action Selected",null,"Mean Cost Change (YOE $M)","Mean Duration Change (YOE $M)","Mean Disruption Change (YOE $M)","Mean Change to Crit. Path (YOE $M)","Mean Severity  (YOE $M)","Cost \n(CY $M)","Duration\n(Months)","Disruption\n(M-Hr)","Mean change to critical path ","Mean Severity (YOE $M)","Mean Cost Change (YOE $M)","Mean Duration Change (YOE $M)","Mean Disruption Change (YOE $M)","Mean Change to Crit. Path (YOE $M)","Mean Severity  (YOE $M)"]
[]
[]
["SC-6","Provide new lighting throughout project."]
["SC-6_1","Do Nothing",null,null,null,null,null,null,null,0.55000000000000004,0,"1.05",0,"0",0,"0",null,null,"No",null,null,null,null,null,null,null,null,null,null,null,null,null,null,null,0.61716339357451899]
["SC-6_2","Negotiate cost sharing agreement with the city",0,"Construction",0,"Construction",0,"Construction",null,0.55000000000000004,50,0.28875000000000006,null,0,null,0,50.000000000000007,"No Cost","Yes",null,0,0,0,0,0,null,null,null,null,null,0.30858169678725944,0,0,0,0.30858169678725944,0,0,0,0,0,0.28875000000000006,0,0,0,0.30858169678725944]
["SC-6_3",null,null,null,null,null,null,null,null,null,null,null,null,null,null,null,null,null,"No"]
["SC-6_4",null,null,null,null,null,null,null,null,null,null,null,null,null,null,null,null,null,"No"]
["SC-6_5",null,null,null,null,null,null,null,null,null,null,null,null,null,null,null,null,null,"No"]
[]
["RR-3","Unwilling sellers"]
["RR-3_1","Do Nothing",null,null,null,null,null,null,null,0.55000000000000004,0,"1.05",0,"0",0,"0",null,null,"No",null,null,null,null,null,null,null,null,null,null,null,null,null,null,null,0.60364846664440197]
["RR-3_2","Make reasonable early offer",0.05,"ROW/Util/RR",0,"ROW/Util/RR",0,"ROW/Util/RR",null,0.27500000000000002,null,0.28875000000000006,null,0,null,0,49.999999999999964,5.7749999999999924,"Yes",null,5.2263936506008857E-2,0,0,0,5.2263936506008857E-2,null,null,null,null,null,0.30182423332220121,0,0,0,0.30182423332220121,0.05,0,0,0,5.2263936506008857E-2,0.28875000000000006,0,0,0,0.30182423332220121]
["RR-3_3",null,null,null,null,null,null,null,null,null,null,null,null,null,null,null,null,null,"No"]
["RR-3_4",null,null,null,null,null,null,null,null,null,null,null,null,null,null,null,null,null,"No"]
["RR-3_5",null,null,null,null,null,null,null,null,null,null,null,null,null,null,null,null,null,"No"]
[]
["CR-2","Additional Maintenance of Traffic required"]
["CR-2_1","Do Nothing",null,null,null,null,null,null,null,0.55000000000000004,0,"0.35",0,"0.125",0,"0.05",null,null,"No",null,null,null,null,null,null,null,null,null,null,null,null,null,null,null,0.50630970876113701]
["CR-2_2","Reduce traffic demand during closures",0.05,"Final Design",0,"Final Design",0,"Construction",null,0.27500000000000002,null,9.6250000000000002E-2,null,3.4375000000000003E-2,67,4.5374999999999999E-3,68.197252483819398,6.558064198481226,"Yes",null,5.2651102518009564E-2,0,0,0,5.2651102518009564E-2,null,null,null,null,null,0.10286056559575313,1.0810516609591758E-3,4.5374999999999999E-2,8.2662810705071959E-3,0.16102039832721377,0.05,0,0,0,5.2651102518009564E-2,9.6250000000000002E-2,3.4375000000000003E-2,4.5374999999999999E-3,3.4374999999942563E-2,0.16102039832721377]
["CR-2_3",null,null,null,null,null,null,null,null,null,null,null,null,null,null,null,null,null,"No"]
["CR-2_4",null,null,null,null,null,null,null,null,null,null,null,null,null,null,null,null,null,"No"]
["CR-2_5",null,null,null,null,null,null,null,null,null,null,null,null,null,null,null,null,null,"No"]
[]
["RR-2","Accelerating pace of development in interchange area"]
["RR-2_1","Do Nothing",null,null,null,null,null,null,null,0.3,0,"1.05",0,"2.5",0,"0",null,null,"No",null,null,null,null,null,null,null,null,null,null,null,null,null,null,null,0.51205073247056598]
["RR-2_2","Coordinate with City - stop issuing permits for new develoipments",0,"ROW/Util/RR",0,"ROW/Util/RR",0,"ROW/Util/RR",null,0.15,null,0.1575,null,0.375,null,0,50.038086249136185,"No Cost","Yes",null,0,0,0,0,0,null,null,null,null,null,0.1646313999939279,3.0500918874825089E-3,0,5.0648853436219402E-2,0.25583034531761062,0,0,0,0,0,0.1575,0.375,0,0.37499999999980854,0.25583034531761062]
["RR-2_3",null,null,null,null,null,null,null,null,null,null,null,null,null,null,null,null,null,"No"]
["RR-2_4",null,null,null,null,null,null,null,null,null,null,null,null,null,null,null,null,null,"No"]
["RR-2_5",null,null,null,null,null,null,null,null,null,null,null,null,null,null,null,null,null,"No"]
[]
["PD-11","Cannot use City sewer system for project runoff (or City charges for use)."]
["PD-11_1","Do Nothing",null,null,null,null,null,null,null,0.3,0,"1.05",0,"0.625",0,"0",null,null,"No",null,null,null,null,null,null,null,null,null,null,null,null,null,null,null,0.374927631210065]
["PD-11_2","Same action as RR8 (affects RR8 and PD11)",0,"Final Design",0,"Final Design",0,"Final Design",null,0.15,null,0.1575,null,9.375E-2,null,0,50.010855345384769,"No Cost","Yes",null,0,0,0,0,0,null,null,null,null,null,0.1646313999939279,7.6225886018566058E-4,0,1.2654457061612934E-2,0.18742311591572172,0,0,0,0,0,0.1575,9.375E-2,0,9.3749999999952136E-2,0.18742311591572172]
["PD-11_3",null,null,null,null,null,null,null,null,null,null,null,null,null,null,null,null,null,"No"]
["PD-11_4",null,null,null,null,null,null,null,null,null,null,null,null,null,null,null,null,null,"No"]
["PD-11_5",null,null,null,null,null,null,null,null,null,null,null,null,null,null,null,null,null,"No"]
[]
["RR-8","QDOT helps City pay for water and sewer-line relocation"]
["RR-8_1","Do Nothing",null,null,null,null,null,null,null,0.55000000000000004,0,"1.05",0,"0",0,"0",null,null,"No",null,null,null,null,null,null,null,null,null,null,null,null,null,null,null,0.60364846664440197]
["RR-8_2","Decide to help City pay for water and sewer line relocation",0,"Construction",0,"Construction",0,"Construction",null,0.86499999999999999,null,0.90825,null,0,null,0,-57.272727272727359,"No Cost","Yes",null,0,0,0,0,0,null,null,null,null,null,0.94937440663165085,0,0,0,0.94937440663165085,0,0,0,0,0,0.90825,0,0,0,0.94937440663165085]
["RR-8_3",null,null,null,null,null,null,null,null,null,null,null,null,null,null,null,null,null,"No"]
["RR-8_4",null,null,null,null,null,null,null,null,null,null,null,null,null,null,null,null,null,"No"]
["RR-8_5",null,null,null,null,null,null,null,null,null,null,null,null,null,null,null,null,null,"No"]
[]
["CR-4","Unable to construct interchange embankments as rapidly as assumed"]
["CR-4_1","Do Nothing",null,null,null,null,null,null,null,0.3,0,"0.35",0,"2.5",0,"0",null,null,"No",null,null,null,null,null,null,null,null,null,null,null,null,null,null,null,0.39150962528795702]
["CR-4_2","Conduct additional investigations and analysis to ddevelop alt techniques",0.1,"Final Design",0,"Final Design",0,"Construction",null,0.15,null,5.2499999999999998E-2,null,0.375,null,0,50.035940820774108,1.8603174012330477,"Yes",null,0.10530220503601913,0,0,0,0.10530220503601913,null,null,null,null,null,5.6105763052228974E-2,1.1755031864090881E-2,0,9.0253305954915694E-2,0.19561410087124037,0.1,0,0,0,0.10530220503601913,5.2499999999999998E-2,0.375,0,0.37500000000004791,0.19561410087124037]
["CR-4_3",null,null,null,null,null,null,null,null,null,null,null,null,null,null,null,null,null,"No"]
["CR-4_4",null,null,null,null,null,null,null,null,null,null,null,null,null,null,null,null,null,"No"]
["CR-4_5",null,null,null,null,null,null,null,null,null,null,null,null,null,null,null,null,null,"No"]
[]
["CR-3","Problems with planned accelerated bridge construction (ABC) technique"]
["CR-3_1","Do Nothing",null,null,null,null,null,null,null,0.55000000000000004,0,"0.35",0,"0.625",0,"0",null,null,"No",null,null,null,null,null,null,null,null,null,null,null,null,null,null,null,0.33372372970696401]
["CR-3_2","Pre-qualify contractors + require development of ABC technique",0.05,"Final Design",0,"Final Design",0,"Construction",null,0.27500000000000002,null,9.6250000000000002E-2,null,0.171875,null,0,50.01864387141525,3.1703815474601611,"Yes",null,5.2651102518009564E-2,0,0,0,5.2651102518009564E-2,null,null,null,null,null,0.10286056559575313,5.4061737870014781E-3,0,4.134540644768344E-2,0.16679964583043327,0.05,0,0,0,5.2651102518009564E-2,9.6250000000000002E-2,0.171875,0,0.17187499999995215,0.16679964583043327]
["CR-3_3",null,null,null,null,null,null,null,null,null,null,null,null,null,null,null,null,null,"No",null,null,null,null,null,null,null,null,null,null,null,null,null,null,null,null,0.05,0,0,0,5.3434060049741883E-2,0.1925,0.34375,0,0.3437499999999043,0.33556208146191713]
["CR-3_4",null,null,null,null,null,null,null,null,null,null,null,null,null,null,null,null,null,"No"]
["CR-3_5",null,null,null,null,null,null,null,null,null,null,null,null,null,null,null,null,null,"No"]
[]
[]
[]
[]
[null,null,null,null,null,null,null,null,null,null,null,null,null,null,null,null,null,null,null,null,{"$f":"IF(K70, K70,\"\")","v":""},{"$f":"IF(M70, M70,\"\")","v":""},{"$f":"IF(O70, O70,\"\")","v":""}]
[null,null,null,null,null,null,null,null,null,null,null,null,null,null,null,null,null,null,null,null,"","",""]
[null,null,null,null,null,null,null,null,null,null,null,null,null,null,null,null,null,null,null,null,"","",""]
[null,null,null,null,null,null,null,null,null,null,null,null,null,null,null,null,null,null,null,null,"","",""]
[null,null,null,null,null,null,null,null,null,null,null,null,null,null,null,null,null,null,null,null,"","",""]
[null,null,null,null,null,null,null,null,null,null,null,null,null,null,null,null,null,null,null,null,"","",""]
[null,null,null,null,null,null,null,null,null,null,null,null,null,null,null,null,null,null,null,null,"","",""]
[null,null,null,null,null,null,null,null,null,null,null,null,null,null,null,null,null,null,null,null,"","",""]
[null,null,null,null,null,null,null,null,null,null,null,null,null,null,null,null,null,null,null,null,"","",""]
[null,null,null,null,null,null,null,null,null,null,null,null,null,null,null,null,null,null,null,null,"","",""]
[null,null,null,null,null,null,null,null,null,null,null,null,null,null,null,null,null,null,null,null,"","",""]
[null,null,null,null,null,null,null,null,null,null,null,null,null,null,null,null,null,null,null,null,"","",""]
[null,null,null,null,null,null,null,null,null,null,null,null,null,null,null,null,null,null,null,null,"","",""]
[null,null,null,null,null,null,null,null,null,null,null,null,null,null,null,null,null,null,null,null,"","",""]
[null,null,null,null,null,null,null,null,null,null,null,null,null,null,null,null,null,null,null,null,"","",""]
[null,null,null,null,null,null,null,null,null,null,null,null,null,null,null,null,null,null,null,null,"","",""]
[null,null,null,null,null,null,null,null,null,null,null,null,null,null,null,null,null,null,null,null,"","",""]
[null,null,null,null,null,null,null,null,null,null,null,null,null,null,null,null,null,null,null,null,"","",""]
[null,null,null,null,null,null,null,null,null,null,null,null,null,null,null,null,null,null,null,null,"","",""]
[null,null,null,null,null,null,null,null,null,null,null,null,null,null,null,null,null,null,null,null,"","",""]
[null,null,null,null,null,null,null,null,null,null,null,null,null,null,null,null,null,null,null,null,"","",""]
[null,null,null,null,null,null,null,null,null,null,null,null,null,null,null,null,null,null,null,null,"","",""]
[null,null,null,null,null,null,null,null,null,null,null,null,null,null,null,null,null,null,null,null,"","",""]
[null,null,null,null,null,null,null,null,null,null,null,null,null,null,null,null,null,null,null,null,"","",""]
[null,null,null,null,null,null,null,null,null,null,null,null,null,null,null,null,null,null,null,null,"","",""]
[null,null,null,null,null,null,null,null,null,null,null,null,null,null,null,null,null,null,null,null,"","",""]
[null,null,null,null,null,null,null,null,null,null,null,null,null,null,null,null,null,null,null,null,"","",""]
[null,null,null,null,null,null,null,null,null,null,null,null,null,null,null,null,null,null,null,null,"","",""]
[null,null,null,null,null,null,null,null,null,null,null,null,null,null,null,null,null,null,null,null,"","",""]
[null,null,null,null,null,null,null,null,null,null,null,null,null,null,null,null,null,null,null,null,"","",""]
[null,null,null,null,null,null,null,null,null,null,null,null,null,null,null,null,null,null,null,null,"","",""]
[null,null,null,null,null,null,null,null,null,null,null,null,null,null,null,null,null,null,null,null,"","",""]
[null,null,null,null,null,null,null,null,null,null,null,null,null,null,null,null,null,null,null,null,"","",""]
[null,null,null,null,null,null,null,null,null,null,null,null,null,null,null,null,null,null,null,null,"","",""]
[null,null,null,null,null,null,null,null,null,null,null,null,null,null,null,null,null,null,null,null,"","",""]
[null,null,null,null,null,null,null,null,null,null,null,null,null,null,null,null,null,null,null,null,"","",""]
[null,null,null,null,null,null,null,null,null,null,null,null,null,null,null,null,null,null,null,null,"","",""]
[null,null,null,null,null,null,null,null,null,null,null,null,null,null,null,null,null,null,null,null,"","",""]
[null,null,null,null,null,null,null,null,null,null,null,null,null,null,null,null,null,null,null,null,"","",""]
[null,null,null,null,null,null,null,null,null,null,null,null,null,null,null,null,null,null,null,null,"","",""]
[null,null,null,null,null,null,null,null,null,null,null,null,null,null,null,null,null,null,null,null,"","",""]
[null,null,null,null,null,null,null,null,null,null,null,null,null,null,null,null,null,null,null,null,"","",""]
[null,null,null,null,null,null,null,null,null,null,null,null,null,null,null,null,null,null,null,null,"","",""]
[null,null,null,null,null,null,null,null,null,null,null,null,null,null,null,null,null,null,null,null,"","",""]
[null,null,null,null,null,null,null,null,null,null,null,null,null,null,null,null,null,null,null,null,"","",""]
[null,null,null,null,null,null,null,null,null,null,null,null,null,null,null,null,null,null,null,null,"","",""]
[null,null,null,null,null,null,null,null,null,null,null,null,null,null,null,null,null,null,null,null,"","",""]
[null,null,null,null,null,null,null,null,null,null,null,null,null,null,null,null,null,null,null,null,"","",""]
[null,null,null,null,null,null,null,null,null,null,null,null,null,null,null,null,null,null,null,null,"","",""]
[null,null,null,null,null,null,null,null,null,null,null,null,null,null,null,null,null,null,null,null,"","",""]
[null,null,null,null,null,null,null,null,null,null,null,null,null,null,null,null,null,null,null,null,"","",""]
[null,null,null,null,null,null,null,null,null,null,null,null,null,null,null,null,null,null,null,null,"","",""]
[null,null,null,null,null,null,null,null,null,null,null,null,null,null,null,null,null,null,null,null,"","",""]
[null,null,null,null,null,null,null,null,null,null,null,null,null,null,null,null,null,null,null,null,"","",""]
[null,null,null,null,null,null,null,null,null,null,null,null,null,null,null,null,null,null,null,null,"","",""]
[null,null,null,null,null,null,null,null,null,null,null,null,null,null,null,null,null,null,null,null,"","",""]
[null,null,null,null,null,null,null,null,null,null,null,null,null,null,null,null,null,null,null,null,"","",""]
[null,null,null,null,null,null,null,null,null,null,null,null,null,null,null,null,null,null,null,null,"","",""]
[null,null,null,null,null,null,null,null,null,null,null,null,null,null,null,null,null,null,null,null,"","",""]
[null,null,null,null,null,null,null,null,null,null,null,null,null,null,null,null,null,null,null,null,"","",""]
[null,null,null,null,null,null,null,null,null,null,null,null,null,null,null,null,null,null,null,null,"","",""]
[null,null,null,null,null,null,null,null,null,null,null,null,null,null,null,null,null,null,null,null,"","",""]
[null,null,null,null,null,null,null,null,null,null,null,null,null,null,null,null,null,null,null,null,"","",""]
[null,null,null,null,null,null,null,null,null,null,null,null,null,null,null,null,null,null,null,null,"","",""]
[null,null,null,null,null,null,null,null,null,null,null,null,null,null,null,null,null,null,null,null,{"$f":"IF(K134, K134,\"\")","v":""},{"$f":"IF(M134, M134,\"\")","v":""},{"$f":"IF(O134, O134,\"\")","v":""}]
[null,null,null,null,null,null,null,null,null,null,null,null,null,null,null,null,null,null,null,null,"","",""]
[null,null,null,null,null,null,null,null,null,null,null,null,null,null,null,null,null,null,null,null,"","",""]
[null,null,null,null,null,null,null,null,null,null,null,null,null,null,null,null,null,null,null,null,"","",""]
[null,null,null,null,null,null,null,null,null,null,null,null,null,null,null,null,null,null,null,null,"","",""]
[null,null,null,null,null,null,null,null,null,null,null,null,null,null,null,null,null,null,null,null,"","",""]
[null,null,null,null,null,null,null,null,null,null,null,null,null,null,null,null,null,null,null,null,"","",""]
[null,null,null,null,null,null,null,null,null,null,null,null,null,null,null,null,null,null,null,null,"","",""]
[null,null,null,null,null,null,null,null,null,null,null,null,null,null,null,null,null,null,null,null,"","",""]
[null,null,null,null,null,null,null,null,null,null,null,null,null,null,null,null,null,null,null,null,"","",""]
[null,null,null,null,null,null,null,null,null,null,null,null,null,null,null,null,null,null,null,null,"","",""]
[null,null,null,null,null,null,null,null,null,null,null,null,null,null,null,null,null,null,null,null,"","",""]
[null,null,null,null,null,null,null,null,null,null,null,null,null,null,null,null,null,null,null,null,"","",""]
[null,null,null,null,null,null,null,null,null,null,null,null,null,null,null,null,null,null,null,null,"","",""]
[null,null,null,null,null,null,null,null,null,null,null,null,null,null,null,null,null,null,null,null,"","",""]
[null,null,null,null,null,null,null,null,null,null,null,null,null,null,null,null,null,null,null,null,"","",""]
[null,null,null,null,null,null,null,null,null,null,null,null,null,null,null,null,null,null,null,null,"","",""]
[null,null,null,null,null,null,null,null,null,null,null,null,null,null,null,null,null,null,null,null,"","",""]
[null,null,null,null,null,null,null,null,null,null,null,null,null,null,null,null,null,null,null,null,"","",""]
[null,null,null,null,null,null,null,null,null,null,null,null,null,null,null,null,null,null,null,null,"","",""]
[null,null,null,null,null,null,null,null,null,null,null,null,null,null,null,null,null,null,null,null,"","",""]
[null,null,null,null,null,null,null,null,null,null,null,null,null,null,null,null,null,null,null,null,"","",""]
[null,null,null,null,null,null,null,null,null,null,null,null,null,null,null,null,null,null,null,null,"","",""]
[null,null,null,null,null,null,null,null,null,null,null,null,null,null,null,null,null,null,null,null,"","",""]
[null,null,null,null,null,null,null,null,null,null,null,null,null,null,null,null,null,null,null,null,"","",""]
[null,null,null,null,null,null,null,null,null,null,null,null,null,null,null,null,null,null,null,null,"","",""]
[null,null,null,null,null,null,null,null,null,null,null,null,null,null,null,null,null,null,null,null,"","",""]
[null,null,null,null,null,null,null,null,null,null,null,null,null,null,null,null,null,null,null,null,"","",""]
[null,null,null,null,null,null,null,null,null,null,null,null,null,null,null,null,null,null,null,null,"","",""]
[null,null,null,null,null,null,null,null,null,null,null,null,null,null,null,null,null,null,null,null,"","",""]
[null,null,null,null,null,null,null,null,null,null,null,null,null,null,null,null,null,null,null,null,"","",""]
[null,null,null,null,null,null,null,null,null,null,null,null,null,null,null,null,null,null,null,null,"","",""]
[null,null,null,null,null,null,null,null,null,null,null,null,null,null,null,null,null,null,null,null,"","",""]
[null,null,null,null,null,null,null,null,null,null,null,null,null,null,null,null,null,null,null,null,"","",""]
[null,null,null,null,null,null,null,null,null,null,null,null,null,null,null,null,null,null,null,null,"","",""]
[null,null,null,null,null,null,null,null,null,null,null,null,null,null,null,null,null,null,null,null,"","",""]
[null,null,null,null,null,null,null,null,null,null,null,null,null,null,null,null,null,null,null,null,"","",""]
[null,null,null,null,null,null,null,null,null,null,null,null,null,null,null,null,null,null,null,null,"","",""]
[null,null,null,null,null,null,null,null,null,null,null,null,null,null,null,null,null,null,null,null,"","",""]
[null,null,null,null,null,null,null,null,null,null,null,null,null,null,null,null,null,null,null,null,"","",""]
[null,null,null,null,null,null,null,null,null,null,null,null,null,null,null,null,null,null,null,null,"","",""]
[null,null,null,null,null,null,null,null,null,null,null,null,null,null,null,null,null,null,null,null,"","",""]
[null,null,null,null,null,null,null,null,null,null,null,null,null,null,null,null,null,null,null,null,"","",""]
[null,null,null,null,null,null,null,null,null,null,null,null,null,null,null,null,null,null,null,null,"","",""]
[null,null,null,null,null,null,null,null,null,null,null,null,null,null,null,null,null,null,null,null,"","",""]
[null,null,null,null,null,null,null,null,null,null,null,null,null,null,null,null,null,null,null,null,"","",""]
[null,null,null,null,null,null,null,null,null,null,null,null,null,null,null,null,null,null,null,null,"","",""]
[null,null,null,null,null,null,null,null,null,null,null,null,null,null,null,null,null,null,null,null,"","",""]
[null,null,null,null,null,null,null,null,null,null,null,null,null,null,null,null,null,null,null,null,"","",""]
[null,null,null,null,null,null,null,null,null,null,null,null,null,null,null,null,null,null,null,null,"","",""]
[null,null,null,null,null,null,null,null,null,null,null,null,null,null,null,null,null,null,null,null,"","",""]
[null,null,null,null,null,null,null,null,null,null,null,null,null,null,null,null,null,null,null,null,"","",""]
[null,null,null,null,null,null,null,null,null,null,null,null,null,null,null,null,null,null,null,null,"","",""]
[null,null,null,null,null,null,null,null,null,null,null,null,null,null,null,null,null,null,null,null,"","",""]
[null,null,null,null,null,null,null,null,null,null,null,null,null,null,null,null,null,null,null,null,"","",""]
[null,null,null,null,null,null,null,null,null,null,null,null,null,null,null,null,null,null,null,null,"","",""]
[null,null,null,null,null,null,null,null,null,null,null,null,null,null,null,null,null,null,null,null,"","",""]
[null,null,null,null,null,null,null,null,null,null,null,null,null,null,null,null,null,null,null,null,"","",""]
[null,null,null,null,null,null,null,null,null,null,null,null,null,null,null,null,null,null,null,null,"","",""]
[null,null,null,null,null,null,null,null,null,null,null,null,null,null,null,null,null,null,null,null,"","",""]
[null,null,null,null,null,null,null,null,null,null,null,null,null,null,null,null,null,null,null,null,"","",""]
[null,null,null,null,null,null,null,null,null,null,null,null,null,null,null,null,null,null,null,null,"","",""]
[null,null,null,null,null,null,null,null,null,null,null,null,null,null,null,null,null,null,null,null,"","",""]
[null,null,null,null,null,null,null,null,null,null,null,null,null,null,null,null,null,null,null,null,"","",""]
[null,null,null,null,null,null,null,null,null,null,null,null,null,null,null,null,null,null,null,null,{"$f":"IF(K198, K198,\"\")","v":""},{"$f":"IF(M198, M198,\"\")","v":""},{"$f":"IF(O198, O198,\"\")","v":""}]
[null,null,null,null,null,null,null,null,null,null,null,null,null,null,null,null,null,null,null,null,"","",""]
[null,null,null,null,null,null,null,null,null,null,null,null,null,null,null,null,null,null,null,null,"","",""]
[null,null,null,null,null,null,null,null,null,null,null,null,null,null,null,null,null,null,null,null,"","",""]
[null,null,null,null,null,null,null,null,null,null,null,null,null,null,null,null,null,null,null,null,"","",""]
[null,null,null,null,null,null,null,null,null,null,null,null,null,null,null,null,null,null,null,null,"","",""]
[null,null,null,null,null,null,null,null,null,null,null,null,null,null,null,null,null,null,null,null,"","",""]
[null,null,null,null,null,null,null,null,null,null,null,null,null,null,null,null,null,null,null,null,"","",""]
[null,null,null,null,null,null,null,null,null,null,null,null,null,null,null,null,null,null,null,null,"","",""]
[null,null,null,null,null,null,null,null,null,null,null,null,null,null,null,null,null,null,null,null,"","",""]
[null,null,null,null,null,null,null,null,null,null,null,null,null,null,null,null,null,null,null,null,"","",""]
[null,null,null,null,null,null,null,null,null,null,null,null,null,null,null,null,null,null,null,null,"","",""]
[null,null,null,null,null,null,null,null,null,null,null,null,null,null,null,null,null,null,null,null,"","",""]
[null,null,null,null,null,null,null,null,null,null,null,null,null,null,null,null,null,null,null,null,"","",""]
[null,null,null,null,null,null,null,null,null,null,null,null,null,null,null,null,null,null,null,null,"","",""]
[null,null,null,null,null,null,null,null,null,null,null,null,null,null,null,null,null,null,null,null,"","",""]
[null,null,null,null,null,null,null,null,null,null,null,null,null,null,null,null,null,null,null,null,"","",""]
[null,null,null,null,null,null,null,null,null,null,null,null,null,null,null,null,null,null,null,null,"","",""]
[null,null,null,null,null,null,null,null,null,null,null,null,null,null,null,null,null,null,null,null,"","",""]
[null,null,null,null,null,null,null,null,null,null,null,null,null,null,null,null,null,null,null,null,"","",""]
[null,null,null,null,null,null,null,null,null,null,null,null,null,null,null,null,null,null,null,null,"","",""]
[null,null,null,null,null,null,null,null,null,null,null,null,null,null,null,null,null,null,null,null,"","",""]
[null,null,null,null,null,null,null,null,null,null,null,null,null,null,null,null,null,null,null,null,"","",""]
[null,null,null,null,null,null,null,null,null,null,null,null,null,null,null,null,null,null,null,null,"","",""]
[null,null,null,null,null,null,null,null,null,null,null,null,null,null,null,null,null,null,null,null,"","",""]
[null,null,null,null,null,null,null,null,null,null,null,null,null,null,null,null,null,null,null,null,"","",""]
[null,null,null,null,null,null,null,null,null,null,null,null,null,null,null,null,null,null,null,null,"","",""]
[null,null,null,null,null,null,null,null,null,null,null,null,null,null,null,null,null,null,null,null,"","",""]
[null,null,null,null,null,null,null,null,null,null,null,null,null,null,null,null,null,null,null,null,"","",""]
[null,null,null,null,null,null,null,null,null,null,null,null,null,null,null,null,null,null,null,null,"","",""]
[null,null,null,null,null,null,null,null,null,null,null,null,null,null,null,null,null,null,null,null,"","",""]
[null,null,null,null,null,null,null,null,null,null,null,null,null,null,null,null,null,null,null,null,"","",""]
[null,null,null,null,null,null,null,null,null,null,null,null,null,null,null,null,null,null,null,null,"","",""]
[null,null,null,null,null,null,null,null,null,null,null,null,null,null,null,null,null,null,null,null,"","",""]
[null,null,null,null,null,null,null,null,null,null,null,null,null,null,null,null,null,null,null,null,"","",""]
[null,null,null,null,null,null,null,null,null,null,null,null,null,null,null,null,null,null,null,null,"","",""]
[null,null,null,null,null,null,null,null,null,null,null,null,null,null,null,null,null,null,null,null,"","",""]
[null,null,null,null,null,null,null,null,null,null,null,null,null,null,null,null,null,null,null,null,"","",""]
[null,null,null,null,null,null,null,null,null,null,null,null,null,null,null,null,null,null,null,null,"","",""]
[null,null,null,null,null,null,null,null,null,null,null,null,null,null,null,null,null,null,null,null,"","",""]
[null,null,null,null,null,null,null,null,null,null,null,null,null,null,null,null,null,null,null,null,"","",""]
[null,null,null,null,null,null,null,null,null,null,null,null,null,null,null,null,null,null,null,null,"","",""]
[null,null,null,null,null,null,null,null,null,null,null,null,null,null,null,null,null,null,null,null,"","",""]
[null,null,null,null,null,null,null,null,null,null,null,null,null,null,null,null,null,null,null,null,"","",""]
[null,null,null,null,null,null,null,null,null,null,null,null,null,null,null,null,null,null,null,null,"","",""]
[null,null,null,null,null,null,null,null,null,null,null,null,null,null,null,null,null,null,null,null,"","",""]
[null,null,null,null,null,null,null,null,null,null,null,null,null,null,null,null,null,null,null,null,"","",""]
[null,null,null,null,null,null,null,null,null,null,null,null,null,null,null,null,null,null,null,null,"","",""]
[null,null,null,null,null,null,null,null,null,null,null,null,null,null,null,null,null,null,null,null,"","",""]
[null,null,null,null,null,null,null,null,null,null,null,null,null,null,null,null,null,null,null,null,"","",""]
[null,null,null,null,null,null,null,null,null,null,null,null,null,null,null,null,null,null,null,null,"","",""]
[null,null,null,null,null,null,null,null,null,null,null,null,null,null,null,null,null,null,null,null,"","",""]
[null,null,null,null,null,null,null,null,null,null,null,null,null,null,null,null,null,null,null,null,"","",""]
[null,null,null,null,null,null,null,null,null,null,null,null,null,null,null,null,null,null,null,null,"","",""]
[null,null,null,null,null,null,null,null,null,null,null,null,null,null,null,null,null,null,null,null,"","",""]
[null,null,null,null,null,null,null,null,null,null,null,null,null,null,null,null,null,null,null,null,"","",""]
[null,null,null,null,null,null,null,null,null,null,null,null,null,null,null,null,null,null,null,null,"","",""]
[null,null,null,null,null,null,null,null,null,null,null,null,null,null,null,null,null,null,null,null,"","",""]
[null,null,null,null,null,null,null,null,null,null,null,null,null,null,null,null,null,null,null,null,"","",""]
[null,null,null,null,null,null,null,null,null,null,null,null,null,null,null,null,null,null,null,null,"","",""]
[null,null,null,null,null,null,null,null,null,null,null,null,null,null,null,null,null,null,null,null,"","",""]
[null,null,null,null,null,null,null,null,null,null,null,null,null,null,null,null,null,null,null,null,"","",""]
[null,null,null,null,null,null,null,null,null,null,null,null,null,null,null,null,null,null,null,null,"","",""]
[null,null,null,null,null,null,null,null,null,null,null,null,null,null,null,null,null,null,null,null,"","",""]
[null,null,null,null,null,null,null,null,null,null,null,null,null,null,null,null,null,null,null,null,{"$f":"IF(K262, K262,\"\")","v":""},{"$f":"IF(M262, M262,\"\")","v":""},{"$f":"IF(O262, O262,\"\")","v":""}]
[null,null,null,null,null,null,null,null,null,null,null,null,null,null,null,null,null,null,null,null,"","",""]
[null,null,null,null,null,null,null,null,null,null,null,null,null,null,null,null,null,null,null,null,"","",""]
[null,null,null,null,null,null,null,null,null,null,null,null,null,null,null,null,null,null,null,null,"","",""]
[null,null,null,null,null,null,null,null,null,null,null,null,null,null,null,null,null,null,null,null,"","",""]
[null,null,null,null,null,null,null,null,null,null,null,null,null,null,null,null,null,null,null,null,"","",""]
[null,null,null,null,null,null,null,null,null,null,null,null,null,null,null,null,null,null,null,null,"","",""]
[null,null,null,null,null,null,null,null,null,null,null,null,null,null,null,null,null,null,null,null,"","",""]
[null,null,null,null,null,null,null,null,null,null,null,null,null,null,null,null,null,null,null,null,"","",""]
[null,null,null,null,null,null,null,null,null,null,null,null,null,null,null,null,null,null,null,null,"","",""]
[null,null,null,null,null,null,null,null,null,null,null,null,null,null,null,null,null,null,null,null,"","",""]
[null,null,null,null,null,null,null,null,null,null,null,null,null,null,null,null,null,null,null,null,"","",""]
[null,null,null,null,null,null,null,null,null,null,null,null,null,null,null,null,null,null,null,null,"","",""]
[null,null,null,null,null,null,null,null,null,null,null,null,null,null,null,null,null,null,null,null,"","",""]
[null,null,null,null,null,null,null,null,null,null,null,null,null,null,null,null,null,null,null,null,"","",""]
[null,null,null,null,null,null,null,null,null,null,null,null,null,null,null,null,null,null,null,null,"","",""]
[null,null,null,null,null,null,null,null,null,null,null,null,null,null,null,null,null,null,null,null,"","",""]
[null,null,null,null,null,null,null,null,null,null,null,null,null,null,null,null,null,null,null,null,"","",""]
[null,null,null,null,null,null,null,null,null,null,null,null,null,null,null,null,null,null,null,null,"","",""]
[null,null,null,null,null,null,null,null,null,null,null,null,null,null,null,null,null,null,null,null,"","",""]
[null,null,null,null,null,null,null,null,null,null,null,null,null,null,null,null,null,null,null,null,"","",""]
[null,null,null,null,null,null,null,null,null,null,null,null,null,null,null,null,null,null,null,null,"","",""]
[null,null,null,null,null,null,null,null,null,null,null,null,null,null,null,null,null,null,null,null,"","",""]
[null,null,null,null,null,null,null,null,null,null,null,null,null,null,null,null,null,null,null,null,"","",""]
[null,null,null,null,null,null,null,null,null,null,null,null,null,null,null,null,null,null,null,null,"","",""]
[null,null,null,null,null,null,null,null,null,null,null,null,null,null,null,null,null,null,null,null,"","",""]
[null,null,null,null,null,null,null,null,null,null,null,null,null,null,null,null,null,null,null,null,"","",""]
[null,null,null,null,null,null,null,null,null,null,null,null,null,null,null,null,null,null,null,null,"","",""]
[null,null,null,null,null,null,null,null,null,null,null,null,null,null,null,null,null,null,null,null,"","",""]
[null,null,null,null,null,null,null,null,null,null,null,null,null,null,null,null,null,null,null,null,"","",""]
[null,null,null,null,null,null,null,null,null,null,null,null,null,null,null,null,null,null,null,null,"","",""]
[null,null,null,null,null,null,null,null,null,null,null,null,null,null,null,null,null,null,null,null,"","",""]
[null,null,null,null,null,null,null,null,null,null,null,null,null,null,null,null,null,null,null,null,"","",""]
[null,null,null,null,null,null,null,null,null,null,null,null,null,null,null,null,null,null,null,null,"","",""]
[null,null,null,null,null,null,null,null,null,null,null,null,null,null,null,null,null,null,null,null,"","",""]
[null,null,null,null,null,null,null,null,null,null,null,null,null,null,null,null,null,null,null,null,"","",""]
[null,null,null,null,null,null,null,null,null,null,null,null,null,null,null,null,null,null,null,null,"","",""]
[null,null,null,null,null,null,null,null,null,null,null,null,null,null,null,null,null,null,null,null,"","",""]
[null,null,null,null,null,null,null,null,null,null,null,null,null,null,null,null,null,null,null,null,"","",""]
[null,null,null,null,null,null,null,null,null,null,null,null,null,null,null,null,null,null,null,null,"","",""]
[null,null,null,null,null,null,null,null,null,null,null,null,null,null,null,null,null,null,null,null,"","",""]
[null,null,null,null,null,null,null,null,null,null,null,null,null,null,null,null,null,null,null,null,"","",""]
[null,null,null,null,null,null,null,null,null,null,null,null,null,null,null,null,null,null,null,null,"","",""]
[null,null,null,null,null,null,null,null,null,null,null,null,null,null,null,null,null,null,null,null,"","",""]
[null,null,null,null,null,null,null,null,null,null,null,null,null,null,null,null,null,null,null,null,"","",""]
[null,null,null,null,null,null,null,null,null,null,null,null,null,null,null,null,null,null,null,null,"","",""]
[null,null,null,null,null,null,null,null,null,null,null,null,null,null,null,null,null,null,null,null,"","",""]
[null,null,null,null,null,null,null,null,null,null,null,null,null,null,null,null,null,null,null,null,"","",""]
[null,null,null,null,null,null,null,null,null,null,null,null,null,null,null,null,null,null,null,null,"","",""]
[null,null,null,null,null,null,null,null,null,null,null,null,null,null,null,null,null,null,null,null,"","",""]
[null,null,null,null,null,null,null,null,null,null,null,null,null,null,null,null,null,null,null,null,"","",""]
[null,null,null,null,null,null,null,null,null,null,null,null,null,null,null,null,null,null,null,null,"","",""]
[null,null,null,null,null,null,null,null,null,null,null,null,null,null,null,null,null,null,null,null,"","",""]
[null,null,null,null,null,null,null,null,null,null,null,null,null,null,null,null,null,null,null,null,"","",""]
[null,null,null,null,null,null,null,null,null,null,null,null,null,null,null,null,null,null,null,null,"","",""]
[null,null,null,null,null,null,null,null,null,null,null,null,null,null,null,null,null,null,null,null,"","",""]
[null,null,null,null,null,null,null,null,null,null,null,null,null,null,null,null,null,null,null,null,"","",""]
[null,null,null,null,null,null,null,null,null,null,null,null,null,null,null,null,null,null,null,null,"","",""]
[null,null,null,null,null,null,null,null,null,null,null,null,null,null,null,null,null,null,null,null,"","",""]
[null,null,null,null,null,null,null,null,null,null,null,null,null,null,null,null,null,null,null,null,"","",""]
[null,null,null,null,null,null,null,null,null,null,null,null,null,null,null,null,null,null,null,null,"","",""]
[null,null,null,null,null,null,null,null,null,null,null,null,null,null,null,null,null,null,null,null,"","",""]
[null,null,null,null,null,null,null,null,null,null,null,null,null,null,null,null,null,null,null,null,"","",""]
[null,null,null,null,null,null,null,null,null,null,null,null,null,null,null,null,null,null,null,null,"","",""]
[null,null,null,null,null,null,null,null,null,null,null,null,null,null,null,null,null,null,null,null,{"$f":"IF(K326, K326,\"\")","v":""},{"$f":"IF(M326, M326,\"\")","v":""},{"$f":"IF(O326, O326,\"\")","v":""}]
[null,null,null,null,null,null,null,null,null,null,null,null,null,null,null,null,null,null,null,null,"","",""]
[null,null,null,null,null,null,null,null,null,null,null,null,null,null,null,null,null,null,null,null,"","",""]
[null,null,null,null,null,null,null,null,null,null,null,null,null,null,null,null,null,null,null,null,"","",""]
[null,null,null,null,null,null,null,null,null,null,null,null,null,null,null,null,null,null,null,null,"","",""]
[null,null,null,null,null,null,null,null,null,null,null,null,null,null,null,null,null,null,null,null,"","",""]
[null,null,null,null,null,null,null,null,null,null,null,null,null,null,null,null,null,null,null,null,"","",""]
[null,null,null,null,null,null,null,null,null,null,null,null,null,null,null,null,null,null,null,null,"","",""]
[null,null,null,null,null,null,null,null,null,null,null,null,null,null,null,null,null,null,null,null,"","",""]
[null,null,null,null,null,null,null,null,null,null,null,null,null,null,null,null,null,null,null,null,"","",""]
[null,null,null,null,null,null,null,null,null,null,null,null,null,null,null,null,null,null,null,null,"","",""]
[null,null,null,null,null,null,null,null,null,null,null,null,null,null,null,null,null,null,null,null,"","",""]
[null,null,null,null,null,null,null,null,null,null,null,null,null,null,null,null,null,null,null,null,"","",""]
[null,null,null,null,null,null,null,null,null,null,null,null,null,null,null,null,null,null,null,null,"","",""]
[null,null,null,null,null,null,null,null,null,null,null,null,null,null,null,null,null,null,null,null,"","",""]
[null,null,null,null,null,null,null,null,null,null,null,null,null,null,null,null,null,null,null,null,"","",""]
[null,null,null,null,null,null,null,null,null,null,null,null,null,null,null,null,null,null,null,null,"","",""]
[null,null,null,null,null,null,null,null,null,null,null,null,null,null,null,null,null,null,null,null,"","",""]
[null,null,null,null,null,null,null,null,null,null,null,null,null,null,null,null,null,null,null,null,"","",""]
[null,null,null,null,null,null,null,null,null,null,null,null,null,null,null,null,null,null,null,null,"","",""]
[null,null,null,null,null,null,null,null,null,null,null,null,null,null,null,null,null,null,null,null,"","",""]
[null,null,null,null,null,null,null,null,null,null,null,null,null,null,null,null,null,null,null,null,"","",""]
[null,null,null,null,null,null,null,null,null,null,null,null,null,null,null,null,null,null,null,null,"","",""]
[null,null,null,null,null,null,null,null,null,null,null,null,null,null,null,null,null,null,null,null,"","",""]
[null,null,null,null,null,null,null,null,null,null,null,null,null,null,null,null,null,null,null,null,"","",""]
[null,null,null,null,null,null,null,null,null,null,null,null,null,null,null,null,null,null,null,null,"","",""]
[null,null,null,null,null,null,null,null,null,null,null,null,null,null,null,null,null,null,null,null,"","",""]
[null,null,null,null,null,null,null,null,null,null,null,null,null,null,null,null,null,null,null,null,"","",""]
[null,null,null,null,null,null,null,null,null,null,null,null,null,null,null,null,null,null,null,null,"","",""]
[null,null,null,null,null,null,null,null,null,null,null,null,null,null,null,null,null,null,null,null,"","",""]
[null,null,null,null,null,null,null,null,null,null,null,null,null,null,null,null,null,null,null,null,"","",""]
[null,null,null,null,null,null,null,null,null,null,null,null,null,null,null,null,null,null,null,null,"","",""]
[null,null,null,null,null,null,null,null,null,null,null,null,null,null,null,null,null,null,null,null,"","",""]
[null,null,null,null,null,null,null,null,null,null,null,null,null,null,null,null,null,null,null,null,"","",""]
[null,null,null,null,null,null,null,null,null,null,null,null,null,null,null,null,null,null,null,null,"","",""]
[null,null,null,null,null,null,null,null,null,null,null,null,null,null,null,null,null,null,null,null,"","",""]
[null,null,null,null,null,null,null,null,null,null,null,null,null,null,null,null,null,null,null,null,"","",""]
[null,null,null,null,null,null,null,null,null,null,null,null,null,null,null,null,null,null,null,null,"","",""]
[null,null,null,null,null,null,null,null,null,null,null,null,null,null,null,null,null,null,null,null,"","",""]
[null,null,null,null,null,null,null,null,null,null,null,null,null,null,null,null,null,null,null,null,"","",""]
[null,null,null,null,null,null,null,null,null,null,null,null,null,null,null,null,null,null,null,null,"","",""]
[null,null,null,null,null,null,null,null,null,null,null,null,null,null,null,null,null,null,null,null,"","",""]
[null,null,null,null,null,null,null,null,null,null,null,null,null,null,null,null,null,null,null,null,"","",""]
[null,null,null,null,null,null,null,null,null,null,null,null,null,null,null,null,null,null,null,null,"","",""]
[null,null,null,null,null,null,null,null,null,null,null,null,null,null,null,null,null,null,null,null,"","",""]
[null,null,null,null,null,null,null,null,null,null,null,null,null,null,null,null,null,null,null,null,"","",""]
[null,null,null,null,null,null,null,null,null,null,null,null,null,null,null,null,null,null,null,null,"","",""]
[null,null,null,null,null,null,null,null,null,null,null,null,null,null,null,null,null,null,null,null,"","",""]
[null,null,null,null,null,null,null,null,null,null,null,null,null,null,null,null,null,null,null,null,"","",""]
[null,null,null,null,null,null,null,null,null,null,null,null,null,null,null,null,null,null,null,null,"","",""]
[null,null,null,null,null,null,null,null,null,null,null,null,null,null,null,null,null,null,null,null,"","",""]
[null,null,null,null,null,null,null,null,null,null,null,null,null,null,null,null,null,null,null,null,"","",""]
[null,null,null,null,null,null,null,null,null,null,null,null,null,null,null,null,null,null,null,null,"","",""]
[null,null,null,null,null,null,null,null,null,null,null,null,null,null,null,null,null,null,null,null,"","",""]
[null,null,null,null,null,null,null,null,null,null,null,null,null,null,null,null,null,null,null,null,"","",""]
[null,null,null,null,null,null,null,null,null,null,null,null,null,null,null,null,null,null,null,null,"","",""]
[null,null,null,null,null,null,null,null,null,null,null,null,null,null,null,null,null,null,null,null,"","",""]
[null,null,null,null,null,null,null,null,null,null,null,null,null,null,null,null,null,null,null,null,"","",""]
[null,null,null,null,null,null,null,null,null,null,null,null,null,null,null,null,null,null,null,null,"","",""]
[null,null,null,null,null,null,null,null,null,null,null,null,null,null,null,null,null,null,null,null,"","",""]
[null,null,null,null,null,null,null,null,null,null,null,null,null,null,null,null,null,null,null,null,"","",""]
[null,null,null,null,null,null,null,null,null,null,null,null,null,null,null,null,null,null,null,null,"","",""]
[null,null,null,null,null,null,null,null,null,null,null,null,null,null,null,null,null,null,null,null,"","",""]
[null,null,null,null,null,null,null,null,null,null,null,null,null,null,null,null,null,null,null,null,"","",""]
[null,null,null,null,null,null,null,null,null,null,null,null,null,null,null,null,null,null,null,null,{"$f":"IF(K390, K390,\"\")","v":""},{"$f":"IF(M390, M390,\"\")","v":""},{"$f":"IF(O390, O390,\"\")","v":""}]
[null,null,null,null,null,null,null,null,null,null,null,null,null,null,null,null,null,null,null,null,"","",""]
[null,null,null,null,null,null,null,null,null,null,null,null,null,null,null,null,null,null,null,null,"","",""]
[null,null,null,null,null,null,null,null,null,null,null,null,null,null,null,null,null,null,null,null,"","",""]
[null,null,null,null,null,null,null,null,null,null,null,null,null,null,null,null,null,null,null,null,"","",""]
[null,null,null,null,null,null,null,null,null,null,null,null,null,null,null,null,null,null,null,null,"","",""]
[null,null,null,null,null,null,null,null,null,null,null,null,null,null,null,null,null,null,null,null,"","",""]
[null,null,null,null,null,null,null,null,null,null,null,null,null,null,null,null,null,null,null,null,"","",""]
[null,null,null,null,null,null,null,null,null,null,null,null,null,null,null,null,null,null,null,null,"","",""]
[null,null,null,null,null,null,null,null,null,null,null,null,null,null,null,null,null,null,null,null,"","",""]
[null,null,null,null,null,null,null,null,null,null,null,null,null,null,null,null,null,null,null,null,"","",""]
[null,null,null,null,null,null,null,null,null,null,null,null,null,null,null,null,null,null,null,null,"","",""]
[null,null,null,null,null,null,null,null,null,null,null,null,null,null,null,null,null,null,null,null,"","",""]
[null,null,null,null,null,null,null,null,null,null,null,null,null,null,null,null,null,null,null,null,"","",""]
[null,null,null,null,null,null,null,null,null,null,null,null,null,null,null,null,null,null,null,null,"","",""]
[null,null,null,null,null,null,null,null,null,null,null,null,null,null,null,null,null,null,null,null,"","",""]
[null,null,null,null,null,null,null,null,null,null,null,null,null,null,null,null,null,null,null,null,"","",""]
[null,null,null,null,null,null,null,null,null,null,null,null,null,null,null,null,null,null,null,null,"","",""]
[null,null,null,null,null,null,null,null,null,null,null,null,null,null,null,null,null,null,null,null,"","",""]
[null,null,null,null,null,null,null,null,null,null,null,null,null,null,null,null,null,null,null,null,"","",""]
[null,null,null,null,null,null,null,null,null,null,null,null,null,null,null,null,null,null,null,null,"","",""]
[null,null,null,null,null,null,null,null,null,null,null,null,null,null,null,null,null,null,null,null,"","",""]
[null,null,null,null,null,null,null,null,null,null,null,null,null,null,null,null,null,null,null,null,"","",""]
[null,null,null,null,null,null,null,null,null,null,null,null,null,null,null,null,null,null,null,null,"","",""]
[null,null,null,null,null,null,null,null,null,null,null,null,null,null,null,null,null,null,null,null,"","",""]
[null,null,null,null,null,null,null,null,null,null,null,null,null,null,null,null,null,null,null,null,"","",""]
[null,null,null,null,null,null,null,null,null,null,null,null,null,null,null,null,null,null,null,null,"","",""]
[null,null,null,null,null,null,null,null,null,null,null,null,null,null,null,null,null,null,null,null,"","",""]
[null,null,null,null,null,null,null,null,null,null,null,null,null,null,null,null,null,null,null,null,"","",""]
[null,null,null,null,null,null,null,null,null,null,null,null,null,null,null,null,null,null,null,null,"","",""]
[null,null,null,null,null,null,null,null,null,null,null,null,null,null,null,null,null,null,null,null,"","",""]
[null,null,null,null,null,null,null,null,null,null,null,null,null,null,null,null,null,null,null,null,"","",""]
[null,null,null,null,null,null,null,null,null,null,null,null,null,null,null,null,null,null,null,null,"","",""]
[null,null,null,null,null,null,null,null,null,null,null,null,null,null,null,null,null,null,null,null,"","",""]
[null,null,null,null,null,null,null,null,null,null,null,null,null,null,null,null,null,null,null,null,"","",""]
[null,null,null,null,null,null,null,null,null,null,null,null,null,null,null,null,null,null,null,null,"","",""]
[null,null,null,null,null,null,null,null,null,null,null,null,null,null,null,null,null,null,null,null,"","",""]
[null,null,null,null,null,null,null,null,null,null,null,null,null,null,null,null,null,null,null,null,"","",""]
[null,null,null,null,null,null,null,null,null,null,null,null,null,null,null,null,null,null,null,null,"","",""]
[null,null,null,null,null,null,null,null,null,null,null,null,null,null,null,null,null,null,null,null,"","",""]
[null,null,null,null,null,null,null,null,null,null,null,null,null,null,null,null,null,null,null,null,"","",""]
[null,null,null,null,null,null,null,null,null,null,null,null,null,null,null,null,null,null,null,null,"","",""]
[null,null,null,null,null,null,null,null,null,null,null,null,null,null,null,null,null,null,null,null,"","",""]
[null,null,null,null,null,null,null,null,null,null,null,null,null,null,null,null,null,null,null,null,"","",""]
[null,null,null,null,null,null,null,null,null,null,null,null,null,null,null,null,null,null,null,null,"","",""]
[null,null,null,null,null,null,null,null,null,null,null,null,null,null,null,null,null,null,null,null,"","",""]
[null,null,null,null,null,null,null,null,null,null,null,null,null,null,null,null,null,null,null,null,"","",""]
[null,null,null,null,null,null,null,null,null,null,null,null,null,null,null,null,null,null,null,null,"","",""]
[null,null,null,null,null,null,null,null,null,null,null,null,null,null,null,null,null,null,null,null,"","",""]
[null,null,null,null,null,null,null,null,null,null,null,null,null,null,null,null,null,null,null,null,"","",""]
[null,null,null,null,null,null,null,null,null,null,null,null,null,null,null,null,null,null,null,null,"","",""]
[null,null,null,null,null,null,null,null,null,null,null,null,null,null,null,null,null,null,null,null,"","",""]
[null,null,null,null,null,null,null,null,null,null,null,null,null,null,null,null,null,null,null,null,"","",""]
[null,null,null,null,null,null,null,null,null,null,null,null,null,null,null,null,null,null,null,null,"","",""]
[null,null,null,null,null,null,null,null,null,null,null,null,null,null,null,null,null,null,null,null,"","",""]
[null,null,null,null,null,null,null,null,null,null,null,null,null,null,null,null,null,null,null,null,"","",""]
[null,null,null,null,null,null,null,null,null,null,null,null,null,null,null,null,null,null,null,null,"","",""]
[null,null,null,null,null,null,null,null,null,null,null,null,null,null,null,null,null,null,null,null,"","",""]
[null,null,null,null,null,null,null,null,null,null,null,null,null,null,null,null,null,null,null,null,"","",""]
[null,null,null,null,null,null,null,null,null,null,null,null,null,null,null,null,null,null,null,null,"","",""]
[null,null,null,null,null,null,null,null,null,null,null,null,null,null,null,null,null,null,null,null,"","",""]
[null,null,null,null,null,null,null,null,null,null,null,null,null,null,null,null,null,null,null,null,"","",""]
[null,null,null,null,null,null,null,null,null,null,null,null,null,null,null,null,null,null,null,null,"","",""]
[null,null,null,null,null,null,null,null,null,null,null,null,null,null,null,null,null,null,null,null,"","",""]
[null,null,null,null,null,null,null,null,null,null,null,null,null,null,null,null,null,null,null,null,{"$f":"IF(K454, K454,\"\")","v":""},{"$f":"IF(M454, M454,\"\")","v":""},{"$f":"IF(O454, O454,\"\")","v":""}]
[null,null,null,null,null,null,null,null,null,null,null,null,null,null,null,null,null,null,null,null,"","",""]
[null,null,null,null,null,null,null,null,null,null,null,null,null,null,null,null,null,null,null,null,"","",""]
[null,null,null,null,null,null,null,null,null,null,null,null,null,null,null,null,null,null,null,null,"","",""]
[null,null,null,null,null,null,null,null,null,null,null,null,null,null,null,null,null,null,null,null,"","",""]
[null,null,null,null,null,null,null,null,null,null,null,null,null,null,null,null,null,null,null,null,"","",""]
[null,null,null,null,null,null,null,null,null,null,null,null,null,null,null,null,null,null,null,null,"","",""]
[null,null,null,null,null,null,null,null,null,null,null,null,null,null,null,null,null,null,null,null,"","",""]
[null,null,null,null,null,null,null,null,null,null,null,null,null,null,null,null,null,null,null,null,"","",""]
[null,null,null,null,null,null,null,null,null,null,null,null,null,null,null,null,null,null,null,null,"","",""]
[null,null,null,null,null,null,null,null,null,null,null,null,null,null,null,null,null,null,null,null,"","",""]
[null,null,null,null,null,null,null,null,null,null,null,null,null,null,null,null,null,null,null,null,"","",""]
[null,null,null,null,null,null,null,null,null,null,null,null,null,null,null,null,null,null,null,null,"","",""]
[null,null,null,null,null,null,null,null,null,null,null,null,null,null,null,null,null,null,null,null,"","",""]
[null,null,null,null,null,null,null,null,null,null,null,null,null,null,null,null,null,null,null,null,"","",""]
[null,null,null,null,null,null,null,null,null,null,null,null,null,null,null,null,null,null,null,null,"","",""]
[null,null,null,null,null,null,null,null,null,null,null,null,null,null,null,null,null,null,null,null,"","",""]
[null,null,null,null,null,null,null,null,null,null,null,null,null,null,null,null,null,null,null,null,"","",""]
[null,null,null,null,null,null,null,null,null,null,null,null,null,null,null,null,null,null,null,null,"","",""]
[null,null,null,null,null,null,null,null,null,null,null,null,null,null,null,null,null,null,null,null,"","",""]
[null,null,null,null,null,null,null,null,null,null,null,null,null,null,null,null,null,null,null,null,"","",""]
[null,null,null,null,null,null,null,null,null,null,null,null,null,null,null,null,null,null,null,null,"","",""]
[null,null,null,null,null,null,null,null,null,null,null,null,null,null,null,null,null,null,null,null,"","",""]
[null,null,null,null,null,null,null,null,null,null,null,null,null,null,null,null,null,null,null,null,"","",""]
[null,null,null,null,null,null,null,null,null,null,null,null,null,null,null,null,null,null,null,null,"","",""]
[null,null,null,null,null,null,null,null,null,null,null,null,null,null,null,null,null,null,null,null,"","",""]
[null,null,null,null,null,null,null,null,null,null,null,null,null,null,null,null,null,null,null,null,"","",""]
[null,null,null,null,null,null,null,null,null,null,null,null,null,null,null,null,null,null,null,null,"","",""]
[null,null,null,null,null,null,null,null,null,null,null,null,null,null,null,null,null,null,null,null,"","",""]
[null,null,null,null,null,null,null,null,null,null,null,null,null,null,null,null,null,null,null,null,"","",""]
[null,null,null,null,null,null,null,null,null,null,null,null,null,null,null,null,null,null,null,null,"","",""]
[null,null,null,null,null,null,null,null,null,null,null,null,null,null,null,null,null,null,null,null,"","",""]
[null,null,null,null,null,null,null,null,null,null,null,null,null,null,null,null,null,null,null,null,"","",""]
[null,null,null,null,null,null,null,null,null,null,null,null,null,null,null,null,null,null,null,null,"","",""]
[null,null,null,null,null,null,null,null,null,null,null,null,null,null,null,null,null,null,null,null,"","",""]
[null,null,null,null,null,null,null,null,null,null,null,null,null,null,null,null,null,null,null,null,"","",""]
[null,null,null,null,null,null,null,null,null,null,null,null,null,null,null,null,null,null,null,null,"","",""]
[null,null,null,null,null,null,null,null,null,null,null,null,null,null,null,null,null,null,null,null,"","",""]
[null,null,null,null,null,null,null,null,null,null,null,null,null,null,null,null,null,null,null,null,"","",""]
[null,null,null,null,null,null,null,null,null,null,null,null,null,null,null,null,null,null,null,null,"","",""]
[null,null,null,null,null,null,null,null,null,null,null,null,null,null,null,null,null,null,null,null,"","",""]
[null,null,null,null,null,null,null,null,null,null,null,null,null,null,null,null,null,null,null,null,"","",""]
[null,null,null,null,null,null,null,null,null,null,null,null,null,null,null,null,null,null,null,null,"","",""]
[null,null,null,null,null,null,null,null,null,null,null,null,null,null,null,null,null,null,null,null,"","",""]
[null,null,null,null,null,null,null,null,null,null,null,null,null,null,null,null,null,null,null,null,"","",""]
[null,null,null,null,null,null,null,null,null,null,null,null,null,null,null,null,null,null,null,null,"","",""]
[null,null,null,null,null,null,null,null,null,null,null,null,null,null,null,null,null,null,null,null,"","",""]
[null,null,null,null,null,null,null,null,null,null,null,null,null,null,null,null,null,null,null,null,"","",""]
[null,null,null,null,null,null,null,null,null,null,null,null,null,null,null,null,null,null,null,null,"","",""]
[null,null,null,null,null,null,null,null,null,null,null,null,null,null,null,null,null,null,null,null,"","",""]
[null,null,null,null,null,null,null,null,null,null,null,null,null,null,null,null,null,null,null,null,"","",""]
[null,null,null,null,null,null,null,null,null,null,null,null,null,null,null,null,null,null,null,null,"","",""]
[null,null,null,null,null,null,null,null,null,null,null,null,null,null,null,null,null,null,null,null,"","",""]
[null,null,null,null,null,null,null,null,null,null,null,null,null,null,null,null,null,null,null,null,"","",""]
[null,null,null,null,null,null,null,null,null,null,null,null,null,null,null,null,null,null,null,null,"","",""]
[null,null,null,null,null,null,null,null,null,null,null,null,null,null,null,null,null,null,null,null,"","",""]
[null,null,null,null,null,null,null,null,null,null,null,null,null,null,null,null,null,null,null,null,"","",""]
[null,null,null,null,null,null,null,null,null,null,null,null,null,null,null,null,null,null,null,null,"","",""]
[null,null,null,null,null,null,null,null,null,null,null,null,null,null,null,null,null,null,null,null,"","",""]
[null,null,null,null,null,null,null,null,null,null,null,null,null,null,null,null,null,null,null,null,"","",""]
[null,null,null,null,null,null,null,null,null,null,null,null,null,null,null,null,null,null,null,null,"","",""]
[null,null,null,null,null,null,null,null,null,null,null,null,null,null,null,null,null,null,null,null,"","",""]
[null,null,null,null,null,null,null,null,null,null,null,null,null,null,null,null,null,null,null,null,"","",""]
[null,null,null,null,null,null,null,null,null,null,null,null,null,null,null,null,null,null,null,null,"","",""]
[null,null,null,null,null,null,null,null,null,null,null,null,null,null,null,null,null,null,null,null,{"$f":"IF(K518, K518,\"\")","v":""},{"$f":"IF(M518, M518,\"\")","v":""},{"$f":"IF(O518, O518,\"\")","v":""}]
[null,null,null,null,null,null,null,null,null,null,null,null,null,null,null,null,null,null,null,null,"","",""]
[null,null,null,null,null,null,null,null,null,null,null,null,null,null,null,null,null,null,null,null,"","",""]
[null,null,null,null,null,null,null,null,null,null,null,null,null,null,null,null,null,null,null,null,"","",""]
[null,null,null,null,null,null,null,null,null,null,null,null,null,null,null,null,null,null,null,null,"","",""]
[null,null,null,null,null,null,null,null,null,null,null,null,null,null,null,null,null,null,null,null,"","",""]
[null,null,null,null,null,null,null,null,null,null,null,null,null,null,null,null,null,null,null,null,"","",""]
[null,null,null,null,null,null,null,null,null,null,null,null,null,null,null,null,null,null,null,null,"","",""]
[null,null,null,null,null,null,null,null,null,null,null,null,null,null,null,null,null,null,null,null,"","",""]
[null,null,null,null,null,null,null,null,null,null,null,null,null,null,null,null,null,null,null,null,"","",""]
[null,null,null,null,null,null,null,null,null,null,null,null,null,null,null,null,null,null,null,null,"","",""]
[null,null,null,null,null,null,null,null,null,null,null,null,null,null,null,null,null,null,null,null,"","",""]
[null,null,null,null,null,null,null,null,null,null,null,null,null,null,null,null,null,null,null,null,"","",""]
[null,null,null,null,null,null,null,null,null,null,null,null,null,null,null,null,null,null,null,null,"","",""]
[null,null,null,null,null,null,null,null,null,null,null,null,null,null,null,null,null,null,null,null,"","",""]
[null,null,null,null,null,null,null,null,null,null,null,null,null,null,null,null,null,null,null,null,"","",""]
[null,null,null,null,null,null,null,null,null,null,null,null,null,null,null,null,null,null,null,null,"","",""]
[null,null,null,null,null,null,null,null,null,null,null,null,null,null,null,null,null,null,null,null,"","",""]
[null,null,null,null,null,null,null,null,null,null,null,null,null,null,null,null,null,null,null,null,"","",""]
[null,null,null,null,null,null,null,null,null,null,null,null,null,null,null,null,null,null,null,null,"","",""]
[null,null,null,null,null,null,null,null,null,null,null,null,null,null,null,null,null,null,null,null,"","",""]
[null,null,null,null,null,null,null,null,null,null,null,null,null,null,null,null,null,null,null,null,"","",""]
[null,null,null,null,null,null,null,null,null,null,null,null,null,null,null,null,null,null,null,null,"","",""]
[null,null,null,null,null,null,null,null,null,null,null,null,null,null,null,null,null,null,null,null,"","",""]
[null,null,null,null,null,null,null,null,null,null,null,null,null,null,null,null,null,null,null,null,"","",""]
[null,null,null,null,null,null,null,null,null,null,null,null,null,null,null,null,null,null,null,null,"","",""]
[null,null,null,null,null,null,null,null,null,null,null,null,null,null,null,null,null,null,null,null,"","",""]
[null,null,null,null,null,null,null,null,null,null,null,null,null,null,null,null,null,null,null,null,"","",""]
[null,null,null,null,null,null,null,null,null,null,null,null,null,null,null,null,null,null,null,null,"","",""]
[null,null,null,null,null,null,null,null,null,null,null,null,null,null,null,null,null,null,null,null,"","",""]
[null,null,null,null,null,null,null,null,null,null,null,null,null,null,null,null,null,null,null,null,"","",""]
[null,null,null,null,null,null,null,null,null,null,null,null,null,null,null,null,null,null,null,null,"","",""]
[null,null,null,null,null,null,null,null,null,null,null,null,null,null,null,null,null,null,null,null,"","",""]
[null,null,null,null,null,null,null,null,null,null,null,null,null,null,null,null,null,null,null,null,"","",""]
[null,null,null,null,null,null,null,null,null,null,null,null,null,null,null,null,null,null,null,null,"","",""]
[null,null,null,null,null,null,null,null,null,null,null,null,null,null,null,null,null,null,null,null,"","",""]
[null,null,null,null,null,null,null,null,null,null,null,null,null,null,null,null,null,null,null,null,"","",""]
[null,null,null,null,null,null,null,null,null,null,null,null,null,null,null,null,null,null,null,null,"","",""]
[null,null,null,null,null,null,null,null,null,null,null,null,null,null,null,null,null,null,null,null,"","",""]
[null,null,null,null,null,null,null,null,null,null,null,null,null,null,null,null,null,null,null,null,"","",""]
[null,null,null,null,null,null,null,null,null,null,null,null,null,null,null,null,null,null,null,null,"","",""]
[null,null,null,null,null,null,null,null,null,null,null,null,null,null,null,null,null,null,null,null,"","",""]
[null,null,null,null,null,null,null,null,null,null,null,null,null,null,null,null,null,null,null,null,"","",""]
[null,null,null,null,null,null,null,null,null,null,null,null,null,null,null,null,null,null,null,null,"","",""]
[null,null,null,null,null,null,null,null,null,null,null,null,null,null,null,null,null,null,null,null,"","",""]
[null,null,null,null,null,null,null,null,null,null,null,null,null,null,null,null,null,null,null,null,"","",""]
[null,null,null,null,null,null,null,null,null,null,null,null,null,null,null,null,null,null,null,null,"","",""]
[null,null,null,null,null,null,null,null,null,null,null,null,null,null,null,null,null,null,null,null,"","",""]
[null,null,null,null,null,null,null,null,null,null,null,null,null,null,null,null,null,null,null,null,"","",""]
[null,null,null,null,null,null,null,null,null,null,null,null,null,null,null,null,null,null,null,null,"","",""]
[null,null,null,null,null,null,null,null,null,null,null,null,null,null,null,null,null,null,null,null,"","",""]
[null,null,null,null,null,null,null,null,null,null,null,null,null,null,null,null,null,null,null,null,"","",""]
[null,null,null,null,null,null,null,null,null,null,null,null,null,null,null,null,null,null,null,null,"","",""]
[null,null,null,null,null,null,null,null,null,null,null,null,null,null,null,null,null,null,null,null,"","",""]
[null,null,null,null,null,null,null,null,null,null,null,null,null,null,null,null,null,null,null,null,"","",""]
[null,null,null,null,null,null,null,null,null,null,null,null,null,null,null,null,null,null,null,null,"","",""]
[null,null,null,null,null,null,null,null,null,null,null,null,null,null,null,null,null,null,null,null,"","",""]
[null,null,null,null,null,null,null,null,null,null,null,null,null,null,null,null,null,null,null,null,"","",""]
[null,null,null,null,null,null,null,null,null,null,null,null,null,null,null,null,null,null,null,null,"","",""]
[null,null,null,null,null,null,null,null,null,null,null,null,null,null,null,null,null,null,null,null,"","",""]
[null,null,null,null,null,null,null,null,null,null,null,null,null,null,null,null,null,null,null,null,"","",""]
[null,null,null,null,null,null,null,null,null,null,null,null,null,null,null,null,null,null,null,null,"","",""]
[null,null,null,null,null,null,null,null,null,null,null,null,null,null,null,null,null,null,null,null,"","",""]
[null,null,null,null,null,null,null,null,null,null,null,null,null,null,null,null,null,null,null,null,"","",""]
[null,null,null,null,null,null,null,null,null,null,null,null,null,null,null,null,null,null,null,null,{"$f":"IF(K582, K582,\"\")","v":""},{"$f":"IF(M582, M582,\"\")","v":""},{"$f":"IF(O582, O582,\"\")","v":""}]
[null,null,null,null,null,null,null,null,null,null,null,null,null,null,null,null,null,null,null,null,"","",""]
[null,null,null,null,null,null,null,null,null,null,null,null,null,null,null,null,null,null,null,null,"","",""]
[null,null,null,null,null,null,null,null,null,null,null,null,null,null,null,null,null,null,null,null,"","",""]
[null,null,null,null,null,null,null,null,null,null,null,null,null,null,null,null,null,null,null,null,"","",""]
[null,null,null,null,null,null,null,null,null,null,null,null,null,null,null,null,null,null,null,null,"","",""]
[null,null,null,null,null,null,null,null,null,null,null,null,null,null,null,null,null,null,null,null,"","",""]
[null,null,null,null,null,null,null,null,null,null,null,null,null,null,null,null,null,null,null,null,"","",""]
[null,null,null,null,null,null,null,null,null,null,null,null,null,null,null,null,null,null,null,null,"","",""]
[null,null,null,null,null,null,null,null,null,null,null,null,null,null,null,null,null,null,null,null,"","",""]
[null,null,null,null,null,null,null,null,null,null,null,null,null,null,null,null,null,null,null,null,"","",""]
[null,null,null,null,null,null,null,null,null,null,null,null,null,null,null,null,null,null,null,null,"","",""]
[null,null,null,null,null,null,null,null,null,null,null,null,null,null,null,null,null,null,null,null,"","",""]
[null,null,null,null,null,null,null,null,null,null,null,null,null,null,null,null,null,null,null,null,"","",""]
[null,null,null,null,null,null,null,null,null,null,null,null,null,null,null,null,null,null,null,null,"","",""]
[null,null,null,null,null,null,null,null,null,null,null,null,null,null,null,null,null,null,null,null,"","",""]
[null,null,null,null,null,null,null,null,null,null,null,null,null,null,null,null,null,null,null,null,"","",""]
[null,null,null,null,null,null,null,null,null,null,null,null,null,null,null,null,null,null,null,null,"","",""]
[null,null,null,null,null,null,null,null,null,null,null,null,null,null,null,null,null,null,null,null,"","",""]
[null,null,null,null,null,null,null,null,null,null,null,null,null,null,null,null,null,null,null,null,"","",""]
[null,null,null,null,null,null,null,null,null,null,null,null,null,null,null,null,null,null,null,null,"","",""]
[null,null,null,null,null,null,null,null,null,null,null,null,null,null,null,null,null,null,null,null,"","",""]
[null,null,null,null,null,null,null,null,null,null,null,null,null,null,null,null,null,null,null,null,"","",""]
[null,null,null,null,null,null,null,null,null,null,null,null,null,null,null,null,null,null,null,null,"","",""]
[null,null,null,null,null,null,null,null,null,null,null,null,null,null,null,null,null,null,null,null,"","",""]
[null,null,null,null,null,null,null,null,null,null,null,null,null,null,null,null,null,null,null,null,"","",""]
[null,null,null,null,null,null,null,null,null,null,null,null,null,null,null,null,null,null,null,null,"","",""]
[null,null,null,null,null,null,null,null,null,null,null,null,null,null,null,null,null,null,null,null,"","",""]
[null,null,null,null,null,null,null,null,null,null,null,null,null,null,null,null,null,null,null,null,"","",""]
[null,null,null,null,null,null,null,null,null,null,null,null,null,null,null,null,null,null,null,null,"","",""]
[null,null,null,null,null,null,null,null,null,null,null,null,null,null,null,null,null,null,null,null,"","",""]
[null,null,null,null,null,null,null,null,null,null,null,null,null,null,null,null,null,null,null,null,"","",""]
[null,null,null,null,null,null,null,null,null,null,null,null,null,null,null,null,null,null,null,null,"","",""]
[null,null,null,null,null,null,null,null,null,null,null,null,null,null,null,null,null,null,null,null,"","",""]
[null,null,null,null,null,null,null,null,null,null,null,null,null,null,null,null,null,null,null,null,"","",""]
[null,null,null,null,null,null,null,null,null,null,null,null,null,null,null,null,null,null,null,null,"","",""]
[null,null,null,null,null,null,null,null,null,null,null,null,null,null,null,null,null,null,null,null,"","",""]
[null,null,null,null,null,null,null,null,null,null,null,null,null,null,null,null,null,null,null,null,"","",""]
[null,null,null,null,null,null,null,null,null,null,null,null,null,null,null,null,null,null,null,null,"","",""]
[null,null,null,null,null,null,null,null,null,null,null,null,null,null,null,null,null,null,null,null,"","",""]
[null,null,null,null,null,null,null,null,null,null,null,null,null,null,null,null,null,null,null,null,"","",""]
[null,null,null,null,null,null,null,null,null,null,null,null,null,null,null,null,null,null,null,null,"","",""]
[null,null,null,null,null,null,null,null,null,null,null,null,null,null,null,null,null,null,null,null,"","",""]
[null,null,null,null,null,null,null,null,null,null,null,null,null,null,null,null,null,null,null,null,"","",""]
[null,null,null,null,null,null,null,null,null,null,null,null,null,null,null,null,null,null,null,null,"","",""]
[null,null,null,null,null,null,null,null,null,null,null,null,null,null,null,null,null,null,null,null,"","",""]
[null,null,null,null,null,null,null,null,null,null,null,null,null,null,null,null,null,null,null,null,"","",""]
[null,null,null,null,null,null,null,null,null,null,null,null,null,null,null,null,null,null,null,null,"","",""]
[null,null,null,null,null,null,null,null,null,null,null,null,null,null,null,null,null,null,null,null,"","",""]
[null,null,null,null,null,null,null,null,null,null,null,null,null,null,null,null,null,null,null,null,"","",""]
[null,null,null,null,null,null,null,null,null,null,null,null,null,null,null,null,null,null,null,null,"","",""]
[null,null,null,null,null,null,null,null,null,null,null,null,null,null,null,null,null,null,null,null,"","",""]
[null,null,null,null,null,null,null,null,null,null,null,null,null,null,null,null,null,null,null,null,"","",""]
[null,null,null,null,null,null,null,null,null,null,null,null,null,null,null,null,null,null,null,null,"","",""]
[null,null,null,null,null,null,null,null,null,null,null,null,null,null,null,null,null,null,null,null,"","",""]
[null,null,null,null,null,null,null,null,null,null,null,null,null,null,null,null,null,null,null,null,"","",""]
[null,null,null,null,null,null,null,null,null,null,null,null,null,null,null,null,null,null,null,null,"","",""]
[null,null,null,null,null,null,null,null,null,null,null,null,null,null,null,null,null,null,null,null,"","",""]
[null,null,null,null,null,null,null,null,null,null,null,null,null,null,null,null,null,null,null,null,"","",""]
[null,null,null,null,null,null,null,null,null,null,null,null,null,null,null,null,null,null,null,null,"","",""]
[null,null,null,null,null,null,null,null,null,null,null,null,null,null,null,null,null,null,null,null,"","",""]
[null,null,null,null,null,null,null,null,null,null,null,null,null,null,null,null,null,null,null,null,"","",""]
[null,null,null,null,null,null,null,null,null,null,null,null,null,null,null,null,null,null,null,null,"","",""]
[null,null,null,null,null,null,null,null,null,null,null,null,null,null,null,null,null,null,null,null,"","",""]
[null,null,null,null,null,null,null,null,null,null,null,null,null,null,null,null,null,null,null,null,{"$f":"IF(K646, K646,\"\")","v":""},{"$f":"IF(M646, M646,\"\")","v":""},{"$f":"IF(O646, O646,\"\")","v":""}]
[null,null,null,null,null,null,null,null,null,null,null,null,null,null,null,null,null,null,null,null,"","",""]
[null,null,null,null,null,null,null,null,null,null,null,null,null,null,null,null,null,null,null,null,"","",""]
[null,null,null,null,null,null,null,null,null,null,null,null,null,null,null,null,null,null,null,null,"","",""]
[null,null,null,null,null,null,null,null,null,null,null,null,null,null,null,null,null,null,null,null,"","",""]
[null,null,null,null,null,null,null,null,null,null,null,null,null,null,null,null,null,null,null,null,"","",""]
[null,null,null,null,null,null,null,null,null,null,null,null,null,null,null,null,null,null,null,null,"","",""]
[null,null,null,null,null,null,null,null,null,null,null,null,null,null,null,null,null,null,null,null,"","",""]
[null,null,null,null,null,null,null,null,null,null,null,null,null,null,null,null,null,null,null,null,"","",""]
[null,null,null,null,null,null,null,null,null,null,null,null,null,null,null,null,null,null,null,null,"","",""]
[null,null,null,null,null,null,null,null,null,null,null,null,null,null,null,null,null,null,null,null,"","",""]
[null,null,null,null,null,null,null,null,null,null,null,null,null,null,null,null,null,null,null,null,"","",""]
[null,null,null,null,null,null,null,null,null,null,null,null,null,null,null,null,null,null,null,null,"","",""]
[null,null,null,null,null,null,null,null,null,null,null,null,null,null,null,null,null,null,null,null,"","",""]
[null,null,null,null,null,null,null,null,null,null,null,null,null,null,null,null,null,null,null,null,"","",""]
[null,null,null,null,null,null,null,null,null,null,null,null,null,null,null,null,null,null,null,null,"","",""]
[null,null,null,null,null,null,null,null,null,null,null,null,null,null,null,null,null,null,null,null,"","",""]
[null,null,null,null,null,null,null,null,null,null,null,null,null,null,null,null,null,null,null,null,"","",""]
[null,null,null,null,null,null,null,null,null,null,null,null,null,null,null,null,null,null,null,null,"","",""]
[null,null,null,null,null,null,null,null,null,null,null,null,null,null,null,null,null,null,null,null,"","",""]
[null,null,null,null,null,null,null,null,null,null,null,null,null,null,null,null,null,null,null,null,"","",""]
[null,null,null,null,null,null,null,null,null,null,null,null,null,null,null,null,null,null,null,null,"","",""]
[null,null,null,null,null,null,null,null,null,null,null,null,null,null,null,null,null,null,null,null,"","",""]
[null,null,null,null,null,null,null,null,null,null,null,null,null,null,null,null,null,null,null,null,"","",""]
[null,null,null,null,null,null,null,null,null,null,null,null,null,null,null,null,null,null,null,null,"","",""]
[null,null,null,null,null,null,null,null,null,null,null,null,null,null,null,null,null,null,null,null,"","",""]
[null,null,null,null,null,null,null,null,null,null,null,null,null,null,null,null,null,null,null,null,"","",""]
[null,null,null,null,null,null,null,null,null,null,null,null,null,null,null,null,null,null,null,null,"","",""]
[null,null,null,null,null,null,null,null,null,null,null,null,null,null,null,null,null,null,null,null,"","",""]
[null,null,null,null,null,null,null,null,null,null,null,null,null,null,null,null,null,null,null,null,"","",""]
[null,null,null,null,null,null,null,null,null,null,null,null,null,null,null,null,null,null,null,null,"","",""]
[null,null,null,null,null,null,null,null,null,null,null,null,null,null,null,null,null,null,null,null,"","",""]
[null,null,null,null,null,null,null,null,null,null,null,null,null,null,null,null,null,null,null,null,"","",""]
[null,null,null,null,null,null,null,null,null,null,null,null,null,null,null,null,null,null,null,null,"","",""]
[null,null,null,null,null,null,null,null,null,null,null,null,null,null,null,null,null,null,null,null,"","",""]
[null,null,null,null,null,null,null,null,null,null,null,null,null,null,null,null,null,null,null,null,"","",""]
[null,null,null,null,null,null,null,null,null,null,null,null,null,null,null,null,null,null,null,null,"","",""]
[null,null,null,null,null,null,null,null,null,null,null,null,null,null,null,null,null,null,null,null,"","",""]
[null,null,null,null,null,null,null,null,null,null,null,null,null,null,null,null,null,null,null,null,"","",""]
[null,null,null,null,null,null,null,null,null,null,null,null,null,null,null,null,null,null,null,null,"","",""]
[null,null,null,null,null,null,null,null,null,null,null,null,null,null,null,null,null,null,null,null,"","",""]
[null,null,null,null,null,null,null,null,null,null,null,null,null,null,null,null,null,null,null,null,"","",""]
[null,null,null,null,null,null,null,null,null,null,null,null,null,null,null,null,null,null,null,null,"","",""]
[null,null,null,null,null,null,null,null,null,null,null,null,null,null,null,null,null,null,null,null,"","",""]
[null,null,null,null,null,null,null,null,null,null,null,null,null,null,null,null,null,null,null,null,"","",""]
[null,null,null,null,null,null,null,null,null,null,null,null,null,null,null,null,null,null,null,null,"","",""]
[null,null,null,null,null,null,null,null,null,null,null,null,null,null,null,null,null,null,null,null,"","",""]
[null,null,null,null,null,null,null,null,null,null,null,null,null,null,null,null,null,null,null,null,"","",""]
[null,null,null,null,null,null,null,null,null,null,null,null,null,null,null,null,null,null,null,null,"","",""]
[null,null,null,null,null,null,null,null,null,null,null,null,null,null,null,null,null,null,null,null,"","",""]
[null,null,null,null,null,null,null,null,null,null,null,null,null,null,null,null,null,null,null,null,"","",""]
[null,null,null,null,null,null,null,null,null,null,null,null,null,null,null,null,null,null,null,null,"","",""]
[null,null,null,null,null,null,null,null,null,null,null,null,null,null,null,null,null,null,null,null,"","",""]
[null,null,null,null,null,null,null,null,null,null,null,null,null,null,null,null,null,null,null,null,"","",""]
[null,null,null,null,null,null,null,null,null,null,null,null,null,null,null,null,null,null,null,null,"","",""]
[null,null,null,null,null,null,null,null,null,null,null,null,null,null,null,null,null,null,null,null,"","",""]
[null,null,null,null,null,null,null,null,null,null,null,null,null,null,null,null,null,null,null,null,"","",""]
[null,null,null,null,null,null,null,null,null,null,null,null,null,null,null,null,null,null,null,null,"","",""]
[null,null,null,null,null,null,null,null,null,null,null,null,null,null,null,null,null,null,null,null,"","",""]
[null,null,null,null,null,null,null,null,null,null,null,null,null,null,null,null,null,null,null,null,"","",""]
[null,null,null,null,null,null,null,null,null,null,null,null,null,null,null,null,null,null,null,null,"","",""]
[null,null,null,null,null,null,null,null,null,null,null,null,null,null,null,null,null,null,null,null,"","",""]
[null,null,null,null,null,null,null,null,null,null,null,null,null,null,null,null,null,null,null,null,"","",""]
[null,null,null,null,null,null,null,null,null,null,null,null,null,null,null,null,null,null,null,null,"","",""]
[null,null,null,null,null,null,null,null,null,null,null,null,null,null,null,null,null,null,null,null,{"$f":"IF(K710, K710,\"\")","v":""},{"$f":"IF(M710, M710,\"\")","v":""},{"$f":"IF(O710, O710,\"\")","v":""}]
[null,null,null,null,null,null,null,null,null,null,null,null,null,null,null,null,null,null,null,null,"","",""]
[null,null,null,null,null,null,null,null,null,null,null,null,null,null,null,null,null,null,null,null,"","",""]
[null,null,null,null,null,null,null,null,null,null,null,null,null,null,null,null,null,null,null,null,"","",""]
[null,null,null,null,null,null,null,null,null,null,null,null,null,null,null,null,null,null,null,null,"","",""]
[null,null,null,null,null,null,null,null,null,null,null,null,null,null,null,null,null,null,null,null,"","",""]
[null,null,null,null,null,null,null,null,null,null,null,null,null,null,null,null,null,null,null,null,"","",""]
[null,null,null,null,null,null,null,null,null,null,null,null,null,null,null,null,null,null,null,null,"","",""]
[null,null,null,null,null,null,null,null,null,null,null,null,null,null,null,null,null,null,null,null,"","",""]
[null,null,null,null,null,null,null,null,null,null,null,null,null,null,null,null,null,null,null,null,"","",""]
[null,null,null,null,null,null,null,null,null,null,null,null,null,null,null,null,null,null,null,null,"","",""]
[null,null,null,null,null,null,null,null,null,null,null,null,null,null,null,null,null,null,null,null,"","",""]
[null,null,null,null,null,null,null,null,null,null,null,null,null,null,null,null,null,null,null,null,"","",""]
[null,null,null,null,null,null,null,null,null,null,null,null,null,null,null,null,null,null,null,null,"","",""]
[null,null,null,null,null,null,null,null,null,null,null,null,null,null,null,null,null,null,null,null,"","",""]
[null,null,null,null,null,null,null,null,null,null,null,null,null,null,null,null,null,null,null,null,"","",""]
[null,null,null,null,null,null,null,null,null,null,null,null,null,null,null,null,null,null,null,null,"","",""]
[null,null,null,null,null,null,null,null,null,null,null,null,null,null,null,null,null,null,null,null,"","",""]
[null,null,null,null,null,null,null,null,null,null,null,null,null,null,null,null,null,null,null,null,"","",""]
[null,null,null,null,null,null,null,null,null,null,null,null,null,null,null,null,null,null,null,null,"","",""]
[null,null,null,null,null,null,null,null,null,null,null,null,null,null,null,null,null,null,null,null,"","",""]
[null,null,null,null,null,null,null,null,null,null,null,null,null,null,null,null,null,null,null,null,"","",""]
[null,null,null,null,null,null,null,null,null,null,null,null,null,null,null,null,null,null,null,null,"","",""]
[null,null,null,null,null,null,null,null,null,null,null,null,null,null,null,null,null,null,null,null,"","",""]
[null,null,null,null,null,null,null,null,null,null,null,null,null,null,null,null,null,null,null,null,"","",""]
[null,null,null,null,null,null,null,null,null,null,null,null,null,null,null,null,null,null,null,null,"","",""]
[null,null,null,null,null,null,null,null,null,null,null,null,null,null,null,null,null,null,null,null,"","",""]
[null,null,null,null,null,null,null,null,null,null,null,null,null,null,null,null,null,null,null,null,"","",""]
[null,null,null,null,null,null,null,null,null,null,null,null,null,null,null,null,null,null,null,null,"","",""]
[null,null,null,null,null,null,null,null,null,null,null,null,null,null,null,null,null,null,null,null,"","",""]
[null,null,null,null,null,null,null,null,null,null,null,null,null,null,null,null,null,null,null,null,"","",""]
[null,null,null,null,null,null,null,null,null,null,null,null,null,null,null,null,null,null,null,null,"","",""]
[null,null,null,null,null,null,null,null,null,null,null,null,null,null,null,null,null,null,null,null,"","",""]
[null,null,null,null,null,null,null,null,null,null,null,null,null,null,null,null,null,null,null,null,"","",""]
[null,null,null,null,null,null,null,null,null,null,null,null,null,null,null,null,null,null,null,null,"","",""]
[null,null,null,null,null,null,null,null,null,null,null,null,null,null,null,null,null,null,null,null,"","",""]
[null,null,null,null,null,null,null,null,null,null,null,null,null,null,null,null,null,null,null,null,"","",""]
[null,null,null,null,null,null,null,null,null,null,null,null,null,null,null,null,null,null,null,null,"","",""]
[null,null,null,null,null,null,null,null,null,null,null,null,null,null,null,null,null,null,null,null,"","",""]
[null,null,null,null,null,null,null,null,null,null,null,null,null,null,null,null,null,null,null,null,"","",""]
[null,null,null,null,null,null,null,null,null,null,null,null,null,null,null,null,null,null,null,null,"","",""]
[null,null,null,null,null,null,null,null,null,null,null,null,null,null,null,null,null,null,null,null,"","",""]
[null,null,null,null,null,null,null,null,null,null,null,null,null,null,null,null,null,null,null,null,"","",""]
[null,null,null,null,null,null,null,null,null,null,null,null,null,null,null,null,null,null,null,null,"","",""]
[null,null,null,null,null,null,null,null,null,null,null,null,null,null,null,null,null,null,null,null,"","",""]
[null,null,null,null,null,null,null,null,null,null,null,null,null,null,null,null,null,null,null,null,"","",""]
[null,null,null,null,null,null,null,null,null,null,null,null,null,null,null,null,null,null,null,null,"","",""]
[null,null,null,null,null,null,null,null,null,null,null,null,null,null,null,null,null,null,null,null,"","",""]
[null,null,null,null,null,null,null,null,null,null,null,null,null,null,null,null,null,null,null,null,"","",""]
[null,null,null,null,null,null,null,null,null,null,null,null,null,null,null,null,null,null,null,null,"","",""]
[null,null,null,null,null,null,null,null,null,null,null,null,null,null,null,null,null,null,null,null,"","",""]
[null,null,null,null,null,null,null,null,null,null,null,null,null,null,null,null,null,null,null,null,"","",""]
[null,null,null,null,null,null,null,null,null,null,null,null,null,null,null,null,null,null,null,null,"","",""]
[null,null,null,null,null,null,null,null,null,null,null,null,null,null,null,null,null,null,null,null,"","",""]
[null,null,null,null,null,null,null,null,null,null,null,null,null,null,null,null,null,null,null,null,"","",""]
[null,null,null,null,null,null,null,null,null,null,null,null,null,null,null,null,null,null,null,null,"","",""]
[null,null,null,null,null,null,null,null,null,null,null,null,null,null,null,null,null,null,null,null,"","",""]
[null,null,null,null,null,null,null,null,null,null,null,null,null,null,null,null,null,null,null,null,"","",""]
[null,null,null,null,null,null,null,null,null,null,null,null,null,null,null,null,null,null,null,null,"","",""]
[null,null,null,null,null,null,null,null,null,null,null,null,null,null,null,null,null,null,null,null,"","",""]
[null,null,null,null,null,null,null,null,null,null,null,null,null,null,null,null,null,null,null,null,"","",""]
[null,null,null,null,null,null,null,null,null,null,null,null,null,null,null,null,null,null,null,null,"","",""]
[null,null,null,null,null,null,null,null,null,null,null,null,null,null,null,null,null,null,null,null,"","",""]
[null,null,null,null,null,null,null,null,null,null,null,null,null,null,null,null,null,null,null,null,"","",""]
[null,null,null,null,null,null,null,null,null,null,null,null,null,null,null,null,null,null,null,null,{"$f":"IF(K774, K774,\"\")","v":""},{"$f":"IF(M774, M774,\"\")","v":""},{"$f":"IF(O774, O774,\"\")","v":""}]
[null,null,null,null,null,null,null,null,null,null,null,null,null,null,null,null,null,null,null,null,"","",""]
[null,null,null,null,null,null,null,null,null,null,null,null,null,null,null,null,null,null,null,null,"","",""]
[null,null,null,null,null,null,null,null,null,null,null,null,null,null,null,null,null,null,null,null,"","",""]
[null,null,null,null,null,null,null,null,null,null,null,null,null,null,null,null,null,null,null,null,"","",""]
[null,null,null,null,null,null,null,null,null,null,null,null,null,null,null,null,null,null,null,null,"","",""]
[null,null,null,null,null,null,null,null,null,null,null,null,null,null,null,null,null,null,null,null,"","",""]
[null,null,null,null,null,null,null,null,null,null,null,null,null,null,null,null,null,null,null,null,"","",""]
[null,null,null,null,null,null,null,null,null,null,null,null,null,null,null,null,null,null,null,null,"","",""]
[null,null,null,null,null,null,null,null,null,null,null,null,null,null,null,null,null,null,null,null,"","",""]
[null,null,null,null,null,null,null,null,null,null,null,null,null,null,null,null,null,null,null,null,"","",""]
[null,null,null,null,null,null,null,null,null,null,null,null,null,null,null,null,null,null,null,null,"","",""]
[null,null,null,null,null,null,null,null,null,null,null,null,null,null,null,null,null,null,null,null,"","",""]
[null,null,null,null,null,null,null,null,null,null,null,null,null,null,null,null,null,null,null,null,"","",""]
[null,null,null,null,null,null,null,null,null,null,null,null,null,null,null,null,null,null,null,null,"","",""]
[null,null,null,null,null,null,null,null,null,null,null,null,null,null,null,null,null,null,null,null,"","",""]
[null,null,null,null,null,null,null,null,null,null,null,null,null,null,null,null,null,null,null,null,"","",""]
[null,null,null,null,null,null,null,null,null,null,null,null,null,null,null,null,null,null,null,null,"","",""]
[null,null,null,null,null,null,null,null,null,null,null,null,null,null,null,null,null,null,null,null,"","",""]
[null,null,null,null,null,null,null,null,null,null,null,null,null,null,null,null,null,null,null,null,"","",""]
[null,null,null,null,null,null,null,null,null,null,null,null,null,null,null,null,null,null,null,null,"","",""]
[null,null,null,null,null,null,null,null,null,null,null,null,null,null,null,null,null,null,null,null,"","",""]
[null,null,null,null,null,null,null,null,null,null,null,null,null,null,null,null,null,null,null,null,"","",""]
[null,null,null,null,null,null,null,null,null,null,null,null,null,null,null,null,null,null,null,null,"","",""]
[null,null,null,null,null,null,null,null,null,null,null,null,null,null,null,null,null,null,null,null,"","",""]
[null,null,null,null,null,null,null,null,null,null,null,null,null,null,null,null,null,null,null,null,"","",""]
[null,null,null,null,null,null,null,null,null,null,null,null,null,null,null,null,null,null,null,null,"","",""]
[null,null,null,null,null,null,null,null,null,null,null,null,null,null,null,null,null,null,null,null,"","",""]
[null,null,null,null,null,null,null,null,null,null,null,null,null,null,null,null,null,null,null,null,"","",""]
[null,null,null,null,null,null,null,null,null,null,null,null,null,null,null,null,null,null,null,null,"","",""]
[null,null,null,null,null,null,null,null,null,null,null,null,null,null,null,null,null,null,null,null,"","",""]
[null,null,null,null,null,null,null,null,null,null,null,null,null,null,null,null,null,null,null,null,"","",""]
[null,null,null,null,null,null,null,null,null,null,null,null,null,null,null,null,null,null,null,null,"","",""]
[null,null,null,null,null,null,null,null,null,null,null,null,null,null,null,null,null,null,null,null,"","",""]
[null,null,null,null,null,null,null,null,null,null,null,null,null,null,null,null,null,null,null,null,"","",""]
[null,null,null,null,null,null,null,null,null,null,null,null,null,null,null,null,null,null,null,null,"","",""]
[null,null,null,null,null,null,null,null,null,null,null,null,null,null,null,null,null,null,null,null,"","",""]
[null,null,null,null,null,null,null,null,null,null,null,null,null,null,null,null,null,null,null,null,"","",""]
[null,null,null,null,null,null,null,null,null,null,null,null,null,null,null,null,null,null,null,null,"","",""]
[null,null,null,null,null,null,null,null,null,null,null,null,null,null,null,null,null,null,null,null,"","",""]
[null,null,null,null,null,null,null,null,null,null,null,null,null,null,null,null,null,null,null,null,"","",""]
[null,null,null,null,null,null,null,null,null,null,null,null,null,null,null,null,null,null,null,null,"","",""]
[null,null,null,null,null,null,null,null,null,null,null,null,null,null,null,null,null,null,null,null,"","",""]
[null,null,null,null,null,null,null,null,null,null,null,null,null,null,null,null,null,null,null,null,"","",""]
[null,null,null,null,null,null,null,null,null,null,null,null,null,null,null,null,null,null,null,null,"","",""]
[null,null,null,null,null,null,null,null,null,null,null,null,null,null,null,null,null,null,null,null,"","",""]
[null,null,null,null,null,null,null,null,null,null,null,null,null,null,null,null,null,null,null,null,"","",""]
[null,null,null,null,null,null,null,null,null,null,null,null,null,null,null,null,null,null,null,null,"","",""]
[null,null,null,null,null,null,null,null,null,null,null,null,null,null,null,null,null,null,null,null,"","",""]
[null,null,null,null,null,null,null,null,null,null,null,null,null,null,null,null,null,null,null,null,"","",""]
[null,null,null,null,null,null,null,null,null,null,null,null,null,null,null,null,null,null,null,null,"","",""]
[null,null,null,null,null,null,null,null,null,null,null,null,null,null,null,null,null,null,null,null,"","",""]
[null,null,null,null,null,null,null,null,null,null,null,null,null,null,null,null,null,null,null,null,"","",""]
[null,null,null,null,null,null,null,null,null,null,null,null,null,null,null,null,null,null,null,null,"","",""]
[null,null,null,null,null,null,null,null,null,null,null,null,null,null,null,null,null,null,null,null,"","",""]
[null,null,null,null,null,null,null,null,null,null,null,null,null,null,null,null,null,null,null,null,"","",""]
[null,null,null,null,null,null,null,null,null,null,null,null,null,null,null,null,null,null,null,null,"","",""]
[null,null,null,null,null,null,null,null,null,null,null,null,null,null,null,null,null,null,null,null,"","",""]
[null,null,null,null,null,null,null,null,null,null,null,null,null,null,null,null,null,null,null,null,"","",""]
[null,null,null,null,null,null,null,null,null,null,null,null,null,null,null,null,null,null,null,null,"","",""]
[null,null,null,null,null,null,null,null,null,null,null,null,null,null,null,null,null,null,null,null,"","",""]
[null,null,null,null,null,null,null,null,null,null,null,null,null,null,null,null,null,null,null,null,"","",""]
[null,null,null,null,null,null,null,null,null,null,null,null,null,null,null,null,null,null,null,null,"","",""]
[null,null,null,null,null,null,null,null,null,null,null,null,null,null,null,null,null,null,null,null,"","",""]
[null,null,null,null,null,null,null,null,null,null,null,null,null,null,null,null,null,null,null,null,{"$f":"IF(K838, K838,\"\")","v":""},{"$f":"IF(M838, M838,\"\")","v":""},{"$f":"IF(O838, O838,\"\")","v":""}]
[null,null,null,null,null,null,null,null,null,null,null,null,null,null,null,null,null,null,null,null,"","",""]
[null,null,null,null,null,null,null,null,null,null,null,null,null,null,null,null,null,null,null,null,"","",""]
[null,null,null,null,null,null,null,null,null,null,null,null,null,null,null,null,null,null,null,null,"","",""]
[null,null,null,null,null,null,null,null,null,null,null,null,null,null,null,null,null,null,null,null,"","",""]
[null,null,null,null,null,null,null,null,null,null,null,null,null,null,null,null,null,null,null,null,"","",""]
[null,null,null,null,null,null,null,null,null,null,null,null,null,null,null,null,null,null,null,null,"","",""]
[null,null,null,null,null,null,null,null,null,null,null,null,null,null,null,null,null,null,null,null,"","",""]
[null,null,null,null,null,null,null,null,null,null,null,null,null,null,null,null,null,null,null,null,"","",""]
[null,null,null,null,null,null,null,null,null,null,null,null,null,null,null,null,null,null,null,null,"","",""]
[null,null,null,null,null,null,null,null,null,null,null,null,null,null,null,null,null,null,null,null,"","",""]
[null,null,null,null,null,null,null,null,null,null,null,null,null,null,null,null,null,null,null,null,"","",""]
[null,null,null,null,null,null,null,null,null,null,null,null,null,null,null,null,null,null,null,null,"","",""]
[null,null,null,null,null,null,null,null,null,null,null,null,null,null,null,null,null,null,null,null,"","",""]
[null,null,null,null,null,null,null,null,null,null,null,null,null,null,null,null,null,null,null,null,"","",""]
[null,null,null,null,null,null,null,null,null,null,null,null,null,null,null,null,null,null,null,null,"","",""]
[null,null,null,null,null,null,null,null,null,null,null,null,null,null,null,null,null,null,null,null,{"$f":"IF(K854, K854,\"\")","v":""},{"$f":"IF(M854, M854,\"\")","v":""},{"$f":"IF(O854, O854,\"\")","v":""}]
[null,null,null,null,null,null,null,null,null,null,null,null,null,null,null,null,null,null,null,null,{"$f":"IF(K855, K855,\"\")","v":""},{"$f":"IF(M855, M855,\"\")","v":""},{"$f":"IF(O855, O855,\"\")","v":""}]
[null,null,null,null,null,null,null,null,null,null,null,null,null,null,null,null,null,null,null,null,"","",""]
[null,null,null,null,null,null,null,null,null,null,null,null,null,null,null,null,null,null,null,null,"","",""]
[null,null,null,null,null,null,null,null,null,null,null,null,null,null,null,null,null,null,null,null,"","",""]
[null,null,null,null,null,null,null,null,null,null,null,null,null,null,null,null,null,null,null,null,"","",""]
[null,null,null,null,null,null,null,null,null,null,null,null,null,null,null,null,null,null,null,null,"","",""]
[null,null,null,null,null,null,null,null,null,null,null,null,null,null,null,null,null,null,null,null,"","",""]
[null,null,null,null,null,null,null,null,null,null,null,null,null,null,null,null,null,null,null,null,"","",""]
[null,null,null,null,null,null,null,null,null,null,null,null,null,null,null,null,null,null,null,null,"","",""]
[null,null,null,null,null,null,null,null,null,null,null,null,null,null,null,null,null,null,null,null,"","",""]
[null,null,null,null,null,null,null,null,null,null,null,null,null,null,null,null,null,null,null,null,"","",""]
[null,null,null,null,null,null,null,null,null,null,null,null,null,null,null,null,null,null,null,null,"","",""]
[null,null,null,null,null,null,null,null,null,null,null,null,null,null,null,null,null,null,null,null,"","",""]
[null,null,null,null,null,null,null,null,null,null,null,null,null,null,null,null,null,null,null,null,"","",""]
[null,null,null,null,null,null,null,null,null,null,null,null,null,null,null,null,null,null,null,null,"","",""]
[null,null,null,null,null,null,null,null,null,null,null,null,null,null,null,null,null,null,null,null,"","",""]
[null,null,null,null,null,null,null,null,null,null,null,null,null,null,null,null,null,null,null,null,"","",""]
[null,null,null,null,null,null,null,null,null,null,null,null,null,null,null,null,null,null,null,null,"","",""]
[null,null,null,null,null,null,null,null,null,null,null,null,null,null,null,null,null,null,null,null,"","",""]
[null,null,null,null,null,null,null,null,null,null,null,null,null,null,null,null,null,null,null,null,"","",""]
[null,null,null,null,null,null,null,null,null,null,null,null,null,null,null,null,null,null,null,null,"","",""]
[null,null,null,null,null,null,null,null,null,null,null,null,null,null,null,null,null,null,null,null,"","",""]
[null,null,null,null,null,null,null,null,null,null,null,null,null,null,null,null,null,null,null,null,"","",""]
[null,null,null,null,null,null,null,null,null,null,null,null,null,null,null,null,null,null,null,null,"","",""]
[null,null,null,null,null,null,null,null,null,null,null,null,null,null,null,null,null,null,null,null,"","",""]
[null,null,null,null,null,null,null,null,null,null,null,null,null,null,null,null,null,null,null,null,"","",""]
[null,null,null,null,null,null,null,null,null,null,null,null,null,null,null,null,null,null,null,null,"","",""]
[null,null,null,null,null,null,null,null,null,null,null,null,null,null,null,null,null,null,null,null,"","",""]
[null,null,null,null,null,null,null,null,null,null,null,null,null,null,null,null,null,null,null,null,"","",""]
[null,null,null,null,null,null,null,null,null,null,null,null,null,null,null,null,null,null,null,null,"","",""]
[null,null,null,null,null,null,null,null,null,null,null,null,null,null,null,null,null,null,null,null,"","",""]
[null,null,null,null,null,null,null,null,null,null,null,null,null,null,null,null,null,null,null,null,"","",""]
[null,null,null,null,null,null,null,null,null,null,null,null,null,null,null,null,null,null,null,null,"","",""]
[null,null,null,null,null,null,null,null,null,null,null,null,null,null,null,null,null,null,null,null,"","",""]
[null,null,null,null,null,null,null,null,null,null,null,null,null,null,null,null,null,null,null,null,"","",""]
[null,null,null,null,null,null,null,null,null,null,null,null,null,null,null,null,null,null,null,null,"","",""]
[null,null,null,null,null,null,null,null,null,null,null,null,null,null,null,null,null,null,null,null,"","",""]
[null,null,null,null,null,null,null,null,null,null,null,null,null,null,null,null,null,null,null,null,"","",""]
[null,null,null,null,null,null,null,null,null,null,null,null,null,null,null,null,null,null,null,null,"","",""]
[null,null,null,null,null,null,null,null,null,null,null,null,null,null,null,null,null,null,null,null,"","",""]
[null,null,null,null,null,null,null,null,null,null,null,null,null,null,null,null,null,null,null,null,"","",""]
[null,null,null,null,null,null,null,null,null,null,null,null,null,null,null,null,null,null,null,null,"","",""]
[null,null,null,null,null,null,null,null,null,null,null,null,null,null,null,null,null,null,null,null,"","",""]
[null,null,null,null,null,null,null,null,null,null,null,null,null,null,null,null,null,null,null,null,"","",""]
[null,null,null,null,null,null,null,null,null,null,null,null,null,null,null,null,null,null,null,null,"","",""]
[null,null,null,null,null,null,null,null,null,null,null,null,null,null,null,null,null,null,null,null,"","",""]
[null,null,null,null,null,null,null,null,null,null,null,null,null,null,null,null,null,null,null,null,"","",""]
[null,null,null,null,null,null,null,null,null,null,null,null,null,null,null,null,null,null,null,null,"","",""]
[null,null,null,null,null,null,null,null,null,null,null,null,null,null,null,null,null,null,null,null,"","",""]
[null,null,null,null,null,null,null,null,null,null,null,null,null,null,null,null,null,null,null,null,"","",""]
[null,null,null,null,null,null,null,null,null,null,null,null,null,null,null,null,null,null,null,null,"","",""]
[null,null,null,null,null,null,null,null,null,null,null,null,null,null,null,null,null,null,null,null,"","",""]
[null,null,null,null,null,null,null,null,null,null,null,null,null,null,null,null,null,null,null,null,"","",""]
[null,null,null,null,null,null,null,null,null,null,null,null,null,null,null,null,null,null,null,null,"","",""]
[null,null,null,null,null,null,null,null,null,null,null,null,null,null,null,null,null,null,null,null,"","",""]
[null,null,null,null,null,null,null,null,null,null,null,null,null,null,null,null,null,null,null,null,"","",""]
[null,null,null,null,null,null,null,null,null,null,null,null,null,null,null,null,null,null,null,null,"","",""]
[null,null,null,null,null,null,null,null,null,null,null,null,null,null,null,null,null,null,null,null,"","",""]
[null,null,null,null,null,null,null,null,null,null,null,null,null,null,null,null,null,null,null,null,"","",""]
[null,null,null,null,null,null,null,null,null,null,null,null,null,null,null,null,null,null,null,null,"","",""]
[null,null,null,null,null,null,null,null,null,null,null,null,null,null,null,null,null,null,null,null,"","",""]
[null,null,null,null,null,null,null,null,null,null,null,null,null,null,null,null,null,null,null,null,"","",""]
[null,null,null,null,null,null,null,null,null,null,null,null,null,null,null,null,null,null,null,null,"","",""]
[null,null,null,null,null,null,null,null,null,null,null,null,null,null,null,null,null,null,null,null,"","",""]
[null,null,null,null,null,null,null,null,null,null,null,null,null,null,null,null,null,null,null,null,{"$f":"IF(K919, K919,\"\")","v":""},{"$f":"IF(M919, M919,\"\")","v":""},{"$f":"IF(O919, O919,\"\")","v":""}]
[null,null,null,null,null,null,null,null,null,null,null,null,null,null,null,null,null,null,null,null,"","",""]
[null,null,null,null,null,null,null,null,null,null,null,null,null,null,null,null,null,null,null,null,"","",""]
[null,null,null,null,null,null,null,null,null,null,null,null,null,null,null,null,null,null,null,null,"","",""]
[null,null,null,null,null,null,null,null,null,null,null,null,null,null,null,null,null,null,null,null,"","",""]
[null,null,null,null,null,null,null,null,null,null,null,null,null,null,null,null,null,null,null,null,"","",""]
[null,null,null,null,null,null,null,null,null,null,null,null,null,null,null,null,null,null,null,null,"","",""]
[null,null,null,null,null,null,null,null,null,null,null,null,null,null,null,null,null,null,null,null,"","",""]
[null,null,null,null,null,null,null,null,null,null,null,null,null,null,null,null,null,null,null,null,"","",""]
[null,null,null,null,null,null,null,null,null,null,null,null,null,null,null,null,null,null,null,null,"","",""]
[null,null,null,null,null,null,null,null,null,null,null,null,null,null,null,null,null,null,null,null,"","",""]
[null,null,null,null,null,null,null,null,null,null,null,null,null,null,null,null,null,null,null,null,"","",""]
[null,null,null,null,null,null,null,null,null,null,null,null,null,null,null,null,null,null,null,null,"","",""]
[null,null,null,null,null,null,null,null,null,null,null,null,null,null,null,null,null,null,null,null,"","",""]
[null,null,null,null,null,null,null,null,null,null,null,null,null,null,null,null,null,null,null,null,"","",""]
[null,null,null,null,null,null,null,null,null,null,null,null,null,null,null,null,null,null,null,null,"","",""]
[null,null,null,null,null,null,null,null,null,null,null,null,null,null,null,null,null,null,null,null,"","",""]
[null,null,null,null,null,null,null,null,null,null,null,null,null,null,null,null,null,null,null,null,"","",""]
[null,null,null,null,null,null,null,null,null,null,null,null,null,null,null,null,null,null,null,null,"","",""]
[null,null,null,null,null,null,null,null,null,null,null,null,null,null,null,null,null,null,null,null,"","",""]
[null,null,null,null,null,null,null,null,null,null,null,null,null,null,null,null,null,null,null,null,"","",""]
[null,null,null,null,null,null,null,null,null,null,null,null,null,null,null,null,null,null,null,null,"","",""]
[null,null,null,null,null,null,null,null,null,null,null,null,null,null,null,null,null,null,null,null,"","",""]
[null,null,null,null,null,null,null,null,null,null,null,null,null,null,null,null,null,null,null,null,"","",""]
[null,null,null,null,null,null,null,null,null,null,null,null,null,null,null,null,null,null,null,null,"","",""]
[null,null,null,null,null,null,null,null,null,null,null,null,null,null,null,null,null,null,null,null,"","",""]
[null,null,null,null,null,null,null,null,null,null,null,null,null,null,null,null,null,null,null,null,"","",""]
[null,null,null,null,null,null,null,null,null,null,null,null,null,null,null,null,null,null,null,null,"","",""]
[null,null,null,null,null,null,null,null,null,null,null,null,null,null,null,null,null,null,null,null,"","",""]
[null,null,null,null,null,null,null,null,null,null,null,null,null,null,null,null,null,null,null,null,"","",""]
[null,null,null,null,null,null,null,null,null,null,null,null,null,null,null,null,null,null,null,null,"","",""]
[null,null,null,null,null,null,null,null,null,null,null,null,null,null,null,null,null,null,null,null,"","",""]
[null,null,null,null,null,null,null,null,null,null,null,null,null,null,null,null,null,null,null,null,"","",""]
[null,null,null,null,null,null,null,null,null,null,null,null,null,null,null,null,null,null,null,null,"","",""]
[null,null,null,null,null,null,null,null,null,null,null,null,null,null,null,null,null,null,null,null,"","",""]
[null,null,null,null,null,null,null,null,null,null,null,null,null,null,null,null,null,null,null,null,"","",""]
[null,null,null,null,null,null,null,null,null,null,null,null,null,null,null,null,null,null,null,null,"","",""]
[null,null,null,null,null,null,null,null,null,null,null,null,null,null,null,null,null,null,null,null,"","",""]
[null,null,null,null,null,null,null,null,null,null,null,null,null,null,null,null,null,null,null,null,"","",""]
[null,null,null,null,null,null,null,null,null,null,null,null,null,null,null,null,null,null,null,null,"","",""]
[null,null,null,null,null,null,null,null,null,null,null,null,null,null,null,null,null,null,null,null,"","",""]
[null,null,null,null,null,null,null,null,null,null,null,null,null,null,null,null,null,null,null,null,"","",""]
[null,null,null,null,null,null,null,null,null,null,null,null,null,null,null,null,null,null,null,null,"","",""]
[null,null,null,null,null,null,null,null,null,null,null,null,null,null,null,null,null,null,null,null,"","",""]
[null,null,null,null,null,null,null,null,null,null,null,null,null,null,null,null,null,null,null,null,"","",""]
[null,null,null,null,null,null,null,null,null,null,null,null,null,null,null,null,null,null,null,null,"","",""]
[null,null,null,null,null,null,null,null,null,null,null,null,null,null,null,null,null,null,null,null,"","",""]
[null,null,null,null,null,null,null,null,null,null,null,null,null,null,null,null,null,null,null,null,"","",""]
[null,null,null,null,null,null,null,null,null,null,null,null,null,null,null,null,null,null,null,null,"","",""]
[null,null,null,null,null,null,null,null,null,null,null,null,null,null,null,null,null,null,null,null,"","",""]
[null,null,null,null,null,null,null,null,null,null,null,null,null,null,null,null,null,null,null,null,"","",""]
[null,null,null,null,null,null,null,null,null,null,null,null,null,null,null,null,null,null,null,null,"","",""]
[null,null,null,null,null,null,null,null,null,null,null,null,null,null,null,null,null,null,null,null,"","",""]
[null,null,null,null,null,null,null,null,null,null,null,null,null,null,null,null,null,null,null,null,"","",""]
[null,null,null,null,null,null,null,null,null,null,null,null,null,null,null,null,null,null,null,null,"","",""]
[null,null,null,null,null,null,null,null,null,null,null,null,null,null,null,null,null,null,null,null,"","",""]
[null,null,null,null,null,null,null,null,null,null,null,null,null,null,null,null,null,null,null,null,"","",""]
[null,null,null,null,null,null,null,null,null,null,null,null,null,null,null,null,null,null,null,null,"","",""]

{"sheet":"9 - Mit. Strategies Register","index":10,"n_rows":16,"n_cols":19,"rows_kept":16,"cut":false,"hidden":false,"merged":[]}
[null,null,null,null,"SHRP2 Risk Management Template"]
["HELP",null,null,null,"Step 09 - Mitigation Strategies Register"]
[null,null,"NOTE: The order of the risks here is similar to the order of the"]
[null,null,"risks selected for mitigation in Step 05- Unmitigated Risk Register"]
[null,null,"Risk ","Risk Mitigation",null,null,"Implementation Effort",null,null,null,null,"Mitigated Risk Effort",null,null,"Effectiveness of Mitigation Actions"]
["Risk ","Risk Description","Mitigation","Action Description"]
["Label",null,"Label",null,"Mean Cost Change (YOE $M)","Mean Duration Change (YOE $M)","Mean Disruption Change (YOE $M)","Mean Change to Crit. Path (YOE $M)","Mean Severity  (YOE $M)","Mean Cost Change (YOE $M)","Mean Duration Change (YOE $M)","Mean Disruption Change (YOE $M)","Mean Change to Crit. Path (YOE $M)","Mean Severity  (YOE $M)","Mitigated Severity %","Benefit/Cost Ratio","Responsibility","Schedule /Milestone","Comments"]
[]
["SC-6","Provide new lighting throughout project.","SC-6_2","Negotiate cost sharing agreement with the city",0,0,0,0,0,0.28875000000000006,0,0,0,0.30858169678725944,50.000000000000007,"No Cost","Project Director","Midway thru prelim design"]
["RR-3","Unwilling sellers","RR-3_2","Make reasonable early offer",0.05,0,0,0,5.2263936506008857E-2,0.28875000000000006,0,0,0,0.30182423332220121,49.999999999999964,5.7749999999999924,"Project Engineer","Midway thru ROW/Util/RR"]
["CR-2","Additional Maintenance of Traffic required","CR-2_2","Reduce traffic demand during closures",0.05,0,0,0,5.2651102518009564E-2,9.6250000000000002E-2,3.4375000000000003E-2,4.5374999999999999E-3,3.4374999999942563E-2,0.16102039832721377,68.197252483819398,6.558064198481226,"Project Engineer","Midway thru final design"]
["RR-2","Accelerating pace of development in interchange area","RR-2_2","Coordinate with City - stop issuing permits for new develoipments",0,0,0,0,0,0.1575,0.375,0,0.37499999999980854,0.25583034531761062,50.038086249136185,"No Cost","Project Engineer","Midway thru prelim design"]
["PD-11","Cannot use City sewer system for project runoff (or City charges for use).","PD-11_2","Same action as RR8 (affects RR8 and PD11)",0,0,0,0,0,0.1575,9.375E-2,0,9.3749999999952136E-2,0.18742311591572172,50.010855345384769,"No Cost","Project Engineer","Midway thru prelim design"]
["RR-8","QDOT helps City pay for water and sewer-line relocation","RR-8_2","Decide to help City pay for water and sewer line relocation",0,0,0,0,0,0.90825,0,0,0,0.94937440663165085,-57.272727272727359,"No Cost"]
["CR-4","Unable to construct interchange embankments as rapidly as assumed","CR-4_2","Conduct additional investigations and analysis to ddevelop alt techniques",0.1,0,0,0,0.10530220503601913,5.2499999999999998E-2,0.375,0,0.37500000000004791,0.19561410087124037,50.035940820774108,1.8603174012330477,"Project Engineer","Midway thru final design"]
["CR-3","Problems with planned accelerated bridge construction (ABC) technique","CR-3_2","Pre-qualify contractors + require development of ABC technique",0.05,0,0,0,5.2651102518009564E-2,9.6250000000000002E-2,0.171875,0,0.17187499999995215,0.16679964583043327,50.01864387141525,3.1703815474601611,"Project Engineer","Midway thru final design"]

{"sheet":"10 - Mit. Risk Register","index":11,"n_rows":104,"n_cols":22,"rows_kept":104,"cut":false,"hidden":false,"merged":[]}
[null,null,null,"SHRP2 Risk Management Template"]
["HELP",null,null,"Step 10 - Mitigated Risk Register"]
[null,"NOTE: Risks and opportunities are sorted by total severity, though the order should be identical whether using raw severity or percent of total severity"]
["Risk Label","Risk Description","Risk Type","Mean Cost Impact     (CY $M)","Mean Duration Impact (months)","Mean Disruption Impact   \n(M-Hr)","Mean Change to Critical Path Schedule","Mean Severity  (YOE $M)","Percent of Total Mean Severity ","Risk Ranking based on Mean Severity","Retire Risk ?"]
["RR-8","QDOT helps City pay for water and sewer-line relocation","Threat",0.90825,0,0,0,0.94937440663165085,0.15572163780448056,1,"No",null,null,null,null,null,null,null,null,null,{"$f":"ABS(Table245[[#This Row],[Mean Severity  (YOE $M)]])","v":0.94937440663165085},{"$f":"LEFT(Table245[[#This Row],[Risk Label]],2)","v":"RR"}]
["PR-1","Uncertainty in construction-cost inflation rate","Threat",0.57750000000000012,0,0,0,0.61716339357451888,0.1012305511598687,2,"No",null,null,null,null,null,null,null,null,null,{"$f":"ABS(Table245[[#This Row],[Mean Severity  (YOE $M)]])","v":0.61716339357451888},{"$f":"LEFT(Table245[[#This Row],[Risk Label]],2)","v":"PR"}]
["RR-1","Uncertainty in ROW inflation rate","Threat",0.57750000000000012,0,0,0,0.60364846664440241,9.9013758141577271E-2,3,"No",null,null,null,null,null,null,null,null,null,{"$f":"ABS(Table245[[#This Row],[Mean Severity  (YOE $M)]])","v":0.60364846664440241},{"$f":"LEFT(Table245[[#This Row],[Risk Label]],2)","v":"RR"}]
["PD-13","Change in environmental documentation.","Threat",0.13125000000000001,1,0,0.9999999999998086,0.37949026879033604,6.2246091504151932E-2,4,"No",null,null,null,null,null,null,null,null,null,{"$f":"ABS(Table245[[#This Row],[Mean Severity  (YOE $M)]])","v":0.37949026879033604},{"$f":"LEFT(Table245[[#This Row],[Risk Label]],2)","v":"PD"}]
["PR-2","Uncertain Design/Build contracting market conditions at time of bid","Threat",0.29625000000000001,0.25,0,0.24999999999995215,0.37535351374470216,6.1567558075820331E-2,5,"No",null,null,null,null,null,null,null,null,null,{"$f":"ABS(Table245[[#This Row],[Mean Severity  (YOE $M)]])","v":0.37535351374470216},{"$f":"LEFT(Table245[[#This Row],[Risk Label]],2)","v":"PR"}]
["SC-6","Provide new lighting throughout project.","Threat",0.28875000000000006,0,0,0,0.30858169678725944,5.0615275579934352E-2,6,"No",null,null,null,null,null,null,null,null,null,{"$f":"ABS(Table245[[#This Row],[Mean Severity  (YOE $M)]])","v":0.30858169678725944},{"$f":"LEFT(Table245[[#This Row],[Risk Label]],2)","v":"SC"}]
["RR-3","Unwilling sellers","Threat",0.28875000000000006,0,0,0,0.30182423332220121,4.9506879070788636E-2,7,"No",null,null,null,null,null,null,null,null,null,{"$f":"ABS(Table245[[#This Row],[Mean Severity  (YOE $M)]])","v":0.30182423332220121},{"$f":"LEFT(Table245[[#This Row],[Risk Label]],2)","v":"RR"}]
["RR-2","Accelerating pace of development in interchange area","Threat",0.1575,0.375,0,0.37499999999980854,0.25583034531761062,4.1962707330914048E-2,8,"No",null,null,null,null,null,null,null,null,null,{"$f":"ABS(Table245[[#This Row],[Mean Severity  (YOE $M)]])","v":0.25583034531761062},{"$f":"LEFT(Table245[[#This Row],[Risk Label]],2)","v":"RR"}]
["PD-12","Structures impacted by Main Street realignment are eligible for Historic Register.","Threat",0.13125000000000001,0.3125,0,0.3125,0.21316488261655067,3.4964482307061243E-2,9,"No",null,null,null,null,null,null,null,null,null,{"$f":"ABS(Table245[[#This Row],[Mean Severity  (YOE $M)]])","v":0.21316488261655067},{"$f":"LEFT(Table245[[#This Row],[Risk Label]],2)","v":"PD"}]
["CR-4","Unable to construct interchange embankments as rapidly as assumed","Threat",5.2499999999999998E-2,0.375,0,0.37500000000004791,0.19561410087124037,3.2085706073956936E-2,10,"No",null,null,null,null,null,null,null,null,null,{"$f":"ABS(Table245[[#This Row],[Mean Severity  (YOE $M)]])","v":0.19561410087124037},{"$f":"LEFT(Table245[[#This Row],[Risk Label]],2)","v":"CR"}]
["PD-11","Cannot use City sewer system for project runoff (or City charges for use).","Threat",0.1575,9.375E-2,0,9.3749999999952136E-2,0.18742311591572172,3.0742175446213656E-2,11,"No",null,null,null,null,null,null,null,null,null,{"$f":"ABS(Table245[[#This Row],[Mean Severity  (YOE $M)]])","v":0.18742311591572172},{"$f":"LEFT(Table245[[#This Row],[Risk Label]],2)","v":"PD"}]
["PD-14","Delays completing environmental documentation.","Threat",0,0.75000000000000011,0,0.74999999999985645,0.18441227221618048,3.0248320220297737E-2,12,"No",null,null,null,null,null,null,null,null,null,{"$f":"ABS(Table245[[#This Row],[Mean Severity  (YOE $M)]])","v":0.18441227221618048},{"$f":"LEFT(Table245[[#This Row],[Risk Label]],2)","v":"PD"}]
["PD-4","Ground improvement required in interchange area. ","Threat",0.13125000000000001,7.8125E-2,0,7.8125E-2,0.16933020146133226,2.7774475609549494E-2,13,"No",null,null,null,null,null,null,null,null,null,{"$f":"ABS(Table245[[#This Row],[Mean Severity  (YOE $M)]])","v":0.16933020146133226},{"$f":"LEFT(Table245[[#This Row],[Risk Label]],2)","v":"PD"}]
["CR-3","Problems with planned accelerated bridge construction (ABC) technique","Threat",9.6250000000000002E-2,0.171875,0,0.17187499999995215,0.16679964583043327,2.7359399887425216E-2,14,"No",null,null,null,null,null,null,null,null,null,{"$f":"ABS(Table245[[#This Row],[Mean Severity  (YOE $M)]])","v":0.16679964583043327},{"$f":"LEFT(Table245[[#This Row],[Risk Label]],2)","v":"CR"}]
["CR-2","Additional Maintenance of Traffic required","Threat",9.6250000000000002E-2,3.4375000000000003E-2,4.5374999999999999E-3,3.4374999999942563E-2,0.16102039832721377,2.6411455767389576E-2,15,"No",null,null,null,null,null,null,null,null,null,{"$f":"ABS(Table245[[#This Row],[Mean Severity  (YOE $M)]])","v":0.16102039832721377},{"$f":"LEFT(Table245[[#This Row],[Risk Label]],2)","v":"CR"}]
["SC-3","Additional local improvements required. ","Threat",0.10500000000000001,0.18750000000000003,0,0.18749999999990427,0.15828216097404291,2.5962314941225917E-2,16,"No",null,null,null,null,null,null,null,null,null,{"$f":"ABS(Table245[[#This Row],[Mean Severity  (YOE $M)]])","v":0.15828216097404291},{"$f":"LEFT(Table245[[#This Row],[Risk Label]],2)","v":"SC"}]
["SC-5","Replace culvert over Wandering Creek. ","Threat",0.10500000000000001,0,0,0,0.11221152610445796,1.8405554756339759E-2,17,"No",null,null,null,null,null,null,null,null,null,{"$f":"ABS(Table245[[#This Row],[Mean Severity  (YOE $M)]])","v":0.11221152610445796},{"$f":"LEFT(Table245[[#This Row],[Risk Label]],2)","v":"SC"}]
["PD-16","Additional wetland mitigation required for planned alignment.","Threat",0.10500000000000001,0,0,0,0.11221152610445796,1.8405554756339759E-2,18,"No",null,null,null,null,null,null,null,null,null,{"$f":"ABS(Table245[[#This Row],[Mean Severity  (YOE $M)]])","v":0.11221152610445796},{"$f":"LEFT(Table245[[#This Row],[Risk Label]],2)","v":"PD"}]
["RR-7","Telecom utility wants a cost-sharing agreement","Threat",0.10500000000000001,0,0,0,0.10975426666261862,1.8002501480286776E-2,19,"No",null,null,null,null,null,null,null,null,null,{"$f":"ABS(Table245[[#This Row],[Mean Severity  (YOE $M)]])","v":0.10975426666261862},{"$f":"LEFT(Table245[[#This Row],[Risk Label]],2)","v":"RR"}]
["PD-5","Shoulders required on US-555. ","Threat",6.9999999999999993E-2,6.25E-2,0,6.2500000000047864E-2,9.8049624709276778E-2,1.6082641410163138E-2,20,"No",null,null,null,null,null,null,null,null,null,{"$f":"ABS(Table245[[#This Row],[Mean Severity  (YOE $M)]])","v":9.8049624709276778E-2},{"$f":"LEFT(Table245[[#This Row],[Risk Label]],2)","v":"PD"}]
["PD-6","Shoulders required on SH-111.","Threat",6.9999999999999993E-2,6.25E-2,0,6.2500000000047864E-2,9.8049624709276778E-2,1.6082641410163138E-2,21,"No",null,null,null,null,null,null,null,null,null,{"$f":"ABS(Table245[[#This Row],[Mean Severity  (YOE $M)]])","v":9.8049624709276778E-2},{"$f":"LEFT(Table245[[#This Row],[Risk Label]],2)","v":"PD"}]
["CR-5","Difficult foundation installation","Threat",4.3749999999999997E-2,7.8125E-2,0,7.8125E-2,7.5802599643183061E-2,1.2433561389288318E-2,22,"No",null,null,null,null,null,null,null,null,null,{"$f":"ABS(Table245[[#This Row],[Mean Severity  (YOE $M)]])","v":7.5802599643183061E-2},{"$f":"LEFT(Table245[[#This Row],[Risk Label]],2)","v":"CR"}]
["EP-2","Delay obtaining the 404 permit","Threat",0,0.3125,0,0.3125,7.3451630977436261E-2,1.204794251384801E-2,23,"No",null,null,null,null,null,null,null,null,null,{"$f":"ABS(Table245[[#This Row],[Mean Severity  (YOE $M)]])","v":7.3451630977436261E-2},{"$f":"LEFT(Table245[[#This Row],[Risk Label]],2)","v":"EP"}]
["RR-6","Other delays to ROW planning","Threat",0,0.18750000000000003,0,0.18749999999990427,4.551272400547713E-2,7.4652485611253856E-3,24,"No",null,null,null,null,null,null,null,null,null,{"$f":"ABS(Table245[[#This Row],[Mean Severity  (YOE $M)]])","v":4.551272400547713E-2},{"$f":"LEFT(Table245[[#This Row],[Risk Label]],2)","v":"RR"}]
["PD-1","Shift alignment of US 555 at east end of project","Threat",2.6250000000000002E-2,6.25E-2,0,6.2499999999808528E-2,4.2611327308908681E-2,6.9893454376009616E-3,25,"No",null,null,null,null,null,null,null,null,null,{"$f":"ABS(Table245[[#This Row],[Mean Severity  (YOE $M)]])","v":4.2611327308908681E-2},{"$f":"LEFT(Table245[[#This Row],[Risk Label]],2)","v":"PD"}]
["PD-15","Encounter unanticipated contamination in interchange area.","Threat",3.0000000000000006E-2,0,0,0,3.2060436029845138E-2,5.2587299303827901E-3,26,"No",null,null,null,null,null,null,null,null,null,{"$f":"ABS(Table245[[#This Row],[Mean Severity  (YOE $M)]])","v":3.2060436029845138E-2},{"$f":"LEFT(Table245[[#This Row],[Risk Label]],2)","v":"PD"}]
["CR-9","Limited construction staging area in vicinity of interchange","Threat",3.0000000000000006E-2,0,0,0,3.2060436029845138E-2,5.2587299303827901E-3,27,"No",null,null,null,null,null,null,null,null,null,{"$f":"ABS(Table245[[#This Row],[Mean Severity  (YOE $M)]])","v":3.2060436029845138E-2},{"$f":"LEFT(Table245[[#This Row],[Risk Label]],2)","v":"CR"}]
["PR-8","Other problems with D/B contract procurement","Threat",0,7.8125E-2,0,7.8125E-2,1.8357521922402198E-2,3.0111022161747234E-3,28,"No",null,null,null,null,null,null,null,null,null,{"$f":"ABS(Table245[[#This Row],[Mean Severity  (YOE $M)]])","v":1.8357521922402198E-2},{"$f":"LEFT(Table245[[#This Row],[Risk Label]],2)","v":"PR"}]
["PL-2","Opposition to removing access to US-555 fro 12th St.","Threat",1.2500000000000001E-2,0,0,0,1.3358515012435471E-2,2.1911374709928286E-3,29,"No",null,null,null,null,null,null,null,null,null,{"$f":"ABS(Table245[[#This Row],[Mean Severity  (YOE $M)]])","v":1.3358515012435471E-2},{"$f":"LEFT(Table245[[#This Row],[Risk Label]],2)","v":"PL"}]
["CR-7","Colder-than-usual winter ","Threat",0,1.5625E-2,0,1.5624999999952132E-2,5.8071437477329509E-3,9.5251981625610045E-4,30,"No",null,null,null,null,null,null,null,null,null,{"$f":"ABS(Table245[[#This Row],[Mean Severity  (YOE $M)]])","v":5.8071437477329509E-3},{"$f":"LEFT(Table245[[#This Row],[Risk Label]],2)","v":"CR"}]
["CR-1","D/B construction phasing significantly different than assumed","Opportunity",0,-0.5,-2.5000000000000001E-2,-0.50000000000014366,-0.43566608956405839,0.56411460935470881,1,"No",null,null,null,null,null,null,null,null,null,{"$f":"ABS(Table245[[#This Row],[Mean Severity  (YOE $M)]])","v":0.43566608956405839},{"$f":"LEFT(Table245[[#This Row],[Risk Label]],2)","v":"CR"}]
["PD-8","Change in pavement section and/or type.","Opportunity",-0.31500000000000006,0,0,0,-0.3366345783133739,0.43588539064529125,2,"No",null,null,null,null,null,null,null,null,null,{"$f":"ABS(Table245[[#This Row],[Mean Severity  (YOE $M)]])","v":0.3366345783133739},{"$f":"LEFT(Table245[[#This Row],[Risk Label]],2)","v":"PD"}]
["PL-1","Project funding delayed or reduced.","No Impact",0,0,0,0,0,0,null,"No",null,null,null,null,null,null,null,null,null,{"$f":"ABS(Table245[[#This Row],[Mean Severity  (YOE $M)]])","v":0},{"$f":"LEFT(Table245[[#This Row],[Risk Label]],2)","v":"PL"}]
["PL-3","Opposition to \"splitting\" alignment of SH-111 in the interchange area.","No Impact",0,0,0,0,0,0,null,"No",null,null,null,null,null,null,null,null,null,{"$f":"ABS(Table245[[#This Row],[Mean Severity  (YOE $M)]])","v":0},{"$f":"LEFT(Table245[[#This Row],[Risk Label]],2)","v":"PL"}]
["PL-4","Other stakeholder issues not captured separately.","No Impact",0,0,0,0,0,0,null,"No",null,null,null,null,null,null,null,null,null,{"$f":"ABS(Table245[[#This Row],[Mean Severity  (YOE $M)]])","v":0},{"$f":"LEFT(Table245[[#This Row],[Risk Label]],2)","v":"PL"}]
["SC-1","Change in East-West project limits. ","No Impact",0,0,0,0,0,0,null,"No",null,null,null,null,null,null,null,null,null,{"$f":"ABS(Table245[[#This Row],[Mean Severity  (YOE $M)]])","v":0},{"$f":"LEFT(Table245[[#This Row],[Risk Label]],2)","v":"SC"}]
["SC-2","Change in North-South project limits. ","No Impact",0,0,0,0,0,0,null,"No",null,null,null,null,null,null,null,null,null,{"$f":"ABS(Table245[[#This Row],[Mean Severity  (YOE $M)]])","v":0},{"$f":"LEFT(Table245[[#This Row],[Risk Label]],2)","v":"SC"}]
["SC-4","Increased aestethetics for US-555/SH-111 interchange. ","No Impact",0,0,0,0,0,0,null,"No",null,null,null,null,null,null,null,null,null,{"$f":"ABS(Table245[[#This Row],[Mean Severity  (YOE $M)]])","v":0},{"$f":"LEFT(Table245[[#This Row],[Risk Label]],2)","v":"SC"}]
["SC-7","ITS added to this project. ","No Impact",0,0,0,0,0,0,null,"No",null,null,null,null,null,null,null,null,null,{"$f":"ABS(Table245[[#This Row],[Mean Severity  (YOE $M)]])","v":0},{"$f":"LEFT(Table245[[#This Row],[Risk Label]],2)","v":"SC"}]
["PD-2","Split alignment of SH-111 at US-555 interchange. ","No Impact",0,0,0,0,0,0,null,"No",null,null,null,null,null,null,null,null,null,{"$f":"ABS(Table245[[#This Row],[Mean Severity  (YOE $M)]])","v":0},{"$f":"LEFT(Table245[[#This Row],[Risk Label]],2)","v":"PD"}]
["PD-3","Change in configuration of SH 111 / US 555 interchange.","No Impact",0,0,0,0,0,0,null,"No",null,null,null,null,null,null,null,null,null,{"$f":"ABS(Table245[[#This Row],[Mean Severity  (YOE $M)]])","v":0},{"$f":"LEFT(Table245[[#This Row],[Risk Label]],2)","v":"PD"}]
["PD-7","Additional cost for signalized intersections.","No Impact",0,0,0,0,0,0,null,"No",null,null,null,null,null,null,null,null,null,{"$f":"ABS(Table245[[#This Row],[Mean Severity  (YOE $M)]])","v":0},{"$f":"LEFT(Table245[[#This Row],[Risk Label]],2)","v":"PD"}]
["PD-9","Rehabilitate instead of reconstruct existing roadway (e.g., overlay instead).","No Impact",0,0,0,0,0,0,null,"No",null,null,null,null,null,null,null,null,null,{"$f":"ABS(Table245[[#This Row],[Mean Severity  (YOE $M)]])","v":0},{"$f":"LEFT(Table245[[#This Row],[Risk Label]],2)","v":"PD"}]
["PD-10","Change in stormwater design standards.","No Impact",0,0,0,0,0,0,null,"No",null,null,null,null,null,null,null,null,null,{"$f":"ABS(Table245[[#This Row],[Mean Severity  (YOE $M)]])","v":0},{"$f":"LEFT(Table245[[#This Row],[Risk Label]],2)","v":"PD"}]
["EP-1","Challenge to environmental determination or permits","No Impact",0,0,0,0,0,0,null,"No",null,null,null,null,null,null,null,null,null,{"$f":"ABS(Table245[[#This Row],[Mean Severity  (YOE $M)]])","v":0},{"$f":"LEFT(Table245[[#This Row],[Risk Label]],2)","v":"EP"}]
["RR-4","Additional relocation or demolition required","No Impact",0,0,0,0,0,0,null,"No",null,null,null,null,null,null,null,null,null,{"$f":"ABS(Table245[[#This Row],[Mean Severity  (YOE $M)]])","v":0},{"$f":"LEFT(Table245[[#This Row],[Risk Label]],2)","v":"RR"}]
["RR-5","Additional ROW required for planned project","No Impact",0,0,0,0,0,0,null,"No",null,null,null,null,null,null,null,null,null,{"$f":"ABS(Table245[[#This Row],[Mean Severity  (YOE $M)]])","v":0},{"$f":"LEFT(Table245[[#This Row],[Risk Label]],2)","v":"RR"}]
["RR-9","Other utility relocations not completed on time","No Impact",0,0,0,0,0,0,null,"No",null,null,null,null,null,null,null,null,null,{"$f":"ABS(Table245[[#This Row],[Mean Severity  (YOE $M)]])","v":0},{"$f":"LEFT(Table245[[#This Row],[Risk Label]],2)","v":"RR"}]
["RR-10","Damage existing utility or encounter unanticipated utility during construction","No Impact",0,0,0,0,0,0,null,"No",null,null,null,null,null,null,null,null,null,{"$f":"ABS(Table245[[#This Row],[Mean Severity  (YOE $M)]])","v":0},{"$f":"LEFT(Table245[[#This Row],[Risk Label]],2)","v":"RR"}]
["PR-3","Material-supply issues","No Impact",0,0,0,0,0,0,null,"No",null,null,null,null,null,null,null,null,null,{"$f":"ABS(Table245[[#This Row],[Mean Severity  (YOE $M)]])","v":0},{"$f":"LEFT(Table245[[#This Row],[Risk Label]],2)","v":"PR"}]
["PR-4","Change in project delivery method","No Impact",0,0,0,0,0,0,null,"No",null,null,null,null,null,null,null,null,null,{"$f":"ABS(Table245[[#This Row],[Mean Severity  (YOE $M)]])","v":0},{"$f":"LEFT(Table245[[#This Row],[Risk Label]],2)","v":"PR"}]
["PR-5","Accelerate pre-construction activities to reach NTP sooner","No Impact",0,0,0,0,0,0,null,"No",null,null,null,null,null,null,null,null,null,{"$f":"ABS(Table245[[#This Row],[Mean Severity  (YOE $M)]])","v":0},{"$f":"LEFT(Table245[[#This Row],[Risk Label]],2)","v":"PR"}]
["PR-6","Use incentives to accelerate D/B construction","No Impact",0,0,0,0,0,0,null,"No",null,null,null,null,null,null,null,null,null,{"$f":"ABS(Table245[[#This Row],[Mean Severity  (YOE $M)]])","v":0},{"$f":"LEFT(Table245[[#This Row],[Risk Label]],2)","v":"PR"}]
["PR-7","Issues with D/B design or submittals","No Impact",0,0.75000000000000011,0,0,0,0,null,"No",null,null,null,null,null,null,null,null,null,{"$f":"ABS(Table245[[#This Row],[Mean Severity  (YOE $M)]])","v":0},{"$f":"LEFT(Table245[[#This Row],[Risk Label]],2)","v":"PR"}]
["CR-6","Severe weather event significantly impacts construction","No Impact",0,0,0,0,0,0,null,"No",null,null,null,null,null,null,null,null,null,{"$f":"ABS(Table245[[#This Row],[Mean Severity  (YOE $M)]])","v":0},{"$f":"LEFT(Table245[[#This Row],[Risk Label]],2)","v":"CR"}]
["CR-8","Significant accident during construction","No Impact",0,0,0,0,0,0,null,"No",null,null,null,null,null,null,null,null,null,{"$f":"ABS(Table245[[#This Row],[Mean Severity  (YOE $M)]])","v":0},{"$f":"LEFT(Table245[[#This Row],[Risk Label]],2)","v":"CR"}]
["CR-10","Fish window in Wandering Creek","No Impact",0,0,0,0,0,0,null,"No",null,null,null,null,null,null,null,null,null,{"$f":"ABS(Table245[[#This Row],[Mean Severity  (YOE $M)]])","v":0},{"$f":"LEFT(Table245[[#This Row],[Risk Label]],2)","v":"CR"}]
["CR-11","Non-compliance with permits during construction","No Impact",0,0,0,0,0,0,null,"No",null,null,null,null,null,null,null,null,null,{"$f":"ABS(Table245[[#This Row],[Mean Severity  (YOE $M)]])","v":0},{"$f":"LEFT(Table245[[#This Row],[Risk Label]],2)","v":"CR"}]
["CR-12","Extended overheads as a function of project delays","No Impact",0,0,0,0,0,0,null,"No",null,null,null,null,null,null,null,null,null,{"$f":"ABS(Table245[[#This Row],[Mean Severity  (YOE $M)]])","v":0},{"$f":"LEFT(Table245[[#This Row],[Risk Label]],2)","v":"CR"}]
[null,null,null,null,null,null,null,null,null,null,null,null,null,null,null,null,null,null,null,null,{"$f":"ABS(Table245[[#This Row],[Mean Severity  (YOE $M)]])","v":0},{"$f":"LEFT(Table245[[#This Row],[Risk Label]],2)","v":""}]
[null,null,null,null,null,null,null,null,null,null,null,null,null,null,null,null,null,null,null,null,{"$f":"ABS(Table245[[#This Row],[Mean Severity  (YOE $M)]])","v":0},{"$f":"LEFT(Table245[[#This Row],[Risk Label]],2)","v":""}]
[null,null,null,null,null,null,null,null,null,null,null,null,null,null,null,null,null,null,null,null,{"$f":"ABS(Table245[[#This Row],[Mean Severity  (YOE $M)]])","v":0},{"$f":"LEFT(Table245[[#This Row],[Risk Label]],2)","v":""}]
[null,null,null,null,null,null,null,null,null,null,null,null,null,null,null,null,null,null,null,null,{"$f":"ABS(Table245[[#This Row],[Mean Severity  (YOE $M)]])","v":0},{"$f":"LEFT(Table245[[#This Row],[Risk Label]],2)","v":""}]
[null,null,null,null,null,null,null,null,null,null,null,null,null,null,null,null,null,null,null,null,{"$f":"ABS(Table245[[#This Row],[Mean Severity  (YOE $M)]])","v":0},{"$f":"LEFT(Table245[[#This Row],[Risk Label]],2)","v":""}]
[null,null,null,null,null,null,null,null,null,null,null,null,null,null,null,null,null,null,null,null,{"$f":"ABS(Table245[[#This Row],[Mean Severity  (YOE $M)]])","v":0},{"$f":"LEFT(Table245[[#This Row],[Risk Label]],2)","v":""}]
[null,null,null,null,null,null,null,null,null,null,null,null,null,null,null,null,null,null,null,null,{"$f":"ABS(Table245[[#This Row],[Mean Severity  (YOE $M)]])","v":0},{"$f":"LEFT(Table245[[#This Row],[Risk Label]],2)","v":""}]
[null,null,null,null,null,null,null,null,null,null,null,null,null,null,null,null,null,null,null,null,{"$f":"ABS(Table245[[#This Row],[Mean Severity  (YOE $M)]])","v":0},{"$f":"LEFT(Table245[[#This Row],[Risk Label]],2)","v":""}]
[null,null,null,null,null,null,null,null,null,null,null,null,null,null,null,null,null,null,null,null,{"$f":"ABS(Table245[[#This Row],[Mean Severity  (YOE $M)]])","v":0},{"$f":"LEFT(Table245[[#This Row],[Risk Label]],2)","v":""}]
[null,null,null,null,null,null,null,null,null,null,null,null,null,null,null,null,null,null,null,null,{"$f":"ABS(Table245[[#This Row],[Mean Severity  (YOE $M)]])","v":0},{"$f":"LEFT(Table245[[#This Row],[Risk Label]],2)","v":""}]
[null,null,null,null,null,null,null,null,null,null,null,null,null,null,null,null,null,null,null,null,{"$f":"ABS(Table245[[#This Row],[Mean Severity  (YOE $M)]])","v":0},{"$f":"LEFT(Table245[[#This Row],[Risk Label]],2)","v":""}]
[null,null,null,null,null,null,null,null,null,null,null,null,null,null,null,null,null,null,null,null,{"$f":"ABS(Table245[[#This Row],[Mean Severity  (YOE $M)]])","v":0},{"$f":"LEFT(Table245[[#This Row],[Risk Label]],2)","v":""}]
[null,null,null,null,null,null,null,null,null,null,null,null,null,null,null,null,null,null,null,null,{"$f":"ABS(Table245[[#This Row],[Mean Severity  (YOE $M)]])","v":0},{"$f":"LEFT(Table245[[#This Row],[Risk Label]],2)","v":""}]
[null,null,null,null,null,null,null,null,null,null,null,null,null,null,null,null,null,null,null,null,{"$f":"ABS(Table245[[#This Row],[Mean Severity  (YOE $M)]])","v":0},{"$f":"LEFT(Table245[[#This Row],[Risk Label]],2)","v":""}]
[null,null,null,null,null,null,null,null,null,null,null,null,null,null,null,null,null,null,null,null,{"$f":"ABS(Table245[[#This Row],[Mean Severity  (YOE $M)]])","v":0},{"$f":"LEFT(Table245[[#This Row],[Risk Label]],2)","v":""}]
[null,null,null,null,null,null,null,null,null,null,null,null,null,null,null,null,null,null,null,null,{"$f":"ABS(Table245[[#This Row],[Mean Severity  (YOE $M)]])","v":0},{"$f":"LEFT(Table245[[#This Row],[Risk Label]],2)","v":""}]
[null,null,null,null,null,null,null,null,null,null,null,null,null,null,null,null,null,null,null,null,{"$f":"ABS(Table245[[#This Row],[Mean Severity  (YOE $M)]])","v":0},{"$f":"LEFT(Table245[[#This Row],[Risk Label]],2)","v":""}]
[null,null,null,null,null,null,null,null,null,null,null,null,null,null,null,null,null,null,null,null,{"$f":"ABS(Table245[[#This Row],[Mean Severity  (YOE $M)]])","v":0},{"$f":"LEFT(Table245[[#This Row],[Risk Label]],2)","v":""}]
[null,null,null,null,null,null,null,null,null,null,null,null,null,null,null,null,null,null,null,null,{"$f":"ABS(Table245[[#This Row],[Mean Severity  (YOE $M)]])","v":0},{"$f":"LEFT(Table245[[#This Row],[Risk Label]],2)","v":""}]
[null,null,null,null,null,null,null,null,null,null,null,null,null,null,null,null,null,null,null,null,{"$f":"ABS(Table245[[#This Row],[Mean Severity  (YOE $M)]])","v":0},{"$f":"LEFT(Table245[[#This Row],[Risk Label]],2)","v":""}]
[null,null,null,null,null,null,null,null,null,null,null,null,null,null,null,null,null,null,null,null,{"$f":"ABS(Table245[[#This Row],[Mean Severity  (YOE $M)]])","v":0},{"$f":"LEFT(Table245[[#This Row],[Risk Label]],2)","v":""}]
[null,null,null,null,null,null,null,null,null,null,null,null,null,null,null,null,null,null,null,null,{"$f":"ABS(Table245[[#This Row],[Mean Severity  (YOE $M)]])","v":0},{"$f":"LEFT(Table245[[#This Row],[Risk Label]],2)","v":""}]
[null,null,null,null,null,null,null,null,null,null,null,null,null,null,null,null,null,null,null,null,{"$f":"ABS(Table245[[#This Row],[Mean Severity  (YOE $M)]])","v":0},{"$f":"LEFT(Table245[[#This Row],[Risk Label]],2)","v":""}]
[null,null,null,null,null,null,null,null,null,null,null,null,null,null,null,null,null,null,null,null,{"$f":"ABS(Table245[[#This Row],[Mean Severity  (YOE $M)]])","v":0},{"$f":"LEFT(Table245[[#This Row],[Risk Label]],2)","v":""}]
[null,null,null,null,null,null,null,null,null,null,null,null,null,null,null,null,null,null,null,null,{"$f":"ABS(Table245[[#This Row],[Mean Severity  (YOE $M)]])","v":0},{"$f":"LEFT(Table245[[#This Row],[Risk Label]],2)","v":""}]
[null,null,null,null,null,null,null,null,null,null,null,null,null,null,null,null,null,null,null,null,{"$f":"ABS(Table245[[#This Row],[Mean Severity  (YOE $M)]])","v":0},{"$f":"LEFT(Table245[[#This Row],[Risk Label]],2)","v":""}]
[null,null,null,null,null,null,null,null,null,null,null,null,null,null,null,null,null,null,null,null,{"$f":"ABS(Table245[[#This Row],[Mean Severity  (YOE $M)]])","v":0},{"$f":"LEFT(Table245[[#This Row],[Risk Label]],2)","v":""}]
[null,null,null,null,null,null,null,null,null,null,null,null,null,null,null,null,null,null,null,null,{"$f":"ABS(Table245[[#This Row],[Mean Severity  (YOE $M)]])","v":0},{"$f":"LEFT(Table245[[#This Row],[Risk Label]],2)","v":""}]
[null,null,null,null,null,null,null,null,null,null,null,null,null,null,null,null,null,null,null,null,{"$f":"ABS(Table245[[#This Row],[Mean Severity  (YOE $M)]])","v":0},{"$f":"LEFT(Table245[[#This Row],[Risk Label]],2)","v":""}]
[null,null,null,null,null,null,null,null,null,null,null,null,null,null,null,null,null,null,null,null,{"$f":"ABS(Table245[[#This Row],[Mean Severity  (YOE $M)]])","v":0},{"$f":"LEFT(Table245[[#This Row],[Risk Label]],2)","v":""}]
[null,null,null,null,null,null,null,null,null,null,null,null,null,null,null,null,null,null,null,null,{"$f":"ABS(Table245[[#This Row],[Mean Severity  (YOE $M)]])","v":0},{"$f":"LEFT(Table245[[#This Row],[Risk Label]],2)","v":""}]
[null,null,null,null,null,null,null,null,null,null,null,null,null,null,null,null,null,null,null,null,{"$f":"ABS(Table245[[#This Row],[Mean Severity  (YOE $M)]])","v":0},{"$f":"LEFT(Table245[[#This Row],[Risk Label]],2)","v":""}]
[null,null,null,null,null,null,null,null,null,null,null,null,null,null,null,null,null,null,null,null,{"$f":"ABS(Table245[[#This Row],[Mean Severity  (YOE $M)]])","v":0},{"$f":"LEFT(Table245[[#This Row],[Risk Label]],2)","v":""}]
[null,null,null,null,null,null,null,null,null,null,null,null,null,null,null,null,null,null,null,null,{"$f":"ABS(Table245[[#This Row],[Mean Severity  (YOE $M)]])","v":0},{"$f":"LEFT(Table245[[#This Row],[Risk Label]],2)","v":""}]
[null,null,null,null,null,null,null,null,null,null,null,null,null,null,null,null,null,null,null,null,{"$f":"ABS(Table245[[#This Row],[Mean Severity  (YOE $M)]])","v":0},{"$f":"LEFT(Table245[[#This Row],[Risk Label]],2)","v":""}]
[null,null,null,null,null,null,null,null,null,null,null,null,null,null,null,null,null,null,null,null,{"$f":"ABS(Table245[[#This Row],[Mean Severity  (YOE $M)]])","v":0},{"$f":"LEFT(Table245[[#This Row],[Risk Label]],2)","v":""}]
[null,null,null,null,null,null,null,null,null,null,null,null,null,null,null,null,null,null,null,null,{"$f":"ABS(Table245[[#This Row],[Mean Severity  (YOE $M)]])","v":0},{"$f":"LEFT(Table245[[#This Row],[Risk Label]],2)","v":""}]
[null,null,null,null,null,null,null,null,null,null,null,null,null,null,null,null,null,null,null,null,{"$f":"ABS(Table245[[#This Row],[Mean Severity  (YOE $M)]])","v":0},{"$f":"LEFT(Table245[[#This Row],[Risk Label]],2)","v":""}]
[null,null,null,null,null,null,null,null,null,null,null,null,null,null,null,null,null,null,null,null,{"$f":"ABS(Table245[[#This Row],[Mean Severity  (YOE $M)]])","v":0},{"$f":"LEFT(Table245[[#This Row],[Risk Label]],2)","v":""}]
[null,null,null,null,null,null,null,null,null,null,null,null,null,null,null,null,null,null,null,null,{"$f":"ABS(Table245[[#This Row],[Mean Severity  (YOE $M)]])","v":0},{"$f":"LEFT(Table245[[#This Row],[Risk Label]],2)","v":""}]
[null,null,null,null,null,null,null,null,null,null,null,null,null,null,null,null,null,null,null,null,{"$f":"ABS(Table245[[#This Row],[Mean Severity  (YOE $M)]])","v":0},{"$f":"LEFT(Table245[[#This Row],[Risk Label]],2)","v":""}]

{"sheet":"11 - Mit. Project Performance","index":12,"n_rows":41,"n_cols":14,"rows_kept":41,"cut":false,"hidden":false,"merged":[]}
[null,null,null,null,null,"SHRP2 Risk Management Template"]
["HELP",null,null,null,null,"Step 11 - Mitigated Project Performance"]
[null,"Schedule Duration Assumption:"]
[null,"Some risks in a phase will occur concurrently, while others will occur sequentially."]
[]
[]
["Mitigated Project Cost, Duration, and Disruption Performance"]
["Project Phase",null,"Base + Implementation",null,null,"Residual Risk",null,null,"Total (Base + Implementation + Residual Risk)"]
[null,"Cost \n(CY $M)","Duration (months)","Disruption (M-hrs)","Cost \n(CY $M)","Duration (months)","Disruption (M-hrs)","Cost \n(CY $M)","Duration (months)","Disruption (M-hrs)","Cost \n(YOE $M)"]
["Planning",0,0,0,0,0,0,0,0,0,0]
["Scoping",0,0,0,0,0,0,0,0,0,0]
["Prelim Design/Environmental Process",1.19,12,0,0.13125000000000001,1.46875,0,1.32125,13.46875,0,1.3433226831215848]
["Environmental Permits",0,6,0,0,0.3125,0,0,6.3125,0,0]
["ROW/Util/RR",3.05,12,0.2,2.3520000000000003,0.703125,0,5.4020000000000001,12.703125,0.2,5.6719397290265592]
["Final Design",0.2,6,0,0,0.75000000000000011,0,0.2,6.75,0,0.21192816197714981]
["Procurement",0,6,0,0.21718749999998088,0.2890625,0,0.21718749999998088,6.2890625,0,0.22636355275441536]
["Construction",11.85,16,0.5,1.879726562500015,0.37656250000000002,-2.0462500000000002E-2,13.729726562500014,16.376562499999999,0.47953750000000001,14.758144848923294]
["Operations & Maintenance",0,600,1.4000000000000001,0,0,0,0,600,1.4000000000000001]
["Replacement",0,0,0.7,0,0,0,0,0,0.7]
["Total (through Construction)",16.29,null,0.7,4.5801640624999962,null,-2.0462500000000002E-2,20.870164062499995,null,0.67953750000000002,22.211698975803003]
["Total (through Replacement)",16.29,null,2.8,4.5801640624999962,null,-2.0462500000000002E-2,20.870164062499995,null,2.7795375,22.211698975803003]
[]
["Project Schedule Performance (Unmitigated vs. Mitigated)"]
["Project Phase",null,null,"Unmitigated Project Schedule Performance (from step 6)",null,null,null,null,null,"Mitigated Project Schedule Performance",null,null,null,"Mean"]
[null,"Duration\n(Months/\nDate)","Early Start","Early Finish","Late Start","Late Finish","Float (months)","Duration\n(Months/\nDate)","Early Start","Early Finish","Late Start","Late Finish","Float (months)","Severity YOE($M)"]
["Planning",0,{"$f":"'1 - Project Structuring'!$E$15","v":40148},{"$f":"IF(OR(C26=\"\",B26=\"\"),\"\",C26+(B26*30.4))","v":40148},{"$f":"IF(OR(F26=\"\",B26=\"\"),\"\",F26-(B26*30.4))","v":40148},{"$f":"IF(E27 = \"\", \"\",E27)","v":40148},{"$f":"IF(OR(F26 =\"\",D26 =\"\"),\"\",(F26-D26)/30.4)","v":0},0,{"$f":"'1 - Project Structuring'!$E$15","v":40148},{"$f":"IF(OR(I26=\"\",H26=\"\"),\"\",I26+(H26*30.4))","v":40148},{"$f":"IF(OR(L26=\"\",H26=\"\"),\"\",L26-(H26*30.4))","v":40148},{"$f":"IF(K27 = \"\", \"\",K27)","v":40148},{"$f":"IF(OR(L26 =\"\",J26 =\"\"),\"\",(L26-J26)/30.4)","v":0},{"$f":"SUMIFS('10 - Mit. Risk Register'!$H$5:$H$104,'10 - Mit. Risk Register'!$V$5:$V$104,\"PL\")","v":1.3358515012435471E-2}]
["Scoping",0,{"$f":"IF(D26=\"\",\"\",D26)","v":40148},{"$f":"IF(OR(C27=\"\",B27=\"\"),\"\",C27+(B27*30.4))","v":40148},{"$f":"IF(OR(F27=\"\",B27=\"\"),\"\",F27-(B27*30.4))","v":40148},{"$f":"IF(E29 = \"\", \"\",E29)","v":40148},{"$f":"IF(OR(F27 =\"\",D27 =\"\"),\"\",(F27-D27)/30.4)","v":0},0,{"$f":"IF(J26=\"\",\"\",J26)","v":40148},{"$f":"IF(OR(I27=\"\",H27=\"\"),\"\",I27+(H27*30.4))","v":40148},{"$f":"IF(OR(L27=\"\",H27=\"\"),\"\",L27-(H27*30.4))","v":40148},{"$f":"IF(K29 = \"\", \"\",K29)","v":40148},{"$f":"IF(OR(L27 =\"\",J27 =\"\"),\"\",(L27-J27)/30.4)","v":0},{"$f":"SUMIFS('10 - Mit. Risk Register'!$H$5:$H$104,'10 - Mit. Risk Register'!$V$5:$V$104,\"SC\")","v":0.5790753838657603}]
["Design Funding Date",40148,null,{"$f":"IF(B28 =\"\", \"\",B28)","v":40148},null,{"$f":"IF(E29 = \"\", \"\",E29)","v":40148},0,40148,null,{"$f":"IF(H28 =\"\", \"\",H28)","v":40148},null,{"$f":"IF(K29 = \"\", \"\",K29)","v":40148},0,{"$f":"SUMIFS('10 - Mit. Risk Register'!$H$5:$H$104,'10 - Mit. Risk Register'!$V$5:$V$104,\"F1\")","v":0}]
["Prelim Design/Environmental Process",13.46875,{"$f":"IF(OR(D28=\"\",D27=\"\"),\"\",MAX(D28,D27))","v":40148},{"$f":"IF(OR(C29=\"\",B29=\"\"),\"\",C29+(B29*30.4))","v":40557.449999999997},{"$f":"IF(OR(F29=\"\",B29=\"\"),\"\",F29-(B29*30.4))","v":40148},{"$f":"IF(OR(E30=\"\",E32=\"\",E34=\"\"),\"\",MIN(E30,E32,E34))","v":40557.449999999997},0,13.46875,{"$f":"IF(OR(J28=\"\",J27=\"\"),\"\",MAX(J28,J27))","v":40148},{"$f":"IF(OR(I29=\"\",H29=\"\"),\"\",I29+(H29*30.4))","v":40557.449999999997},{"$f":"IF(OR(L29=\"\",H29=\"\"),\"\",L29-(H29*30.4))","v":40148},{"$f":"IF(OR(K30=\"\",K32=\"\",K34=\"\"),\"\",MIN(K30,K32,K34))","v":40557.449999999997},0,{"$f":"SUMIFS('10 - Mit. Risk Register'!$H$5:$H$104,'10 - Mit. Risk Register'!$V$5:$V$104,\"PD\")","v":1.1801687015485127}]
["Environmental Permits",6.3125,{"$f":"IF(D29=\"\",\"\",D29)","v":40557.449999999997},{"$f":"IF(OR(C30=\"\",B30=\"\"),\"\",C30+(B30*30.4))","v":40749.35},{"$f":"IF(OR(F30=\"\",B30=\"\"),\"\",F30-(B30*30.4))","v":40582.149999999994},{"$f":"IF(OR(E36=\"\",F34=\"\",F32=\"\"),\"\",MIN(E36,F34-('1 - Project Structuring'!$J$39*30.4)+('1 - Project Structuring'!$J$38*30.4),F32-('1 - Project Structuring'!$J$41*30.4)+('1 - Project Structuring'!$J$40*30.4)))","v":40774.049999999996},0.8124999999999043,6.3125,{"$f":"IF(J29=\"\",\"\",J29)","v":40557.449999999997},{"$f":"IF(OR(I30=\"\",H30=\"\"),\"\",I30+(H30*30.4))","v":40749.35},{"$f":"IF(OR(L30=\"\",H30=\"\"),\"\",L30-(H30*30.4))","v":40569.324999999997},{"$f":"IF(OR(K36=\"\",L34=\"\",L32=\"\"),\"\",MIN(K36,L34-('1 - Project Structuring'!$J$39*30.4)+('1 - Project Structuring'!$J$38*30.4),L32-('1 - Project Structuring'!$J$41*30.4)+('1 - Project Structuring'!$J$40*30.4)))","v":40761.224999999999},0.390625,{"$f":"SUMIFS('10 - Mit. Risk Register'!$H$5:$H$104,'10 - Mit. Risk Register'!$V$5:$V$104,\"EP\")","v":7.3451630977436261E-2}]
["ROW/Util/RR Funding Date",40148,null,{"$f":"IF(B31=\"\",\"\",B31)","v":40148},null,{"$f":"IF(OR(F32=\"\"),\"\",F32-('1 - Project Structuring'!$J$42*30.4))","v":40956.449999999997},26.593749999999904,40148,null,{"$f":"IF(H31=\"\",\"\",H31)","v":40148},null,{"$f":"IF(OR(L32=\"\"),\"\",L32-('1 - Project Structuring'!$J$42*30.4))","v":40943.625},26.171875,{"$f":"SUMIFS('10 - Mit. Risk Register'!$H$5:$H$104,'10 - Mit. Risk Register'!$V$5:$V$104,\"F2\")","v":0}]
["ROW/Util/RR",13.125,{"$f":"IF(D29=\"\",\"\",D29)","v":40557.449999999997},{"$f":"IF(OR(C32=\"\",B32=\"\",D31=\"\"),\"\",MAX(C32+(B32*30.4),D31+('1 - Project Structuring'!$J$42*30.4),D30-('1 - Project Structuring'!$J$40*30.4)+('1 - Project Structuring'!$J$41*30.4)))","v":40956.449999999997},{"$f":"IF(OR(F32=\"\",B32=\"\"),\"\",F32-(B32*30.4))","v":40557.449999999997},{"$f":"IF(OR(E36=\"\",F36=\"\"),\"\",MIN(E36+('1 - Project Structuring'!$J$43*30.4),F36-('1 - Project Structuring'!$J$46*30.4),F34-('1 - Project Structuring'!$J$48*30.4)+('1 - Project Structuring'!$J$47*30.4)))","v":40956.449999999997},0,12.703125,{"$f":"IF(J29=\"\",\"\",J29)","v":40557.449999999997},{"$f":"IF(OR(I32=\"\",H32=\"\",J31=\"\"),\"\",MAX(I32+(H32*30.4),J31+('1 - Project Structuring'!$J$42*30.4),J30-('1 - Project Structuring'!$J$40*30.4)+('1 - Project Structuring'!$J$41*30.4)))","v":40943.625},{"$f":"IF(OR(L32=\"\",H32=\"\"),\"\",L32-(H32*30.4))","v":40557.449999999997},{"$f":"IF(OR(K36=\"\",L36=\"\"),\"\",MIN(K36+('1 - Project Structuring'!$J$43*30.4),L36-('1 - Project Structuring'!$J$46*30.4),L34-('1 - Project Structuring'!$J$48*30.4)+('1 - Project Structuring'!$J$47*30.4)))","v":40943.625},0,{"$f":"SUMIFS('10 - Mit. Risk Register'!$H$5:$H$104,'10 - Mit. Risk Register'!$V$5:$V$104,\"RR\")","v":2.2659444425839612}]
["Construction Funding Date",40148,null,{"$f":"IF(B33=\"\",\"\",B33)","v":40148},null,{"$f":"IF(E34=\"\",\"\",E34)","v":40582.862499999996},14.304687499999858,40148,null,{"$f":"IF(H33=\"\",\"\",H33)","v":40148},null,{"$f":"IF(K34=\"\",\"\",K34)","v":40570.037499999999},13.882812499999952,{"$f":"SUMIFS('10 - Mit. Risk Register'!$H$5:$H$104,'10 - Mit. Risk Register'!$V$5:$V$104,\"F3\")","v":0}]
["Procurement",6.2890625,{"$f":"IF(OR(D33=\"\",D29=\"\"),\"\",MAX(D33,D29))","v":40557.449999999997},{"$f":"IF(OR(C34=\"\",B34=\"\",D30=\"\",D32=\"\"),\"\",MAX(C34+(B34*30.4),D30-('1 - Project Structuring'!$J$38*30.4)+('1 - Project Structuring'!$J$39*30.4),D32-('1 - Project Structuring'!$J$47*30.4)+('1 - Project Structuring'!$J$48*30.4)))","v":40774.049999999996},{"$f":"IF(OR(F34=\"\",B34=\"\"),\"\",F34-(B34*30.4))","v":40582.862499999996},{"$f":"IF(E35=\"\",\"\",E35)","v":40774.049999999996},0,6.2890625,{"$f":"IF(OR(J33=\"\",J29=\"\"),\"\",MAX(J33,J29))","v":40557.449999999997},{"$f":"IF(OR(I34=\"\",H34=\"\",J30=\"\",J32=\"\"),\"\",MAX(I34+(H34*30.4),J30-('1 - Project Structuring'!$J$38*30.4)+('1 - Project Structuring'!$J$39*30.4),J32-('1 - Project Structuring'!$J$47*30.4)+('1 - Project Structuring'!$J$48*30.4)))","v":40761.224999999999},{"$f":"IF(OR(L34=\"\",H34=\"\"),\"\",L34-(H34*30.4))","v":40570.037499999999},{"$f":"IF(K35=\"\",\"\",K35)","v":40761.224999999999},0,{"$f":"SUMIFS('10 - Mit. Risk Register'!$H$5:$H$104,'10 - Mit. Risk Register'!$V$5:$V$104,\"PR\")","v":1.0108744292416232}]
["Final Design",6.75,{"$f":"IF(D34=\"\",\"\",D34)","v":40774.049999999996},{"$f":"IF(OR(C35=\"\",B35=\"\"),\"\",C35+(B35*30.4))","v":40979.249999999993},{"$f":"IF(OR(F35=\"\",B35=\"\",E36=\"\"),\"\",MIN(F35-(B35*30.4),E36-('1 - Project Structuring'!$J$44*30.4)))","v":40774.049999999996},{"$f":"IF(OR(F36=\"\"),\"\",F36-('1 - Project Structuring'!$J$45*30.4))","v":41134.432499999995},5.104687500000086,6.75,{"$f":"IF(J34=\"\",\"\",J34)","v":40761.224999999999},{"$f":"IF(OR(I35=\"\",H35=\"\"),\"\",I35+(H35*30.4))","v":40966.424999999996},{"$f":"IF(OR(L35=\"\",H35=\"\",K36=\"\"),\"\",MIN(L35-(H35*30.4),K36-('1 - Project Structuring'!$J$44*30.4)))","v":40761.224999999999},{"$f":"IF(OR(L36=\"\"),\"\",L36-('1 - Project Structuring'!$J$45*30.4))","v":41107.072500000002},4.6265625000002109,{"$f":"SUMIFS('10 - Mit. Risk Register'!$H$5:$H$104,'10 - Mit. Risk Register'!$V$5:$V$104,\"FD\")","v":0}]
["Construction",16.854687500000001,{"$f":"IF(OR(D30=\"\",C35=\"\",,D32=\"\"),\"\",MAX(D30,C35+('1 - Project Structuring'!$J$44*30.4),D32-('1 - Project Structuring'!$J$43*30.4)))","v":40804.449999999997},{"$f":"IF(OR(C36=\"\",B36=\"\",D35=\"\",D32=\"\"),\"\",MAX(C36+(B36*30.4),D35+('1 - Project Structuring'!$J$45*30.4),D32+('1 - Project Structuring'!$J$46*30.4)))","v":41316.832499999997},{"$f":"IF(OR(F36=\"\",B36=\"\"),\"\",F36-(B36*30.4))","v":40804.449999999997},{"$f":"IF(D36=\"\",\"\",D36)","v":41316.832499999997},0,16.376562499999999,{"$f":"IF(OR(J30=\"\",I35=\"\",,J32=\"\"),\"\",MAX(J30,I35+('1 - Project Structuring'!$J$44*30.4),J32-('1 - Project Structuring'!$J$43*30.4)))","v":40791.625},{"$f":"IF(OR(I36=\"\",H36=\"\",J35=\"\",J32=\"\"),\"\",MAX(I36+(H36*30.4),J35+('1 - Project Structuring'!$J$45*30.4),J32+('1 - Project Structuring'!$J$46*30.4)))","v":41289.472500000003},{"$f":"IF(OR(L36=\"\",H36=\"\"),\"\",L36-(H36*30.4))","v":40791.625},{"$f":"IF(J36=\"\",\"\",J36)","v":41289.472500000003},0,{"$f":"SUMIFS('10 - Mit. Risk Register'!$H$5:$H$104,'10 - Mit. Risk Register'!$V$5:$V$104,\"CR\")","v":0.2014382348855901}]
["Operations & Maintenance",600,{"$f":"IF(OR(C36=\"\",B36=\"\"),\"\",C36+(B36*30.4))","v":41316.832499999997},{"$f":"IF(OR(C37=\"\",B37=\"\"),\"\",C37+(B37*30.4))","v":59556.832499999997},{"$f":"IF(OR(F37=\"\",B37=\"\"),\"\",F37-(B37*30.4))","v":41316.832499999997},{"$f":"IF(E38=\"\",\"\",E38)","v":59556.832499999997},null,600,{"$f":"IF(OR(I36=\"\",H36=\"\"),\"\",I36+(H36*30.4))","v":41289.472500000003},{"$f":"IF(OR(I37=\"\",H37=\"\"),\"\",I37+(H37*30.4))","v":59529.472500000003},{"$f":"IF(OR(L37=\"\",H37=\"\"),\"\",L37-(H37*30.4))","v":41289.472500000003},{"$f":"IF(K38=\"\",\"\",K38)","v":59529.472500000003}]
["Replacement",0,{"$f":"IF(D37=\"\",\"\",D37)","v":59556.832499999997},{"$f":"IF(OR(C38=\"\",B38=\"\"),\"\",C38+(B38*30.4))","v":59556.832499999997},{"$f":"IF(OR(F38=\"\",B38=\"\"),\"\",F38-(B38*30.4))","v":59556.832499999997},{"$f":"IF(D38=\"\",\"\",D38)","v":59556.832499999997},null,0,{"$f":"IF(J37=\"\",\"\",J37)","v":59529.472500000003},{"$f":"IF(OR(I38=\"\",H38=\"\"),\"\",I38+(H38*30.4))","v":59529.472500000003},{"$f":"IF(OR(L38=\"\",H38=\"\"),\"\",L38-(H38*30.4))","v":59529.472500000003},{"$f":"IF(J38=\"\",\"\",J38)","v":59529.472500000003}]
["Project Start Date",40148,null,null,null,null,null,40148,null,null,null,null,"Total",{"$f":"SUM('11 - Mit. Project Performance'!$N$26:$N$38)","v":5.3243113381153186}]
["Construction Finish Date",41316.832499999997,null,null,null,null,null,41289.472500000003]
["Project Duration (months)",38.448437499999898,null,null,null,null,null,37.548437500000119]

{"sheet":"12 - Mit. Risk Ranking Plots","index":13,"n_rows":2,"n_cols":13,"rows_kept":2,"cut":false,"hidden":false,"merged":[]}
[null,null,null,null,null,null,null,null,null,null,null,null,"SHRP2 Risk Management Template"]
["HELP",null,null,null,null,null,null,null,null,null,null,null,"Step 12 - Mitigated Risk Ranking Plots"]

{"sheet":"13 - Summary Report","index":14,"n_rows":441,"n_cols":147,"rows_kept":441,"cut":false,"hidden":false,"merged":[]}
[null,null,null,null,null,null,"SHRP2 Risk Management Template",null,null,null,null,null,null,null,null,null,null,null,null,null,null,null,null,null,null,null,null,null,null,null,null,null,null,null,null,null,null,null,null,null,null,null,null,null,null,null,null,null,null,null,null,null,null,"UNMITIGATED PERFORMANCE RESULTS",null,null,null,null,null,null,null,null,null,null,null,null,null,null,null,null,null,null,null,null,null,null,null,null,null,null,null,null,null,null,null,null,null,null,null,null,null,null,null,null,null,null,null,null,null,null,null,"MITIGATED PERFORMANCE RESULTS"]
["HELP",null,null,null,null,null,"Summary Report",null,null,null,null,null,null,null,null,null,null,null,null,null,null,null,null,null,null,null,null,null,null,null,null,null,null,null,null,null,null,null,null,null,null,null,null,null,null,null,null,null,null,null,null,null,null,null,null,null,null,null,null,"Project Performance",null,null,null,null,null,null,null,null,null,null,null,null,null,null,null,null,null,null,null,null,null,null,null,null,null,null,null,null,null,null,null,null,null,null,null,null,null,null,null,null,null,null,null,null,null,"Project Performance"]
[null,null,null,null,null,null,null,null,null,null,null,null,null,null,null,null,null,null,"PROJECT INFORMATION",null,null,null,null,null,null,null,null,null,null,null,null,null,null,null,null,null,null,null,null,null,null,null,null,null,null,null,null,null,null,null,null,null,null,"Project Phase",null,"Base",null,null,"Risk",null,null,"Total (Base + Risk) ",null,null,null,null,null,null,null,null,null,null,null,null,null,null,null,null,null,null,null,null,null,null,null,null,null,null,null,null,null,null,null,null,null,null,null,null,null,null,null,"Project Phase",null,"Base + Implementation",null,null,"Residual Risk",null,null,null,"Total"]
[null,null,null,null,null,null,null,null,null,null,null,null,null,null,null,null,"Information Type",null,"Value",null,null,null,null,null,null,null,null,null,null,null,null,null,null,null,null,null,null,null,null,null,null,null,null,null,null,null,null,null,null,null,null,null,null,null,"Cost \n(CY $M)","Duration (months)","Disruption (M-hrs)","Cost \n(CY $M)","Duration (months)","Disruption (M-hrs)","Cost \n(CY $M)","Duration (months)","Disruption (M-hrs)","Cost \n(YOE $M)",null,null,null,null,null,null,null,null,null,null,null,null,null,null,null,null,null,null,null,null,null,null,null,null,null,null,null,null,null,null,null,null,null,null,null,null,null,null,"Cost \n(CY $M)","Duration (months)","Disruption (M-hrs)","Cost \n(CY $M)","Duration (months)","Disruption (M-hrs)","Cost \n(CY $M)","Duration (months)","Disruption (M-hrs)","Cost \n(YOE $M)"]
[null,null,null,"Note: Click on \"Update Report\" to ensure that this  ",null,null,null,null,null,null,null,null,null,null,null,null,"Agency",null,{"$f":"IF(HOME!F10 = \"\",\"\",HOME!F10)","v":"Federal Highway Administration"},null,null,null,null,null,null,null,"PROJECT STRUCTURING"]
[null,null,null,"summary is populated with the latest data and charts",null,null,null,null,null,null,null,null,null,null,null,null,"District Region",null,{"$f":"IF(HOME!F12 = \"\",\"\",HOME!F12)","v":"QDOT District 1"},null,null,null,null,null,null,null,null,"Base Cost"]
[null,null,null,null,null,null,null,null,null,null,null,null,null,null,null,null,"Project Name",null,{"$f":"IF(HOME!F14 = \"\",\"\",HOME!F14)","v":"QDOT Example"},null,null,null,null,null,null,null,null,"Total Unesc ","Total Esc","Duration",null,null,null,null,null,null,null,null,null,null,null,null,null,null,null,null,null,null,null,null,null,null,null,{"$f":"IF('6 - Unmit. Project Performance'!A9=\"\",\"\",'6 - Unmit. Project Performance'!A9)","v":"Planning"},{"$f":"IF('6 - Unmit. Project Performance'!B9=\"\",\"\",'6 - Unmit. Project Performance'!B9)","v":""},{"$f":"IF('6 - Unmit. Project Performance'!C9=\"\",\"\",'6 - Unmit. Project Performance'!C9)","v":0},{"$f":"IF('6 - Unmit. Project Performance'!D9=\"\",\"\",'6 - Unmit. Project Performance'!D9)","v":0},{"$f":"IF('6 - Unmit. Project Performance'!E9=\"\",\"\",'6 - Unmit. Project Performance'!E9)","v":0},{"$f":"IF('6 - Unmit. Project Performance'!F9=\"\",\"\",'6 - Unmit. Project Performance'!F9)","v":0},{"$f":"IF('6 - Unmit. Project Performance'!G9=\"\",\"\",'6 - Unmit. Project Performance'!G9)","v":0},{"$f":"IF('6 - Unmit. Project Performance'!H9=\"\",\"\",'6 - Unmit. Project Performance'!H9)","v":0},{"$f":"IF('6 - Unmit. Project Performance'!I9=\"\",\"\",'6 - Unmit. Project Performance'!I9)","v":0},{"$f":"IF('6 - Unmit. Project Performance'!J9=\"\",\"\",'6 - Unmit. Project Performance'!J9)","v":0},{"$f":"IF('6 - Unmit. Project Performance'!K9=\"\",\"\",'6 - Unmit. Project Performance'!K9)","v":""},null,null,null,null,null,null,null,null,null,null,null,null,null,null,null,null,null,null,null,null,null,null,null,null,null,null,null,null,null,null,null,null,null,null,null,null,null,{"$f":"IF('11 - Mit. Project Performance'!A10=\"\",\"\",'11 - Mit. Project Performance'!A10)","v":"Planning"},{"$f":"IF('11 - Mit. Project Performance'!B10=\"\",\"\",'11 - Mit. Project Performance'!B10)","v":0},{"$f":"IF('11 - Mit. Project Performance'!C10=\"\",\"\",'11 - Mit. Project Performance'!C10)","v":0},{"$f":"IF('11 - Mit. Project Performance'!D10=\"\",\"\",'11 - Mit. Project Performance'!D10)","v":0},{"$f":"IF('11 - Mit. Project Performance'!E10=\"\",\"\",'11 - Mit. Project Performance'!E10)","v":0},{"$f":"IF('11 - Mit. Project Performance'!F10=\"\",\"\",'11 - Mit. Project Performance'!F10)","v":0},{"$f":"IF('11 - Mit. Project Performance'!G10=\"\",\"\",'11 - Mit. Project Performance'!G10)","v":0},{"$f":"IF('11 - Mit. Project Performance'!H10=\"\",\"\",'11 - Mit. Project Performance'!H10)","v":0},{"$f":"IF('11 - Mit. Project Performance'!I10=\"\",\"\",'11 - Mit. Project Performance'!I10)","v":0},{"$f":"IF('11 - Mit. Project Performance'!J10=\"\",\"\",'11 - Mit. Project Performance'!J10)","v":0},{"$f":"IF('11 - Mit. Project Performance'!K10=\"\",\"\",'11 - Mit. Project Performance'!K10)","v":0}]
[null,null,null,null,null,null,"REPORT SUMMARY",null,null,null,null,null,null,null,null,null,"Project Description",null,{"$f":"IF(HOME!F16 = \"\",\"\",HOME!F16)","v":"QDOT Example R09 Guidebook"},null,null,null,null,null,null,null,"Project Phase","Cost ($M)"," Cost ($M)"," (months)",null,null,null,null,null,null,null,null,null,null,null,null,null,null,null,null,null,null,null,null,null,null,null,{"$f":"IF('6 - Unmit. Project Performance'!A10=\"\",\"\",'6 - Unmit. Project Performance'!A10)","v":"Scoping"},{"$f":"IF('6 - Unmit. Project Performance'!B10=\"\",\"\",'6 - Unmit. Project Performance'!B10)","v":""},{"$f":"IF('6 - Unmit. Project Performance'!C10=\"\",\"\",'6 - Unmit. Project Performance'!C10)","v":0},{"$f":"IF('6 - Unmit. Project Performance'!D10=\"\",\"\",'6 - Unmit. Project Performance'!D10)","v":0},{"$f":"IF('6 - Unmit. Project Performance'!E10=\"\",\"\",'6 - Unmit. Project Performance'!E10)","v":0},{"$f":"IF('6 - Unmit. Project Performance'!F10=\"\",\"\",'6 - Unmit. Project Performance'!F10)","v":0},{"$f":"IF('6 - Unmit. Project Performance'!G10=\"\",\"\",'6 - Unmit. Project Performance'!G10)","v":0},{"$f":"IF('6 - Unmit. Project Performance'!H10=\"\",\"\",'6 - Unmit. Project Performance'!H10)","v":0},{"$f":"IF('6 - Unmit. Project Performance'!I10=\"\",\"\",'6 - Unmit. Project Performance'!I10)","v":0},{"$f":"IF('6 - Unmit. Project Performance'!J10=\"\",\"\",'6 - Unmit. Project Performance'!J10)","v":0},{"$f":"IF('6 - Unmit. Project Performance'!K10=\"\",\"\",'6 - Unmit. Project Performance'!K10)","v":0},null,null,null,null,null,null,null,null,null,null,null,null,null,null,null,null,null,null,null,null,null,null,null,null,null,null,null,null,null,null,null,null,null,null,null,null,null,{"$f":"IF('11 - Mit. Project Performance'!A11=\"\",\"\",'11 - Mit. Project Performance'!A11)","v":"Scoping"},{"$f":"IF('11 - Mit. Project Performance'!B11=\"\",\"\",'11 - Mit. Project Performance'!B11)","v":0},{"$f":"IF('11 - Mit. Project Performance'!C11=\"\",\"\",'11 - Mit. Project Performance'!C11)","v":0},{"$f":"IF('11 - Mit. Project Performance'!D11=\"\",\"\",'11 - Mit. Project Performance'!D11)","v":0},{"$f":"IF('11 - Mit. Project Performance'!E11=\"\",\"\",'11 - Mit. Project Performance'!E11)","v":0},{"$f":"IF('11 - Mit. Project Performance'!F11=\"\",\"\",'11 - Mit. Project Performance'!F11)","v":0},{"$f":"IF('11 - Mit. Project Performance'!G11=\"\",\"\",'11 - Mit. Project Performance'!G11)","v":0},{"$f":"IF('11 - Mit. Project Performance'!H11=\"\",\"\",'11 - Mit. Project Performance'!H11)","v":0},{"$f":"IF('11 - Mit. Project Performance'!I11=\"\",\"\",'11 - Mit. Project Performance'!I11)","v":0},{"$f":"IF('11 - Mit. Project Performance'!J11=\"\",\"\",'11 - Mit. Project Performance'!J11)","v":0},{"$f":"IF('11 - Mit. Project Performance'!K11=\"\",\"\",'11 - Mit. Project Performance'!K11)","v":0}]
[null,null,null,null,null,null,null,null,null,null,null,null,null,null,null,null,"Facilitator",null,{"$f":"IF(HOME!Q10 = \"\",\"\",HOME!Q10)","v":"Carlos F Figueroa"},null,null,null,null,null,null,null,{"$f":"IF('1 - Project Structuring'!C99=\"\",\"\",'1 - Project Structuring'!C99)","v":"Planning"},{"$f":"IF('1 - Project Structuring'!D99=\"\",\"\",'1 - Project Structuring'!D99)","v":""},{"$f":"IF('1 - Project Structuring'!E99=\"\",\"\",'1 - Project Structuring'!E99)","v":0},{"$f":"IF('1 - Project Structuring'!F99=\"\",\"\",'1 - Project Structuring'!F99)","v":0},null,null,null,null,null,null,null,null,null,"SUMMARY OF RISK IDENTIFICATION",null,null,null,null,null,null,null,null,null,null,null,null,null,{"$f":"IF('6 - Unmit. Project Performance'!A11=\"\",\"\",'6 - Unmit. Project Performance'!A11)","v":"Prelim Design/Environmental Process"},{"$f":"IF('6 - Unmit. Project Performance'!B11=\"\",\"\",'6 - Unmit. Project Performance'!B11)","v":1.19},{"$f":"IF('6 - Unmit. Project Performance'!C11=\"\",\"\",'6 - Unmit. Project Performance'!C11)","v":12},{"$f":"IF('6 - Unmit. Project Performance'!D11=\"\",\"\",'6 - Unmit. Project Performance'!D11)","v":0},{"$f":"IF('6 - Unmit. Project Performance'!E11=\"\",\"\",'6 - Unmit. Project Performance'!E11)","v":0.13125000000000001},{"$f":"IF('6 - Unmit. Project Performance'!F11=\"\",\"\",'6 - Unmit. Project Performance'!F11)","v":1.46875},{"$f":"IF('6 - Unmit. Project Performance'!G11=\"\",\"\",'6 - Unmit. Project Performance'!G11)","v":0},{"$f":"IF('6 - Unmit. Project Performance'!H11=\"\",\"\",'6 - Unmit. Project Performance'!H11)","v":1.32125},{"$f":"IF('6 - Unmit. Project Performance'!I11=\"\",\"\",'6 - Unmit. Project Performance'!I11)","v":13.46875},{"$f":"IF('6 - Unmit. Project Performance'!J11=\"\",\"\",'6 - Unmit. Project Performance'!J11)","v":0},{"$f":"IF('6 - Unmit. Project Performance'!K11=\"\",\"\",'6 - Unmit. Project Performance'!K11)","v":1.3433226831215848},null,null,null,null,null,null,null,null,null,null,null,null,null,null,null,null,null,null,null,null,null,null,null,null,null,null,null,null,null,null,null,null,null,null,null,null,null,{"$f":"IF('11 - Mit. Project Performance'!A12=\"\",\"\",'11 - Mit. Project Performance'!A12)","v":"Prelim Design/Environmental Process"},{"$f":"IF('11 - Mit. Project Performance'!B12=\"\",\"\",'11 - Mit. Project Performance'!B12)","v":1.19},{"$f":"IF('11 - Mit. Project Performance'!C12=\"\",\"\",'11 - Mit. Project Performance'!C12)","v":12},{"$f":"IF('11 - Mit. Project Performance'!D12=\"\",\"\",'11 - Mit. Project Performance'!D12)","v":0},{"$f":"IF('11 - Mit. Project Performance'!E12=\"\",\"\",'11 - Mit. Project Performance'!E12)","v":0.13125000000000001},{"$f":"IF('11 - Mit. Project Performance'!F12=\"\",\"\",'11 - Mit. Project Performance'!F12)","v":1.46875},{"$f":"IF('11 - Mit. Project Performance'!G12=\"\",\"\",'11 - Mit. Project Performance'!G12)","v":0},{"$f":"IF('11 - Mit. Project Performance'!H12=\"\",\"\",'11 - Mit. Project Performance'!H12)","v":1.32125},{"$f":"IF('11 - Mit. Project Performance'!I12=\"\",\"\",'11 - Mit. Project Performance'!I12)","v":13.46875},{"$f":"IF('11 - Mit. Project Performance'!J12=\"\",\"\",'11 - Mit. Project Performance'!J12)","v":0},{"$f":"IF('11 - Mit. Project Performance'!K12=\"\",\"\",'11 - Mit. Project Performance'!K12)","v":1.3433226831215848}]
[null,null,null,null,null,null,null,null,null,null,null,null,null,null,null,null,"Project Manager",null,{"$f":"IF(HOME!Q12 = \"\",\"\",HOME!Q12)","v":"Luis Millan"},null,null,null,null,null,null,null,{"$f":"IF('1 - Project Structuring'!C100=\"\",\"\",'1 - Project Structuring'!C100)","v":"Scoping"},{"$f":"IF('1 - Project Structuring'!D100=\"\",\"\",'1 - Project Structuring'!D100)","v":""},{"$f":"IF('1 - Project Structuring'!E100=\"\",\"\",'1 - Project Structuring'!E100)","v":0},{"$f":"IF('1 - Project Structuring'!F100=\"\",\"\",'1 - Project Structuring'!F100)","v":0}]
[null,null,null,null,null,null,null,null,null,null,null,null,null,null,null,null,"Date",null,{"$f":"IF(HOME!Q14 = \"\",\"\",HOME!Q14)","v":42247},null,null,null,null,null,null,null,{"$f":"IF('1 - Project Structuring'!C101=\"\",\"\",'1 - Project Structuring'!C101)","v":"Prelim Design/Environmental Process"},{"$f":"IF('1 - Project Structuring'!D101=\"\",\"\",'1 - Project Structuring'!D101)","v":1.19},{"$f":"IF('1 - Project Structuring'!E101=\"\",\"\",'1 - Project Structuring'!E101)","v":1.2089139502725612},{"$f":"IF('1 - Project Structuring'!F101=\"\",\"\",'1 - Project Structuring'!F101)","v":12},null,null,null,null,null,null,null,null,null,"Project Phase","Number of Risks Identified in Each Phase"]
[null,null,null,null,null,null,null,null,null,null,null,null,null,null,null,null,"Version",null,{"$f":"IF(HOME!Q16 = \"\",\"\",HOME!Q16)","v":1},null,null,null,null,null,null,null,{"$f":"IF('1 - Project Structuring'!C102=\"\",\"\",'1 - Project Structuring'!C102)","v":"Environmental Permits"},{"$f":"IF('1 - Project Structuring'!D102=\"\",\"\",'1 - Project Structuring'!D102)","v":""},{"$f":"IF('1 - Project Structuring'!E102=\"\",\"\",'1 - Project Structuring'!E102)","v":6.2255540988980342E-4},{"$f":"IF('1 - Project Structuring'!F102=\"\",\"\",'1 - Project Structuring'!F102)","v":6},null,null,null,null,null,null,null,null,null,null,null,null,null,null,null,null,null,null,null,null,null,null,null,{"$f":"IF('6 - Unmit. Project Performance'!A12=\"\",\"\",'6 - Unmit. Project Performance'!A12)","v":"Environmental Permits"},{"$f":"IF('6 - Unmit. Project Performance'!B12=\"\",\"\",'6 - Unmit. Project Performance'!B12)","v":""},{"$f":"IF('6 - Unmit. Project Performance'!C12=\"\",\"\",'6 - Unmit. Project Performance'!C12)","v":6},{"$f":"IF('6 - Unmit. Project Performance'!D12=\"\",\"\",'6 - Unmit. Project Performance'!D12)","v":0},{"$f":"IF('6 - Unmit. Project Performance'!E12=\"\",\"\",'6 - Unmit. Project Performance'!E12)","v":0},{"$f":"IF('6 - Unmit. Project Performance'!F12=\"\",\"\",'6 - Unmit. Project Performance'!F12)","v":0.3125},{"$f":"IF('6 - Unmit. Project Performance'!G12=\"\",\"\",'6 - Unmit. Project Performance'!G12)","v":0},{"$f":"IF('6 - Unmit. Project Performance'!H12=\"\",\"\",'6 - Unmit. Project Performance'!H12)","v":0},{"$f":"IF('6 - Unmit. Project Performance'!I12=\"\",\"\",'6 - Unmit. Project Performance'!I12)","v":6.3125},{"$f":"IF('6 - Unmit. Project Performance'!J12=\"\",\"\",'6 - Unmit. Project Performance'!J12)","v":0},{"$f":"IF('6 - Unmit. Project Performance'!K12=\"\",\"\",'6 - Unmit. Project Performance'!K12)","v":0},null,null,null,null,null,null,null,null,null,null,null,null,null,null,null,null,null,null,null,null,null,null,null,null,null,null,null,null,null,null,null,null,null,null,null,null,null,{"$f":"IF('11 - Mit. Project Performance'!A13=\"\",\"\",'11 - Mit. Project Performance'!A13)","v":"Environmental Permits"},{"$f":"IF('11 - Mit. Project Performance'!B13=\"\",\"\",'11 - Mit. Project Performance'!B13)","v":0},{"$f":"IF('11 - Mit. Project Performance'!C13=\"\",\"\",'11 - Mit. Project Performance'!C13)","v":6},{"$f":"IF('11 - Mit. Project Performance'!D13=\"\",\"\",'11 - Mit. Project Performance'!D13)","v":0},{"$f":"IF('11 - Mit. Project Performance'!E13=\"\",\"\",'11 - Mit. Project Performance'!E13)","v":0},{"$f":"IF('11 - Mit. Project Performance'!F13=\"\",\"\",'11 - Mit. Project Performance'!F13)","v":0.3125},{"$f":"IF('11 - Mit. Project Performance'!G13=\"\",\"\",'11 - Mit. Project Performance'!G13)","v":0},{"$f":"IF('11 - Mit. Project Performance'!H13=\"\",\"\",'11 - Mit. Project Performance'!H13)","v":0},{"$f":"IF('11 - Mit. Project Performance'!I13=\"\",\"\",'11 - Mit. Project Performance'!I13)","v":6.3125},{"$f":"IF('11 - Mit. Project Performance'!J13=\"\",\"\",'11 - Mit. Project Performance'!J13)","v":0},{"$f":"IF('11 - Mit. Project Performance'!K13=\"\",\"\",'11 - Mit. Project Performance'!K13)","v":0}]
[null,null,null,null,null,null,null,null,null,null,null,null,null,null,null,null,null,null,null,null,null,null,null,null,null,null,{"$f":"IF('1 - Project Structuring'!C103=\"\",\"\",'1 - Project Structuring'!C103)","v":"ROW/Util/RR"},{"$f":"IF('1 - Project Structuring'!D103=\"\",\"\",'1 - Project Structuring'!D103)","v":3},{"$f":"IF('1 - Project Structuring'!E103=\"\",\"\",'1 - Project Structuring'!E103)","v":3.1370905248366756},{"$f":"IF('1 - Project Structuring'!F103=\"\",\"\",'1 - Project Structuring'!F103)","v":12},null,null,null,null,null,null,null,null,null,{"$f":"IF('1 - Project Structuring'!C20=\"\",\"\",'1 - Project Structuring'!C20)","v":"Planning"},{"$f":"COUNTIF(Table1[Project Phase],'13 - Summary Report'!AN13)","v":4},null,null,null,null,null,null,null,null,null,null,null,null,{"$f":"IF('6 - Unmit. Project Performance'!A13=\"\",\"\",'6 - Unmit. Project Performance'!A13)","v":"ROW/Util/RR"},{"$f":"IF('6 - Unmit. Project Performance'!B13=\"\",\"\",'6 - Unmit. Project Performance'!B13)","v":3},{"$f":"IF('6 - Unmit. Project Performance'!C13=\"\",\"\",'6 - Unmit. Project Performance'!C13)","v":12},{"$f":"IF('6 - Unmit. Project Performance'!D13=\"\",\"\",'6 - Unmit. Project Performance'!D13)","v":0.2},{"$f":"IF('6 - Unmit. Project Performance'!E13=\"\",\"\",'6 - Unmit. Project Performance'!E13)","v":2.6250000000000004},{"$f":"IF('6 - Unmit. Project Performance'!F13=\"\",\"\",'6 - Unmit. Project Performance'!F13)","v":1.125},{"$f":"IF('6 - Unmit. Project Performance'!G13=\"\",\"\",'6 - Unmit. Project Performance'!G13)","v":0},{"$f":"IF('6 - Unmit. Project Performance'!H13=\"\",\"\",'6 - Unmit. Project Performance'!H13)","v":5.625},{"$f":"IF('6 - Unmit. Project Performance'!I13=\"\",\"\",'6 - Unmit. Project Performance'!I13)","v":13.125},{"$f":"IF('6 - Unmit. Project Performance'!J13=\"\",\"\",'6 - Unmit. Project Performance'!J13)","v":0.2},{"$f":"IF('6 - Unmit. Project Performance'!K13=\"\",\"\",'6 - Unmit. Project Performance'!K13)","v":5.9091488593201751},null,null,null,null,null,null,null,null,null,null,null,null,null,null,null,null,null,null,null,null,null,null,null,null,null,null,null,null,null,null,null,null,null,null,null,null,null,{"$f":"IF('11 - Mit. Project Performance'!A14=\"\",\"\",'11 - Mit. Project Performance'!A14)","v":"ROW/Util/RR"},{"$f":"IF('11 - Mit. Project Performance'!B14=\"\",\"\",'11 - Mit. Project Performance'!B14)","v":3.05},{"$f":"IF('11 - Mit. Project Performance'!C14=\"\",\"\",'11 - Mit. Project Performance'!C14)","v":12},{"$f":"IF('11 - Mit. Project Performance'!D14=\"\",\"\",'11 - Mit. Project Performance'!D14)","v":0.2},{"$f":"IF('11 - Mit. Project Performance'!E14=\"\",\"\",'11 - Mit. Project Performance'!E14)","v":2.3520000000000003},{"$f":"IF('11 - Mit. Project Performance'!F14=\"\",\"\",'11 - Mit. Project Performance'!F14)","v":0.703125},{"$f":"IF('11 - Mit. Project Performance'!G14=\"\",\"\",'11 - Mit. Project Performance'!G14)","v":0},{"$f":"IF('11 - Mit. Project Performance'!H14=\"\",\"\",'11 - Mit. Project Performance'!H14)","v":5.4020000000000001},{"$f":"IF('11 - Mit. Project Performance'!I14=\"\",\"\",'11 - Mit. Project Performance'!I14)","v":12.703125},{"$f":"IF('11 - Mit. Project Performance'!J14=\"\",\"\",'11 - Mit. Project Performance'!J14)","v":0.2},{"$f":"IF('11 - Mit. Project Performance'!K14=\"\",\"\",'11 - Mit. Project Performance'!K14)","v":5.6719397290265592}]
[null,null,null,null,null,null,null,null,null,null,null,null,null,null,null,null,null,null,null,null,null,null,null,null,null,null,{"$f":"IF('1 - Project Structuring'!C104=\"\",\"\",'1 - Project Structuring'!C104)","v":"Final Design"},{"$f":"IF('1 - Project Structuring'!D104=\"\",\"\",'1 - Project Structuring'!D104)","v":""},{"$f":"IF('1 - Project Structuring'!E104=\"\",\"\",'1 - Project Structuring'!E104)","v":6.2255540988980342E-4},{"$f":"IF('1 - Project Structuring'!F104=\"\",\"\",'1 - Project Structuring'!F104)","v":6},null,null,null,null,null,null,null,null,null,{"$f":"IF('1 - Project Structuring'!C21=\"\",\"\",'1 - Project Structuring'!C21)","v":"Scoping"},{"$f":"COUNTIF(Table1[Project Phase],'13 - Summary Report'!AN14)","v":7},null,null,null,null,null,null,null,null,null,null,null,null,{"$f":"IF('6 - Unmit. Project Performance'!A14=\"\",\"\",'6 - Unmit. Project Performance'!A14)","v":"Final Design"},{"$f":"IF('6 - Unmit. Project Performance'!B14=\"\",\"\",'6 - Unmit. Project Performance'!B14)","v":""},{"$f":"IF('6 - Unmit. Project Performance'!C14=\"\",\"\",'6 - Unmit. Project Performance'!C14)","v":6},{"$f":"IF('6 - Unmit. Project Performance'!D14=\"\",\"\",'6 - Unmit. Project Performance'!D14)","v":0},{"$f":"IF('6 - Unmit. Project Performance'!E14=\"\",\"\",'6 - Unmit. Project Performance'!E14)","v":0},{"$f":"IF('6 - Unmit. Project Performance'!F14=\"\",\"\",'6 - Unmit. Project Performance'!F14)","v":0.75000000000000011},{"$f":"IF('6 - Unmit. Project Performance'!G14=\"\",\"\",'6 - Unmit. Project Performance'!G14)","v":0},{"$f":"IF('6 - Unmit. Project Performance'!H14=\"\",\"\",'6 - Unmit. Project Performance'!H14)","v":0},{"$f":"IF('6 - Unmit. Project Performance'!I14=\"\",\"\",'6 - Unmit. Project Performance'!I14)","v":6.75},{"$f":"IF('6 - Unmit. Project Performance'!J14=\"\",\"\",'6 - Unmit. Project Performance'!J14)","v":0},{"$f":"IF('6 - Unmit. Project Performance'!K14=\"\",\"\",'6 - Unmit. Project Performance'!K14)","v":0},null,null,null,null,null,null,null,null,null,null,null,null,null,null,null,null,null,null,null,null,null,null,null,null,null,null,null,null,null,null,null,null,null,null,null,null,null,{"$f":"IF('11 - Mit. Project Performance'!A15=\"\",\"\",'11 - Mit. Project Performance'!A15)","v":"Final Design"},{"$f":"IF('11 - Mit. Project Performance'!B15=\"\",\"\",'11 - Mit. Project Performance'!B15)","v":0.2},{"$f":"IF('11 - Mit. Project Performance'!C15=\"\",\"\",'11 - Mit. Project Performance'!C15)","v":6},{"$f":"IF('11 - Mit. Project Performance'!D15=\"\",\"\",'11 - Mit. Project Performance'!D15)","v":0},{"$f":"IF('11 - Mit. Project Performance'!E15=\"\",\"\",'11 - Mit. Project Performance'!E15)","v":0},{"$f":"IF('11 - Mit. Project Performance'!F15=\"\",\"\",'11 - Mit. Project Performance'!F15)","v":0.75000000000000011},{"$f":"IF('11 - Mit. Project Performance'!G15=\"\",\"\",'11 - Mit. Project Performance'!G15)","v":0},{"$f":"IF('11 - Mit. Project Performance'!H15=\"\",\"\",'11 - Mit. Project Performance'!H15)","v":0.2},{"$f":"IF('11 - Mit. Project Performance'!I15=\"\",\"\",'11 - Mit. Project Performance'!I15)","v":6.75},{"$f":"IF('11 - Mit. Project Performance'!J15=\"\",\"\",'11 - Mit. Project Performance'!J15)","v":0},{"$f":"IF('11 - Mit. Project Performance'!K15=\"\",\"\",'11 - Mit. Project Performance'!K15)","v":0.21192816197714981}]
[null,null,null,null,null,null,null,null,null,null,null,null,null,null,null,null,null,null,"PROJECT STRUCTURING",null,null,null,null,null,null,null,{"$f":"IF('1 - Project Structuring'!C105=\"\",\"\",'1 - Project Structuring'!C105)","v":"Procurement"},{"$f":"IF('1 - Project Structuring'!D105=\"\",\"\",'1 - Project Structuring'!D105)","v":""},{"$f":"IF('1 - Project Structuring'!E105=\"\",\"\",'1 - Project Structuring'!E105)","v":6.3181323021611489E-4},{"$f":"IF('1 - Project Structuring'!F105=\"\",\"\",'1 - Project Structuring'!F105)","v":6},null,null,null,null,null,null,null,null,null,{"$f":"IF('1 - Project Structuring'!C22=\"\",\"\",'1 - Project Structuring'!C22)","v":"Design Funding Date"},{"$f":"COUNTIF(Table1[Project Phase],'13 - Summary Report'!AN15)","v":0},null,null,null,null,null,null,null,null,null,null,null,null,{"$f":"IF('6 - Unmit. Project Performance'!A15=\"\",\"\",'6 - Unmit. Project Performance'!A15)","v":"Procurement"},{"$f":"IF('6 - Unmit. Project Performance'!B15=\"\",\"\",'6 - Unmit. Project Performance'!B15)","v":""},{"$f":"IF('6 - Unmit. Project Performance'!C15=\"\",\"\",'6 - Unmit. Project Performance'!C15)","v":6},{"$f":"IF('6 - Unmit. Project Performance'!D15=\"\",\"\",'6 - Unmit. Project Performance'!D15)","v":0},{"$f":"IF('6 - Unmit. Project Performance'!E15=\"\",\"\",'6 - Unmit. Project Performance'!E15)","v":0.25937499999997132},{"$f":"IF('6 - Unmit. Project Performance'!F15=\"\",\"\",'6 - Unmit. Project Performance'!F15)","v":0.2890625},{"$f":"IF('6 - Unmit. Project Performance'!G15=\"\",\"\",'6 - Unmit. Project Performance'!G15)","v":0},{"$f":"IF('6 - Unmit. Project Performance'!H15=\"\",\"\",'6 - Unmit. Project Performance'!H15)","v":0.25937499999997132},{"$f":"IF('6 - Unmit. Project Performance'!I15=\"\",\"\",'6 - Unmit. Project Performance'!I15)","v":6.2890625},{"$f":"IF('6 - Unmit. Project Performance'!J15=\"\",\"\",'6 - Unmit. Project Performance'!J15)","v":0},{"$f":"IF('6 - Unmit. Project Performance'!K15=\"\",\"\",'6 - Unmit. Project Performance'!K15)","v":0.27047377694869845},null,null,null,null,null,null,null,null,null,null,null,null,null,null,null,null,null,null,null,null,null,null,null,null,null,null,null,null,null,null,null,null,null,null,null,null,null,{"$f":"IF('11 - Mit. Project Performance'!A16=\"\",\"\",'11 - Mit. Project Performance'!A16)","v":"Procurement"},{"$f":"IF('11 - Mit. Project Performance'!B16=\"\",\"\",'11 - Mit. Project Performance'!B16)","v":0},{"$f":"IF('11 - Mit. Project Performance'!C16=\"\",\"\",'11 - Mit. Project Performance'!C16)","v":6},{"$f":"IF('11 - Mit. Project Performance'!D16=\"\",\"\",'11 - Mit. Project Performance'!D16)","v":0},{"$f":"IF('11 - Mit. Project Performance'!E16=\"\",\"\",'11 - Mit. Project Performance'!E16)","v":0.21718749999998088},{"$f":"IF('11 - Mit. Project Performance'!F16=\"\",\"\",'11 - Mit. Project Performance'!F16)","v":0.2890625},{"$f":"IF('11 - Mit. Project Performance'!G16=\"\",\"\",'11 - Mit. Project Performance'!G16)","v":0},{"$f":"IF('11 - Mit. Project Performance'!H16=\"\",\"\",'11 - Mit. Project Performance'!H16)","v":0.21718749999998088},{"$f":"IF('11 - Mit. Project Performance'!I16=\"\",\"\",'11 - Mit. Project Performance'!I16)","v":6.2890625},{"$f":"IF('11 - Mit. Project Performance'!J16=\"\",\"\",'11 - Mit. Project Performance'!J16)","v":0},{"$f":"IF('11 - Mit. Project Performance'!K16=\"\",\"\",'11 - Mit. Project Performance'!K16)","v":0.22636355275441536}]
[null,null,null,null,null,null,null,null,null,null,null,null,null,null,null,null,null,null,"Summary",null,"Units",null,null,null,null,null,{"$f":"IF('1 - Project Structuring'!C106=\"\",\"\",'1 - Project Structuring'!C106)","v":"Construction"},{"$f":"IF('1 - Project Structuring'!D106=\"\",\"\",'1 - Project Structuring'!D106)","v":11.85},{"$f":"IF('1 - Project Structuring'!E106=\"\",\"\",'1 - Project Structuring'!E106)","v":12.667719484112402},{"$f":"IF('1 - Project Structuring'!F106=\"\",\"\",'1 - Project Structuring'!F106)","v":16},null,null,null,null,null,null,null,null,null,{"$f":"IF('1 - Project Structuring'!C23=\"\",\"\",'1 - Project Structuring'!C23)","v":"Prelim Design/Environmental Process"},{"$f":"COUNTIF(Table1[Project Phase],'13 - Summary Report'!AN16)","v":16},null,null,null,null,null,null,null,null,null,null,null,null,{"$f":"IF('6 - Unmit. Project Performance'!A16=\"\",\"\",'6 - Unmit. Project Performance'!A16)","v":"Construction"},{"$f":"IF('6 - Unmit. Project Performance'!B16=\"\",\"\",'6 - Unmit. Project Performance'!B16)","v":11.85},{"$f":"IF('6 - Unmit. Project Performance'!C16=\"\",\"\",'6 - Unmit. Project Performance'!C16)","v":16},{"$f":"IF('6 - Unmit. Project Performance'!D16=\"\",\"\",'6 - Unmit. Project Performance'!D16)","v":0.5},{"$f":"IF('6 - Unmit. Project Performance'!E16=\"\",\"\",'6 - Unmit. Project Performance'!E16)","v":2.5210546874999871},{"$f":"IF('6 - Unmit. Project Performance'!F16=\"\",\"\",'6 - Unmit. Project Performance'!F16)","v":0.85468750000000004},{"$f":"IF('6 - Unmit. Project Performance'!G16=\"\",\"\",'6 - Unmit. Project Performance'!G16)","v":2.5000000000000022E-3},{"$f":"IF('6 - Unmit. Project Performance'!H16=\"\",\"\",'6 - Unmit. Project Performance'!H16)","v":14.371054687499987},{"$f":"IF('6 - Unmit. Project Performance'!I16=\"\",\"\",'6 - Unmit. Project Performance'!I16)","v":16.854687500000001},{"$f":"IF('6 - Unmit. Project Performance'!J16=\"\",\"\",'6 - Unmit. Project Performance'!J16)","v":0.50249999999999995},{"$f":"IF('6 - Unmit. Project Performance'!K16=\"\",\"\",'6 - Unmit. Project Performance'!K16)","v":15.47265000262917},null,null,null,null,null,null,null,null,null,null,null,null,null,null,null,null,null,null,null,null,null,null,null,null,null,null,null,null,null,null,null,null,null,null,null,null,null,{"$f":"IF('11 - Mit. Project Performance'!A17=\"\",\"\",'11 - Mit. Project Performance'!A17)","v":"Construction"},{"$f":"IF('11 - Mit. Project Performance'!B17=\"\",\"\",'11 - Mit. Project Performance'!B17)","v":11.85},{"$f":"IF('11 - Mit. Project Performance'!C17=\"\",\"\",'11 - Mit. Project Performance'!C17)","v":16},{"$f":"IF('11 - Mit. Project Performance'!D17=\"\",\"\",'11 - Mit. Project Performance'!D17)","v":0.5},{"$f":"IF('11 - Mit. Project Performance'!E17=\"\",\"\",'11 - Mit. Project Performance'!E17)","v":1.879726562500015},{"$f":"IF('11 - Mit. Project Performance'!F17=\"\",\"\",'11 - Mit. Project Performance'!F17)","v":0.37656250000000002},{"$f":"IF('11 - Mit. Project Performance'!G17=\"\",\"\",'11 - Mit. Project Performance'!G17)","v":-2.0462500000000002E-2},{"$f":"IF('11 - Mit. Project Performance'!H17=\"\",\"\",'11 - Mit. Project Performance'!H17)","v":13.729726562500014},{"$f":"IF('11 - Mit. Project Performance'!I17=\"\",\"\",'11 - Mit. Project Performance'!I17)","v":16.376562499999999},{"$f":"IF('11 - Mit. Project Performance'!J17=\"\",\"\",'11 - Mit. Project Performance'!J17)","v":0.47953750000000001},{"$f":"IF('11 - Mit. Project Performance'!K17=\"\",\"\",'11 - Mit. Project Performance'!K17)","v":14.758144848923294}]
[null,null,null,null,null,null,null,null,null,null,null,null,null,null,null,null,null,null,"Project Delivery Method",{"$f":"IF('1 - Project Structuring'!D7=\"\",\"\",'1 - Project Structuring'!D7)","v":"Design-Build"},null,null,null,null,null,null,{"$f":"IF('1 - Project Structuring'!C107=\"\",\"\",'1 - Project Structuring'!C107)","v":"Operations & Maintenance"},{"$f":"IF('1 - Project Structuring'!D107=\"\",\"\",'1 - Project Structuring'!D107)","v":0},{"$f":"IF('1 - Project Structuring'!E107=\"\",\"\",'1 - Project Structuring'!E107)","v":0},{"$f":"IF('1 - Project Structuring'!F107=\"\",\"\",'1 - Project Structuring'!F107)","v":600},null,null,null,null,null,null,null,null,null,{"$f":"IF('1 - Project Structuring'!C24=\"\",\"\",'1 - Project Structuring'!C24)","v":"Environmental Permits"},{"$f":"COUNTIF(Table1[Project Phase],'13 - Summary Report'!AN17)","v":2},null,null,null,null,null,null,null,null,null,null,null,null,{"$f":"IF('6 - Unmit. Project Performance'!A17=\"\",\"\",'6 - Unmit. Project Performance'!A17)","v":"Operations & Maintenance"},{"$f":"IF('6 - Unmit. Project Performance'!B17=\"\",\"\",'6 - Unmit. Project Performance'!B17)","v":0},{"$f":"IF('6 - Unmit. Project Performance'!C17=\"\",\"\",'6 - Unmit. Project Performance'!C17)","v":600},{"$f":"IF('6 - Unmit. Project Performance'!D17=\"\",\"\",'6 - Unmit. Project Performance'!D17)","v":1.4000000000000001},{"$f":"IF('6 - Unmit. Project Performance'!E17=\"\",\"\",'6 - Unmit. Project Performance'!E17)","v":0},{"$f":"IF('6 - Unmit. Project Performance'!F17=\"\",\"\",'6 - Unmit. Project Performance'!F17)","v":0},{"$f":"IF('6 - Unmit. Project Performance'!G17=\"\",\"\",'6 - Unmit. Project Performance'!G17)","v":0},{"$f":"IF('6 - Unmit. Project Performance'!H17=\"\",\"\",'6 - Unmit. Project Performance'!H17)","v":0},{"$f":"IF('6 - Unmit. Project Performance'!I17=\"\",\"\",'6 - Unmit. Project Performance'!I17)","v":600},{"$f":"IF('6 - Unmit. Project Performance'!J17=\"\",\"\",'6 - Unmit. Project Performance'!J17)","v":1.4000000000000001},{"$f":"IF('6 - Unmit. Project Performance'!K17=\"\",\"\",'6 - Unmit. Project Performance'!K17)","v":0},null,null,null,null,null,null,null,null,null,null,null,null,null,null,null,null,null,null,null,null,null,null,null,null,null,null,null,null,null,null,null,null,null,null,null,null,null,"Op. & Maint.",{"$f":"IF('11 - Mit. Project Performance'!B18=\"\",\"\",'11 - Mit. Project Performance'!B18)","v":0},{"$f":"IF('11 - Mit. Project Performance'!C18=\"\",\"\",'11 - Mit. Project Performance'!C18)","v":600},{"$f":"IF('11 - Mit. Project Performance'!D18=\"\",\"\",'11 - Mit. Project Performance'!D18)","v":1.4000000000000001},{"$f":"IF('11 - Mit. Project Performance'!E18=\"\",\"\",'11 - Mit. Project Performance'!E18)","v":0},{"$f":"IF('11 - Mit. Project Performance'!F18=\"\",\"\",'11 - Mit. Project Performance'!F18)","v":0},{"$f":"IF('11 - Mit. Project Performance'!G18=\"\",\"\",'11 - Mit. Project Performance'!G18)","v":0},{"$f":"IF('11 - Mit. Project Performance'!H18=\"\",\"\",'11 - Mit. Project Performance'!H18)","v":0},{"$f":"IF('11 - Mit. Project Performance'!I18=\"\",\"\",'11 - Mit. Project Performance'!I18)","v":600},{"$f":"IF('11 - Mit. Project Performance'!J18=\"\",\"\",'11 - Mit. Project Performance'!J18)","v":1.4000000000000001},{"$f":"IF('11 - Mit. Project Performance'!K18=\"\",\"\",'11 - Mit. Project Performance'!K18)","v":""}]
[null,null,null,null,null,null,null,null,null,null,null,null,null,null,null,null,null,null,null,{"$f":"IF('1 - Project Structuring'!D9=\"\",\"\",'1 - Project Structuring'!D9)","v":"Schedule"},null,null,null,null,null,null,{"$f":"IF('1 - Project Structuring'!C108=\"\",\"\",'1 - Project Structuring'!C108)","v":"Replacement"},{"$f":"IF('1 - Project Structuring'!D108=\"\",\"\",'1 - Project Structuring'!D108)","v":0},{"$f":"IF('1 - Project Structuring'!E108=\"\",\"\",'1 - Project Structuring'!E108)","v":0},{"$f":"IF('1 - Project Structuring'!F108=\"\",\"\",'1 - Project Structuring'!F108)","v":0},null,null,null,null,null,null,null,null,null,{"$f":"IF('1 - Project Structuring'!C25=\"\",\"\",'1 - Project Structuring'!C25)","v":"ROW/Util/RR Funding Date"},{"$f":"COUNTIF(Table1[Project Phase],'13 - Summary Report'!AN18)","v":0},null,null,null,null,null,null,null,null,null,null,null,null,{"$f":"IF('6 - Unmit. Project Performance'!A18=\"\",\"\",'6 - Unmit. Project Performance'!A18)","v":"Replacement"},{"$f":"IF('6 - Unmit. Project Performance'!B18=\"\",\"\",'6 - Unmit. Project Performance'!B18)","v":0},{"$f":"IF('6 - Unmit. Project Performance'!C18=\"\",\"\",'6 - Unmit. Project Performance'!C18)","v":0},{"$f":"IF('6 - Unmit. Project Performance'!D18=\"\",\"\",'6 - Unmit. Project Performance'!D18)","v":0.7},{"$f":"IF('6 - Unmit. Project Performance'!E18=\"\",\"\",'6 - Unmit. Project Performance'!E18)","v":0},{"$f":"IF('6 - Unmit. Project Performance'!F18=\"\",\"\",'6 - Unmit. Project Performance'!F18)","v":""},{"$f":"IF('6 - Unmit. Project Performance'!G18=\"\",\"\",'6 - Unmit. Project Performance'!G18)","v":0},{"$f":"IF('6 - Unmit. Project Performance'!H18=\"\",\"\",'6 - Unmit. Project Performance'!H18)","v":0},{"$f":"IF('6 - Unmit. Project Performance'!I18=\"\",\"\",'6 - Unmit. Project Performance'!I18)","v":0},{"$f":"IF('6 - Unmit. Project Performance'!J18=\"\",\"\",'6 - Unmit. Project Performance'!J18)","v":0.7},{"$f":"IF('6 - Unmit. Project Performance'!K18=\"\",\"\",'6 - Unmit. Project Performance'!K18)","v":""},null,null,null,null,null,null,null,null,null,null,null,null,null,null,null,null,null,null,null,null,null,null,null,null,null,null,null,null,null,null,null,null,null,null,null,null,null,"Replacement",{"$f":"IF('11 - Mit. Project Performance'!B19=\"\",\"\",'11 - Mit. Project Performance'!B19)","v":0},{"$f":"IF('11 - Mit. Project Performance'!C19=\"\",\"\",'11 - Mit. Project Performance'!C19)","v":0},{"$f":"IF('11 - Mit. Project Performance'!D19=\"\",\"\",'11 - Mit. Project Performance'!D19)","v":0.7},{"$f":"IF('11 - Mit. Project Performance'!E19=\"\",\"\",'11 - Mit. Project Performance'!E19)","v":0},{"$f":"IF('11 - Mit. Project Performance'!F19=\"\",\"\",'11 - Mit. Project Performance'!F19)","v":0},{"$f":"IF('11 - Mit. Project Performance'!G19=\"\",\"\",'11 - Mit. Project Performance'!G19)","v":0},{"$f":"IF('11 - Mit. Project Performance'!H19=\"\",\"\",'11 - Mit. Project Performance'!H19)","v":0},{"$f":"IF('11 - Mit. Project Performance'!I19=\"\",\"\",'11 - Mit. Project Performance'!I19)","v":0},{"$f":"IF('11 - Mit. Project Performance'!J19=\"\",\"\",'11 - Mit. Project Performance'!J19)","v":0.7},{"$f":"IF('11 - Mit. Project Performance'!K19=\"\",\"\",'11 - Mit. Project Performance'!K19)","v":""}]
[null,null,null,null,null,null,null,null,null,null,null,null,null,null,null,null,null,null,"Selected Perfomance Measures",{"$f":"IF('1 - Project Structuring'!D10=\"\",\"\",'1 - Project Structuring'!D10)","v":"Cost"},null,null,null,null,null,null,null,null,null,null,null,null,null,null,null,null,null,null,null,{"$f":"IF('1 - Project Structuring'!C26=\"\",\"\",'1 - Project Structuring'!C26)","v":"ROW/Util/RR"},{"$f":"COUNTIF(Table1[Project Phase],'13 - Summary Report'!AN19)","v":10},null,null,null,null,null,null,null,null,null,null,null,null,{"$f":"IF('6 - Unmit. Project Performance'!A19=\"\",\"\",'6 - Unmit. Project Performance'!A19)","v":"Total"},{"$f":"IF('6 - Unmit. Project Performance'!B19=\"\",\"\",'6 - Unmit. Project Performance'!B19)","v":16.04},{"$f":"IF('6 - Unmit. Project Performance'!C19=\"\",\"\",'6 - Unmit. Project Performance'!C19)","v":""},{"$f":"IF('6 - Unmit. Project Performance'!D19=\"\",\"\",'6 - Unmit. Project Performance'!D19)","v":2.8},{"$f":"IF('6 - Unmit. Project Performance'!E19=\"\",\"\",'6 - Unmit. Project Performance'!E19)","v":5.5366796874999586},{"$f":"IF('6 - Unmit. Project Performance'!F19=\"\",\"\",'6 - Unmit. Project Performance'!F19)","v":""},{"$f":"IF('6 - Unmit. Project Performance'!G19=\"\",\"\",'6 - Unmit. Project Performance'!G19)","v":2.5000000000000022E-3},{"$f":"IF('6 - Unmit. Project Performance'!H19=\"\",\"\",'6 - Unmit. Project Performance'!H19)","v":21.576679687499958},{"$f":"IF('6 - Unmit. Project Performance'!I19=\"\",\"\",'6 - Unmit. Project Performance'!I19)","v":""},{"$f":"IF('6 - Unmit. Project Performance'!J19=\"\",\"\",'6 - Unmit. Project Performance'!J19)","v":2.8025000000000002},{"$f":"IF('6 - Unmit. Project Performance'!K19=\"\",\"\",'6 - Unmit. Project Performance'!K19)","v":22.995595322019629},null,null,null,null,null,null,null,null,null,null,null,null,null,null,null,null,null,null,null,null,null,null,null,null,null,null,null,null,null,null,null,null,null,null,null,null,null,{"$f":"IF('11 - Mit. Project Performance'!A20=\"\",\"\",'11 - Mit. Project Performance'!A20)","v":"Total (through Construction)"},{"$f":"IF('11 - Mit. Project Performance'!B20=\"\",\"\",'11 - Mit. Project Performance'!B20)","v":16.29},{"$f":"IF('11 - Mit. Project Performance'!C20=\"\",\"\",'11 - Mit. Project Performance'!C20)","v":""},{"$f":"IF('11 - Mit. Project Performance'!D20=\"\",\"\",'11 - Mit. Project Performance'!D20)","v":0.7},{"$f":"IF('11 - Mit. Project Performance'!E20=\"\",\"\",'11 - Mit. Project Performance'!E20)","v":4.5801640624999962},{"$f":"IF('11 - Mit. Project Performance'!F20=\"\",\"\",'11 - Mit. Project Performance'!F20)","v":""},{"$f":"IF('11 - Mit. Project Performance'!G20=\"\",\"\",'11 - Mit. Project Performance'!G20)","v":-2.0462500000000002E-2},{"$f":"IF('11 - Mit. Project Performance'!H20=\"\",\"\",'11 - Mit. Project Performance'!H20)","v":20.870164062499995},{"$f":"IF('11 - Mit. Project Performance'!I20=\"\",\"\",'11 - Mit. Project Performance'!I20)","v":""},{"$f":"IF('11 - Mit. Project Performance'!J20=\"\",\"\",'11 - Mit. Project Performance'!J20)","v":0.67953750000000002},{"$f":"IF('11 - Mit. Project Performance'!K20=\"\",\"\",'11 - Mit. Project Performance'!K20)","v":22.211698975803003}]
[null,null,null,null,null,null,null,null,null,null,null,null,null,null,null,null,null,null,null,{"$f":"IF('1 - Project Structuring'!D11=\"\",\"\",'1 - Project Structuring'!D11)","v":"Disruption"},null,null,null,null,null,null,null,null,null,null,null,null,null,null,null,null,null,null,null,{"$f":"IF('1 - Project Structuring'!C27=\"\",\"\",'1 - Project Structuring'!C27)","v":"Construction Funding Date"},{"$f":"COUNTIF(Table1[Project Phase],'13 - Summary Report'!AN20)","v":0}]
[null,null,null,null,null,null,null,null,null,null,null,null,null,null,null,null,null,null,"Project Start Date",{"$f":"IF('1 - Project Structuring'!E15=\"\",\"\",'1 - Project Structuring'!E15)","v":40148},null,null,null,null,null,null,null,null,"Base Schedule",null,null,null,null,null,null,null,null,null,null,{"$f":"IF('1 - Project Structuring'!C28=\"\",\"\",'1 - Project Structuring'!C28)","v":"Procurement"},{"$f":"COUNTIF(Table1[Project Phase],'13 - Summary Report'!AN21)","v":8},null,null,null,null,null,null,null,null,null,null,null,null,null,null,null,null,null,null,"Project Schedule",null,null,null,null,null,null,null,null,null,null,null,null,null,null,null,null,null,null,null,null,null,null,null,null,null,null,null,null,null,null,null,null,null,null,null,null,null,null,null,null,null,null,null,null,null,null,"Project Schedule"]
[null,null,null,null,null,null,null,null,null,null,null,null,null,null,null,null,null,null,"Target Date for Start of Operations",{"$f":"IF('1 - Project Structuring'!E16=\"\",\"\",'1 - Project Structuring'!E16)","v":41212},null,null,null,null,null,null,"Project Phase","Months/Date","Early Start","Early Finish","Late Start","Late Finish","Float",null,null,null,null,null,null,{"$f":"IF('1 - Project Structuring'!C29=\"\",\"\",'1 - Project Structuring'!C29)","v":"Final Design"},{"$f":"COUNTIF(Table1[Project Phase],'13 - Summary Report'!AN22)","v":0},null,null,null,null,null,null,null,null,null,null,null,null,"Project Phase",null,null,"Base Project Schedule Performance",null,null,null,null,null,"Unmitigated Project Schedule Performance",null,null,null,null,null,null,null,null,null,null,null,null,null,null,null,null,null,null,null,null,null,null,null,null,null,null,null,null,null,null,null,null,null,null,null,null,null,null,"Project Phase",null,null,"Unmitigated Project Schedule Performance",null,null,null,null,null,"Mitigated Project Schedule Performance"]
[null,null,null,null,null,null,null,null,null,null,null,null,null,null,null,null,null,null,"Preconstruction Inflation Rate",{"$f":"IF('1 - Project Structuring'!J54=\"\",\"\",'1 - Project Structuring'!J54)","v":3},"(%)",null,null,null,null,null,{"$f":"IF('1 - Project Structuring'!C20=\"\",\"\",'1 - Project Structuring'!C20)","v":"Planning"},{"$f":"IF('1 - Project Structuring'!D20=\"\",\"\",'1 - Project Structuring'!D20)","v":0},{"$f":"IF('1 - Project Structuring'!E20=\"\",\"\",'1 - Project Structuring'!E20)","v":40148},{"$f":"IF('1 - Project Structuring'!F20=\"\",\"\",'1 - Project Structuring'!F20)","v":40148},{"$f":"IF('1 - Project Structuring'!G20=\"\",\"\",'1 - Project Structuring'!G20)","v":40148},{"$f":"IF('1 - Project Structuring'!H20=\"\",\"\",'1 - Project Structuring'!H20)","v":40148},{"$f":"IF('1 - Project Structuring'!I20=\"\",\"\",'1 - Project Structuring'!I20)","v":0},null,null,null,null,null,null,{"$f":"IF('1 - Project Structuring'!C30=\"\",\"\",'1 - Project Structuring'!C30)","v":"Construction"},{"$f":"COUNTIF(Table1[Project Phase],'13 - Summary Report'!AN23)","v":12},null,null,null,null,null,null,null,null,null,null,null,null,null,"Duration (mo./date)","Early Start","Early Finish","Late   Start","Late Finish","Float     (mo.)","Duration (mo./date)","Early Start","Early Finish","Late Start","Late Finish","Float (mo.)","Mean Severity",null,null,null,null,null,null,null,null,null,null,null,null,null,null,null,null,null,null,null,null,null,null,null,null,null,null,null,null,null,null,null,null,null,null,null,"Duration (mo./date)","Early Start","Early Finish","Late   Start","Late Finish","Float (mo.)","Duration (mo./date)","Early Start","Early Finish","Late Start","Late Finish","Float (mo.)","Mean Severity"]
[null,null,null,null,null,null,null,null,null,null,null,null,null,null,null,null,null,null,"ROW/Utility/RR Inflation Rate",{"$f":"IF('1 - Project Structuring'!J55=\"\",\"\",'1 - Project Structuring'!J55)","v":3},"(%)",null,null,null,null,null,{"$f":"IF('1 - Project Structuring'!C21=\"\",\"\",'1 - Project Structuring'!C21)","v":"Scoping"},{"$f":"IF('1 - Project Structuring'!D21=\"\",\"\",'1 - Project Structuring'!D21)","v":0},{"$f":"IF('1 - Project Structuring'!E21=\"\",\"\",'1 - Project Structuring'!E21)","v":40148},{"$f":"IF('1 - Project Structuring'!F21=\"\",\"\",'1 - Project Structuring'!F21)","v":40148},{"$f":"IF('1 - Project Structuring'!G21=\"\",\"\",'1 - Project Structuring'!G21)","v":40148},{"$f":"IF('1 - Project Structuring'!H21=\"\",\"\",'1 - Project Structuring'!H21)","v":40148},{"$f":"IF('1 - Project Structuring'!I21=\"\",\"\",'1 - Project Structuring'!I21)","v":0},null,null,null,null,null,null,"Operations & Maintenance",{"$f":"COUNTIF(Table1[Project Phase],'13 - Summary Report'!AN24)","v":0},null,null,null,null,null,null,null,null,null,null,null,null,null,null,null,null,null,null,null,null,null,null,null,null,null,null,null,null,null,null,null,null,null,null,null,null,null,null,null,null,null,null,null,null,null,null,null,null,null,null,null,null,null,null,null,null,null,null,null,null,null,null,null,null,null,null,null,null,null,null,null,null,null,"YOE ($M)"]
[null,null,null,null,null,null,null,null,null,null,null,null,null,null,null,null,null,null,"Construction Inflation Rate",{"$f":"IF('1 - Project Structuring'!J56=\"\",\"\",'1 - Project Structuring'!J56)","v":3},"(%)",null,null,null,null,null,{"$f":"IF('1 - Project Structuring'!C22=\"\",\"\",'1 - Project Structuring'!C22)","v":"Design Funding Date"},{"$f":"IF('1 - Project Structuring'!D22=\"\",\"\",'1 - Project Structuring'!D22)","v":40148},{"$f":"IF('1 - Project Structuring'!E22=\"\",\"\",'1 - Project Structuring'!E22)","v":""},{"$f":"IF('1 - Project Structuring'!F22=\"\",\"\",'1 - Project Structuring'!F22)","v":40148},{"$f":"IF('1 - Project Structuring'!G22=\"\",\"\",'1 - Project Structuring'!G22)","v":""},{"$f":"IF('1 - Project Structuring'!H22=\"\",\"\",'1 - Project Structuring'!H22)","v":40148},{"$f":"IF('1 - Project Structuring'!I22=\"\",\"\",'1 - Project Structuring'!I22)","v":0},null,null,null,null,null,null,"Replacement",{"$f":"COUNTIF(Table1[Project Phase],'13 - Summary Report'!AN25)","v":0},null,null,null,null,null,null,null,null,null,null,null,null,{"$f":"IF('6 - Unmit. Project Performance'!A25=\"\",\"\",'6 - Unmit. Project Performance'!A25)","v":"Planning"},{"$f":"IF('6 - Unmit. Project Performance'!B25=\"\",\"\",'6 - Unmit. Project Performance'!B25)","v":0},{"$f":"IF('6 - Unmit. Project Performance'!C25=\"\",\"\",'6 - Unmit. Project Performance'!C25)","v":40148},{"$f":"IF('6 - Unmit. Project Performance'!D25=\"\",\"\",'6 - Unmit. Project Performance'!D25)","v":40148},{"$f":"IF('6 - Unmit. Project Performance'!E25=\"\",\"\",'6 - Unmit. Project Performance'!E25)","v":40148},{"$f":"IF('6 - Unmit. Project Performance'!F25=\"\",\"\",'6 - Unmit. Project Performance'!F25)","v":40148},{"$f":"IF('6 - Unmit. Project Performance'!G25=\"\",\"\",'6 - Unmit. Project Performance'!G25)","v":0},{"$f":"IF('6 - Unmit. Project Performance'!H25=\"\",\"\",'6 - Unmit. Project Performance'!H25)","v":0},{"$f":"IF('6 - Unmit. Project Performance'!I25=\"\",\"\",'6 - Unmit. Project Performance'!I25)","v":40148},{"$f":"IF('6 - Unmit. Project Performance'!J25=\"\",\"\",'6 - Unmit. Project Performance'!J25)","v":40148},{"$f":"IF('6 - Unmit. Project Performance'!K25=\"\",\"\",'6 - Unmit. Project Performance'!K25)","v":40148},{"$f":"IF('6 - Unmit. Project Performance'!L25=\"\",\"\",'6 - Unmit. Project Performance'!L25)","v":40148},{"$f":"IF('6 - Unmit. Project Performance'!M25=\"\",\"\",'6 - Unmit. Project Performance'!M25)","v":0},{"$f":"IF('6 - Unmit. Project Performance'!N25=\"\",\"\",'6 - Unmit. Project Performance'!N25)","v":1.3358515012435471E-2},null,null,null,null,null,null,null,null,null,null,null,null,null,null,null,null,null,null,null,null,null,null,null,null,null,null,null,null,null,null,null,null,null,null,{"$f":"IF('11 - Mit. Project Performance'!A26=\"\",\"\",'11 - Mit. Project Performance'!A26)","v":"Planning"},{"$f":"IF('11 - Mit. Project Performance'!B26=\"\",\"\",'11 - Mit. Project Performance'!B26)","v":0},{"$f":"IF('11 - Mit. Project Performance'!C26=\"\",\"\",'11 - Mit. Project Performance'!C26)","v":40148},{"$f":"IF('11 - Mit. Project Performance'!D26=\"\",\"\",'11 - Mit. Project Performance'!D26)","v":40148},{"$f":"IF('11 - Mit. Project Performance'!E26=\"\",\"\",'11 - Mit. Project Performance'!E26)","v":40148},{"$f":"IF('11 - Mit. Project Performance'!F26=\"\",\"\",'11 - Mit. Project Performance'!F26)","v":40148},{"$f":"IF('11 - Mit. Project Performance'!G26=\"\",\"\",'11 - Mit. Project Performance'!G26)","v":0},{"$f":"IF('11 - Mit. Project Performance'!H26=\"\",\"\",'11 - Mit. Project Performance'!H26)","v":0},{"$f":"IF('11 - Mit. Project Performance'!I26=\"\",\"\",'11 - Mit. Project Performance'!I26)","v":40148},{"$f":"IF('11 - Mit. Project Performance'!J26=\"\",\"\",'11 - Mit. Project Performance'!J26)","v":40148},{"$f":"IF('11 - Mit. Project Performance'!K26=\"\",\"\",'11 - Mit. Project Performance'!K26)","v":40148},{"$f":"IF('11 - Mit. Project Performance'!L26=\"\",\"\",'11 - Mit. Project Performance'!L26)","v":40148},{"$f":"IF('11 - Mit. Project Performance'!M26=\"\",\"\",'11 - Mit. Project Performance'!M26)","v":0},{"$f":"IF('11 - Mit. Project Performance'!N26=\"\",\"\",'11 - Mit. Project Performance'!N26)","v":1.3358515012435471E-2}]
[null,null,null,null,null,null,null,null,null,null,null,null,null,null,null,null,null,null,"Preconstruction Overhead Rate",{"$f":"IF('1 - Project Structuring'!J60=\"\",\"\",'1 - Project Structuring'!J60)","v":0.1},"($ M/month)",null,null,null,null,null,{"$f":"IF('1 - Project Structuring'!C23=\"\",\"\",'1 - Project Structuring'!C23)","v":"Prelim Design/Environmental Process"},{"$f":"IF('1 - Project Structuring'!D23=\"\",\"\",'1 - Project Structuring'!D23)","v":12},{"$f":"IF('1 - Project Structuring'!E23=\"\",\"\",'1 - Project Structuring'!E23)","v":40148},{"$f":"IF('1 - Project Structuring'!F23=\"\",\"\",'1 - Project Structuring'!F23)","v":40512.800000000003},{"$f":"IF('1 - Project Structuring'!G23=\"\",\"\",'1 - Project Structuring'!G23)","v":40148},{"$f":"IF('1 - Project Structuring'!H23=\"\",\"\",'1 - Project Structuring'!H23)","v":40512.800000000003},{"$f":"IF('1 - Project Structuring'!I23=\"\",\"\",'1 - Project Structuring'!I23)","v":0},null,null,null,null,null,null,"Total",{"$f":"SUM(AO13:AO25)","v":59},null,null,null,null,null,null,null,null,null,null,null,null,{"$f":"IF('6 - Unmit. Project Performance'!A26=\"\",\"\",'6 - Unmit. Project Performance'!A26)","v":"Scoping"},{"$f":"IF('6 - Unmit. Project Performance'!B26=\"\",\"\",'6 - Unmit. Project Performance'!B26)","v":0},{"$f":"IF('6 - Unmit. Project Performance'!C26=\"\",\"\",'6 - Unmit. Project Performance'!C26)","v":40148},{"$f":"IF('6 - Unmit. Project Performance'!D26=\"\",\"\",'6 - Unmit. Project Performance'!D26)","v":40148},{"$f":"IF('6 - Unmit. Project Performance'!E26=\"\",\"\",'6 - Unmit. Project Performance'!E26)","v":40148},{"$f":"IF('6 - Unmit. Project Performance'!F26=\"\",\"\",'6 - Unmit. Project Performance'!F26)","v":40148},{"$f":"IF('6 - Unmit. Project Performance'!G26=\"\",\"\",'6 - Unmit. Project Performance'!G26)","v":0},{"$f":"IF('6 - Unmit. Project Performance'!H26=\"\",\"\",'6 - Unmit. Project Performance'!H26)","v":0},{"$f":"IF('6 - Unmit. Project Performance'!I26=\"\",\"\",'6 - Unmit. Project Performance'!I26)","v":40148},{"$f":"IF('6 - Unmit. Project Performance'!J26=\"\",\"\",'6 - Unmit. Project Performance'!J26)","v":40148},{"$f":"IF('6 - Unmit. Project Performance'!K26=\"\",\"\",'6 - Unmit. Project Performance'!K26)","v":40148},{"$f":"IF('6 - Unmit. Project Performance'!L26=\"\",\"\",'6 - Unmit. Project Performance'!L26)","v":40148},{"$f":"IF('6 - Unmit. Project Performance'!M26=\"\",\"\",'6 - Unmit. Project Performance'!M26)","v":0},{"$f":"IF('6 - Unmit. Project Performance'!N26=\"\",\"\",'6 - Unmit. Project Performance'!N26)","v":0.88765708065301974},null,null,null,null,null,null,null,null,null,null,null,null,null,null,null,null,null,null,null,null,null,null,null,null,null,null,null,null,null,null,null,null,null,null,{"$f":"IF('11 - Mit. Project Performance'!A27=\"\",\"\",'11 - Mit. Project Performance'!A27)","v":"Scoping"},{"$f":"IF('11 - Mit. Project Performance'!B27=\"\",\"\",'11 - Mit. Project Performance'!B27)","v":0},{"$f":"IF('11 - Mit. Project Performance'!C27=\"\",\"\",'11 - Mit. Project Performance'!C27)","v":40148},{"$f":"IF('11 - Mit. Project Performance'!D27=\"\",\"\",'11 - Mit. Project Performance'!D27)","v":40148},{"$f":"IF('11 - Mit. Project Performance'!E27=\"\",\"\",'11 - Mit. Project Performance'!E27)","v":40148},{"$f":"IF('11 - Mit. Project Performance'!F27=\"\",\"\",'11 - Mit. Project Performance'!F27)","v":40148},{"$f":"IF('11 - Mit. Project Performance'!G27=\"\",\"\",'11 - Mit. Project Performance'!G27)","v":0},{"$f":"IF('11 - Mit. Project Performance'!H27=\"\",\"\",'11 - Mit. Project Performance'!H27)","v":0},{"$f":"IF('11 - Mit. Project Performance'!I27=\"\",\"\",'11 - Mit. Project Performance'!I27)","v":40148},{"$f":"IF('11 - Mit. Project Performance'!J27=\"\",\"\",'11 - Mit. Project Performance'!J27)","v":40148},{"$f":"IF('11 - Mit. Project Performance'!K27=\"\",\"\",'11 - Mit. Project Performance'!K27)","v":40148},{"$f":"IF('11 - Mit. Project Performance'!L27=\"\",\"\",'11 - Mit. Project Performance'!L27)","v":40148},{"$f":"IF('11 - Mit. Project Performance'!M27=\"\",\"\",'11 - Mit. Project Performance'!M27)","v":0},{"$f":"IF('11 - Mit. Project Performance'!N27=\"\",\"\",'11 - Mit. Project Performance'!N27)","v":0.5790753838657603}]
[null,null,null,null,null,null,null,null,null,null,null,null,null,null,null,null,null,null,"Construction Overhead Rate",{"$f":"IF('1 - Project Structuring'!J61=\"\",\"\",'1 - Project Structuring'!J61)","v":0.22500000000000001},"($ M/month)",null,null,null,null,null,{"$f":"IF('1 - Project Structuring'!C24=\"\",\"\",'1 - Project Structuring'!C24)","v":"Environmental Permits"},{"$f":"IF('1 - Project Structuring'!D24=\"\",\"\",'1 - Project Structuring'!D24)","v":6},{"$f":"IF('1 - Project Structuring'!E24=\"\",\"\",'1 - Project Structuring'!E24)","v":40512.800000000003},{"$f":"IF('1 - Project Structuring'!F24=\"\",\"\",'1 - Project Structuring'!F24)","v":40695.200000000004},{"$f":"IF('1 - Project Structuring'!G24=\"\",\"\",'1 - Project Structuring'!G24)","v":40512.800000000003},{"$f":"IF('1 - Project Structuring'!H24=\"\",\"\",'1 - Project Structuring'!H24)","v":40695.200000000004},{"$f":"IF('1 - Project Structuring'!I24=\"\",\"\",'1 - Project Structuring'!I24)","v":0},null,null,null,null,null,null,null,null,null,null,null,null,null,null,null,null,null,null,null,null,{"$f":"IF('6 - Unmit. Project Performance'!A27=\"\",\"\",'6 - Unmit. Project Performance'!A27)","v":"Design Funding Date"},{"$f":"IF('6 - Unmit. Project Performance'!B27=\"\",\"\",'6 - Unmit. Project Performance'!B27)","v":40148},{"$f":"IF('6 - Unmit. Project Performance'!C27=\"\",\"\",'6 - Unmit. Project Performance'!C27)","v":""},{"$f":"IF('6 - Unmit. Project Performance'!D27=\"\",\"\",'6 - Unmit. Project Performance'!D27)","v":40148},{"$f":"IF('6 - Unmit. Project Performance'!E27=\"\",\"\",'6 - Unmit. Project Performance'!E27)","v":""},{"$f":"IF('6 - Unmit. Project Performance'!F27=\"\",\"\",'6 - Unmit. Project Performance'!F27)","v":40148},{"$f":"IF('6 - Unmit. Project Performance'!G27=\"\",\"\",'6 - Unmit. Project Performance'!G27)","v":0},{"$f":"IF('6 - Unmit. Project Performance'!H27=\"\",\"\",'6 - Unmit. Project Performance'!H27)","v":40148},{"$f":"IF('6 - Unmit. Project Performance'!I27=\"\",\"\",'6 - Unmit. Project Performance'!I27)","v":""},{"$f":"IF('6 - Unmit. Project Performance'!J27=\"\",\"\",'6 - Unmit. Project Performance'!J27)","v":40148},{"$f":"IF('6 - Unmit. Project Performance'!K27=\"\",\"\",'6 - Unmit. Project Performance'!K27)","v":""},{"$f":"IF('6 - Unmit. Project Performance'!L27=\"\",\"\",'6 - Unmit. Project Performance'!L27)","v":40148},{"$f":"IF('6 - Unmit. Project Performance'!M27=\"\",\"\",'6 - Unmit. Project Performance'!M27)","v":0},{"$f":"IF('6 - Unmit. Project Performance'!N27=\"\",\"\",'6 - Unmit. Project Performance'!N27)","v":0},null,null,null,null,null,null,null,null,null,null,null,null,null,null,null,null,null,null,null,null,null,null,null,null,null,null,null,null,null,null,null,null,null,null,{"$f":"IF('11 - Mit. Project Performance'!A28=\"\",\"\",'11 - Mit. Project Performance'!A28)","v":"Design Funding Date"},{"$f":"IF('11 - Mit. Project Performance'!B28=\"\",\"\",'11 - Mit. Project Performance'!B28)","v":40148},{"$f":"IF('11 - Mit. Project Performance'!C28=\"\",\"\",'11 - Mit. Project Performance'!C28)","v":""},{"$f":"IF('11 - Mit. Project Performance'!D28=\"\",\"\",'11 - Mit. Project Performance'!D28)","v":40148},{"$f":"IF('11 - Mit. Project Performance'!E28=\"\",\"\",'11 - Mit. Project Performance'!E28)","v":""},{"$f":"IF('11 - Mit. Project Performance'!F28=\"\",\"\",'11 - Mit. Project Performance'!F28)","v":40148},{"$f":"IF('11 - Mit. Project Performance'!G28=\"\",\"\",'11 - Mit. Project Performance'!G28)","v":0},{"$f":"IF('11 - Mit. Project Performance'!H28=\"\",\"\",'11 - Mit. Project Performance'!H28)","v":40148},{"$f":"IF('11 - Mit. Project Performance'!I28=\"\",\"\",'11 - Mit. Project Performance'!I28)","v":""},{"$f":"IF('11 - Mit. Project Performance'!J28=\"\",\"\",'11 - Mit. Project Performance'!J28)","v":40148},{"$f":"IF('11 - Mit. Project Performance'!K28=\"\",\"\",'11 - Mit. Project Performance'!K28)","v":""},{"$f":"IF('11 - Mit. Project Performance'!L28=\"\",\"\",'11 - Mit. Project Performance'!L28)","v":40148},{"$f":"IF('11 - Mit. Project Performance'!M28=\"\",\"\",'11 - Mit. Project Performance'!M28)","v":0},{"$f":"IF('11 - Mit. Project Performance'!N28=\"\",\"\",'11 - Mit. Project Performance'!N28)","v":0}]
[null,null,null,null,null,null,null,null,null,null,null,null,null,null,null,null,null,null,"Disruption Value",{"$f":"IF('1 - Project Structuring'!E80=\"\",\"\",'1 - Project Structuring'!E80)","v":10},"($/day)",null,null,null,null,null,{"$f":"IF('1 - Project Structuring'!C25=\"\",\"\",'1 - Project Structuring'!C25)","v":"ROW/Util/RR Funding Date"},{"$f":"IF('1 - Project Structuring'!D25=\"\",\"\",'1 - Project Structuring'!D25)","v":40148},{"$f":"IF('1 - Project Structuring'!E25=\"\",\"\",'1 - Project Structuring'!E25)","v":""},{"$f":"IF('1 - Project Structuring'!F25=\"\",\"\",'1 - Project Structuring'!F25)","v":40148},{"$f":"IF('1 - Project Structuring'!G25=\"\",\"\",'1 - Project Structuring'!G25)","v":""},{"$f":"IF('1 - Project Structuring'!H25=\"\",\"\",'1 - Project Structuring'!H25)","v":40877.600000000006},{"$f":"IF('1 - Project Structuring'!I25=\"\",\"\",'1 - Project Structuring'!I25)","v":24.000000000000192},null,null,null,null,null,null,null,null,null,null,null,null,null,null,null,null,null,null,null,null,{"$f":"IF('6 - Unmit. Project Performance'!A28=\"\",\"\",'6 - Unmit. Project Performance'!A28)","v":"Prelim Design/Environmental Process"},{"$f":"IF('6 - Unmit. Project Performance'!B28=\"\",\"\",'6 - Unmit. Project Performance'!B28)","v":12},{"$f":"IF('6 - Unmit. Project Performance'!C28=\"\",\"\",'6 - Unmit. Project Performance'!C28)","v":40148},{"$f":"IF('6 - Unmit. Project Performance'!D28=\"\",\"\",'6 - Unmit. Project Performance'!D28)","v":40512.800000000003},{"$f":"IF('6 - Unmit. Project Performance'!E28=\"\",\"\",'6 - Unmit. Project Performance'!E28)","v":40148},{"$f":"IF('6 - Unmit. Project Performance'!F28=\"\",\"\",'6 - Unmit. Project Performance'!F28)","v":40512.800000000003},{"$f":"IF('6 - Unmit. Project Performance'!G28=\"\",\"\",'6 - Unmit. Project Performance'!G28)","v":0},{"$f":"IF('6 - Unmit. Project Performance'!H28=\"\",\"\",'6 - Unmit. Project Performance'!H28)","v":13.46875},{"$f":"IF('6 - Unmit. Project Performance'!I28=\"\",\"\",'6 - Unmit. Project Performance'!I28)","v":40148},{"$f":"IF('6 - Unmit. Project Performance'!J28=\"\",\"\",'6 - Unmit. Project Performance'!J28)","v":40557.449999999997},{"$f":"IF('6 - Unmit. Project Performance'!K28=\"\",\"\",'6 - Unmit. Project Performance'!K28)","v":40148},{"$f":"IF('6 - Unmit. Project Performance'!L28=\"\",\"\",'6 - Unmit. Project Performance'!L28)","v":40557.449999999997},{"$f":"IF('6 - Unmit. Project Performance'!M28=\"\",\"\",'6 - Unmit. Project Performance'!M28)","v":0},{"$f":"IF('6 - Unmit. Project Performance'!N28=\"\",\"\",'6 - Unmit. Project Performance'!N28)","v":1.3676732168428556},null,null,null,null,null,null,null,null,null,null,null,null,null,null,null,null,null,null,null,null,null,null,null,null,null,null,null,null,null,null,null,null,null,null,{"$f":"IF('11 - Mit. Project Performance'!A29=\"\",\"\",'11 - Mit. Project Performance'!A29)","v":"Prelim Design/Environmental Process"},{"$f":"IF('11 - Mit. Project Performance'!B29=\"\",\"\",'11 - Mit. Project Performance'!B29)","v":13.46875},{"$f":"IF('11 - Mit. Project Performance'!C29=\"\",\"\",'11 - Mit. Project Performance'!C29)","v":40148},{"$f":"IF('11 - Mit. Project Performance'!D29=\"\",\"\",'11 - Mit. Project Performance'!D29)","v":40557.449999999997},{"$f":"IF('11 - Mit. Project Performance'!E29=\"\",\"\",'11 - Mit. Project Performance'!E29)","v":40148},{"$f":"IF('11 - Mit. Project Performance'!F29=\"\",\"\",'11 - Mit. Project Performance'!F29)","v":40557.449999999997},{"$f":"IF('11 - Mit. Project Performance'!G29=\"\",\"\",'11 - Mit. Project Performance'!G29)","v":0},{"$f":"IF('11 - Mit. Project Performance'!H29=\"\",\"\",'11 - Mit. Project Performance'!H29)","v":13.46875},{"$f":"IF('11 - Mit. Project Performance'!I29=\"\",\"\",'11 - Mit. Project Performance'!I29)","v":40148},{"$f":"IF('11 - Mit. Project Performance'!J29=\"\",\"\",'11 - Mit. Project Performance'!J29)","v":40557.449999999997},{"$f":"IF('11 - Mit. Project Performance'!K29=\"\",\"\",'11 - Mit. Project Performance'!K29)","v":40148},{"$f":"IF('11 - Mit. Project Performance'!L29=\"\",\"\",'11 - Mit. Project Performance'!L29)","v":40557.449999999997},{"$f":"IF('11 - Mit. Project Performance'!M29=\"\",\"\",'11 - Mit. Project Performance'!M29)","v":0},{"$f":"IF('11 - Mit. Project Performance'!N29=\"\",\"\",'11 - Mit. Project Performance'!N29)","v":1.1801687015485127}]
[null,null,null,null,null,null,null,null,null,null,null,null,null,null,null,null,null,null,"Schedule Value",{"$f":"IF('1 - Project Structuring'!E17=\"\",\"\",'1 - Project Structuring'!E17)","v":0.1},"($ M/month)",null,null,null,null,null,{"$f":"IF('1 - Project Structuring'!C26=\"\",\"\",'1 - Project Structuring'!C26)","v":"ROW/Util/RR"},{"$f":"IF('1 - Project Structuring'!D26=\"\",\"\",'1 - Project Structuring'!D26)","v":12},{"$f":"IF('1 - Project Structuring'!E26=\"\",\"\",'1 - Project Structuring'!E26)","v":40512.800000000003},{"$f":"IF('1 - Project Structuring'!F26=\"\",\"\",'1 - Project Structuring'!F26)","v":40877.600000000006},{"$f":"IF('1 - Project Structuring'!G26=\"\",\"\",'1 - Project Structuring'!G26)","v":40512.800000000003},{"$f":"IF('1 - Project Structuring'!H26=\"\",\"\",'1 - Project Structuring'!H26)","v":40877.600000000006},{"$f":"IF('1 - Project Structuring'!I26=\"\",\"\",'1 - Project Structuring'!I26)","v":0},null,null,null,null,null,null,null,null,null,null,null,null,null,null,null,null,null,null,null,null,{"$f":"IF('6 - Unmit. Project Performance'!A29=\"\",\"\",'6 - Unmit. Project Performance'!A29)","v":"Environmental Permits"},{"$f":"IF('6 - Unmit. Project Performance'!B29=\"\",\"\",'6 - Unmit. Project Performance'!B29)","v":6},{"$f":"IF('6 - Unmit. Project Performance'!C29=\"\",\"\",'6 - Unmit. Project Performance'!C29)","v":40512.800000000003},{"$f":"IF('6 - Unmit. Project Performance'!D29=\"\",\"\",'6 - Unmit. Project Performance'!D29)","v":40695.200000000004},{"$f":"IF('6 - Unmit. Project Performance'!E29=\"\",\"\",'6 - Unmit. Project Performance'!E29)","v":40512.800000000003},{"$f":"IF('6 - Unmit. Project Performance'!F29=\"\",\"\",'6 - Unmit. Project Performance'!F29)","v":40695.200000000004},{"$f":"IF('6 - Unmit. Project Performance'!G29=\"\",\"\",'6 - Unmit. Project Performance'!G29)","v":0},{"$f":"IF('6 - Unmit. Project Performance'!H29=\"\",\"\",'6 - Unmit. Project Performance'!H29)","v":6.3125},{"$f":"IF('6 - Unmit. Project Performance'!I29=\"\",\"\",'6 - Unmit. Project Performance'!I29)","v":40557.449999999997},{"$f":"IF('6 - Unmit. Project Performance'!J29=\"\",\"\",'6 - Unmit. Project Performance'!J29)","v":40749.35},{"$f":"IF('6 - Unmit. Project Performance'!K29=\"\",\"\",'6 - Unmit. Project Performance'!K29)","v":40582.149999999994},{"$f":"IF('6 - Unmit. Project Performance'!L29=\"\",\"\",'6 - Unmit. Project Performance'!L29)","v":40774.049999999996},{"$f":"IF('6 - Unmit. Project Performance'!M29=\"\",\"\",'6 - Unmit. Project Performance'!M29)","v":0.8124999999999043},{"$f":"IF('6 - Unmit. Project Performance'!N29=\"\",\"\",'6 - Unmit. Project Performance'!N29)","v":7.3451630977436261E-2},null,null,null,null,null,null,null,null,null,null,null,null,null,null,null,null,null,null,null,null,null,null,null,null,null,null,null,null,null,null,null,null,null,null,null,null,null,null,null,null,null,null,null,null,null,null,null,{"$f":"IF('11 - Mit. Project Performance'!N30=\"\",\"\",'11 - Mit. Project Performance'!N30)","v":7.3451630977436261E-2}]
[null,null,null,null,null,null,null,null,null,null,null,null,null,null,null,null,null,null,"Facility Performance Period",{"$f":"IF('1 - Project Structuring'!D65=\"\",\"\",'1 - Project Structuring'!D65)","v":50},"(years)",null,null,null,null,null,{"$f":"IF('1 - Project Structuring'!C27=\"\",\"\",'1 - Project Structuring'!C27)","v":"Construction Funding Date"},{"$f":"IF('1 - Project Structuring'!D27=\"\",\"\",'1 - Project Structuring'!D27)","v":40148},{"$f":"IF('1 - Project Structuring'!E27=\"\",\"\",'1 - Project Structuring'!E27)","v":""},{"$f":"IF('1 - Project Structuring'!F27=\"\",\"\",'1 - Project Structuring'!F27)","v":40148},{"$f":"IF('1 - Project Structuring'!G27=\"\",\"\",'1 - Project Structuring'!G27)","v":""},{"$f":"IF('1 - Project Structuring'!H27=\"\",\"\",'1 - Project Structuring'!H27)","v":40512.800000000003},{"$f":"IF('1 - Project Structuring'!I27=\"\",\"\",'1 - Project Structuring'!I27)","v":12.000000000000096},null,null,null,null,null,null,null,null,null,null,null,null,null,null,null,null,null,null,null,null,{"$f":"IF('6 - Unmit. Project Performance'!A30=\"\",\"\",'6 - Unmit. Project Performance'!A30)","v":"ROW/Util/RR Funding Date"},{"$f":"IF('6 - Unmit. Project Performance'!B30=\"\",\"\",'6 - Unmit. Project Performance'!B30)","v":40148},{"$f":"IF('6 - Unmit. Project Performance'!C30=\"\",\"\",'6 - Unmit. Project Performance'!C30)","v":""},{"$f":"IF('6 - Unmit. Project Performance'!D30=\"\",\"\",'6 - Unmit. Project Performance'!D30)","v":40148},{"$f":"IF('6 - Unmit. Project Performance'!E30=\"\",\"\",'6 - Unmit. Project Performance'!E30)","v":""},{"$f":"IF('6 - Unmit. Project Performance'!F30=\"\",\"\",'6 - Unmit. Project Performance'!F30)","v":40877.600000000006},{"$f":"IF('6 - Unmit. Project Performance'!G30=\"\",\"\",'6 - Unmit. Project Performance'!G30)","v":24.000000000000192},{"$f":"IF('6 - Unmit. Project Performance'!H30=\"\",\"\",'6 - Unmit. Project Performance'!H30)","v":40148},{"$f":"IF('6 - Unmit. Project Performance'!I30=\"\",\"\",'6 - Unmit. Project Performance'!I30)","v":""},{"$f":"IF('6 - Unmit. Project Performance'!J30=\"\",\"\",'6 - Unmit. Project Performance'!J30)","v":40148},{"$f":"IF('6 - Unmit. Project Performance'!K30=\"\",\"\",'6 - Unmit. Project Performance'!K30)","v":""},{"$f":"IF('6 - Unmit. Project Performance'!L30=\"\",\"\",'6 - Unmit. Project Performance'!L30)","v":40956.449999999997},{"$f":"IF('6 - Unmit. Project Performance'!M30=\"\",\"\",'6 - Unmit. Project Performance'!M30)","v":26.593749999999904},{"$f":"IF('6 - Unmit. Project Performance'!N30=\"\",\"\",'6 - Unmit. Project Performance'!N30)","v":0},null,null,null,null,null,null,null,null,null,null,null,null,null,null,null,null,null,null,null,null,null,null,null,null,null,null,null,null,null,null,null,null,null,null,null,null,null,null,null,null,null,null,null,null,null,null,null,{"$f":"IF('11 - Mit. Project Performance'!N31=\"\",\"\",'11 - Mit. Project Performance'!N31)","v":0}]
[null,null,null,null,null,null,null,null,null,null,null,null,null,null,null,null,null,null,"Discount Rate",{"$f":"IF('1 - Project Structuring'!D66=\"\",\"\",'1 - Project Structuring'!D66)","v":5},"(%)",null,null,null,null,null,{"$f":"IF('1 - Project Structuring'!C28=\"\",\"\",'1 - Project Structuring'!C28)","v":"Procurement"},{"$f":"IF('1 - Project Structuring'!D28=\"\",\"\",'1 - Project Structuring'!D28)","v":6},{"$f":"IF('1 - Project Structuring'!E28=\"\",\"\",'1 - Project Structuring'!E28)","v":40512.800000000003},{"$f":"IF('1 - Project Structuring'!F28=\"\",\"\",'1 - Project Structuring'!F28)","v":40695.200000000004},{"$f":"IF('1 - Project Structuring'!G28=\"\",\"\",'1 - Project Structuring'!G28)","v":40512.800000000003},{"$f":"IF('1 - Project Structuring'!H28=\"\",\"\",'1 - Project Structuring'!H28)","v":40695.200000000004},{"$f":"IF('1 - Project Structuring'!I28=\"\",\"\",'1 - Project Structuring'!I28)","v":0},null,null,null,null,null,null,null,null,null,null,null,null,null,null,null,null,null,null,null,null,{"$f":"IF('6 - Unmit. Project Performance'!A31=\"\",\"\",'6 - Unmit. Project Performance'!A31)","v":"ROW/Util/RR"},{"$f":"IF('6 - Unmit. Project Performance'!B31=\"\",\"\",'6 - Unmit. Project Performance'!B31)","v":12},{"$f":"IF('6 - Unmit. Project Performance'!C31=\"\",\"\",'6 - Unmit. Project Performance'!C31)","v":40512.800000000003},{"$f":"IF('6 - Unmit. Project Performance'!D31=\"\",\"\",'6 - Unmit. Project Performance'!D31)","v":40877.600000000006},{"$f":"IF('6 - Unmit. Project Performance'!E31=\"\",\"\",'6 - Unmit. Project Performance'!E31)","v":40512.800000000003},{"$f":"IF('6 - Unmit. Project Performance'!F31=\"\",\"\",'6 - Unmit. Project Performance'!F31)","v":40877.600000000006},{"$f":"IF('6 - Unmit. Project Performance'!G31=\"\",\"\",'6 - Unmit. Project Performance'!G31)","v":0},{"$f":"IF('6 - Unmit. Project Performance'!H31=\"\",\"\",'6 - Unmit. Project Performance'!H31)","v":13.125},{"$f":"IF('6 - Unmit. Project Performance'!I31=\"\",\"\",'6 - Unmit. Project Performance'!I31)","v":40557.449999999997},{"$f":"IF('6 - Unmit. Project Performance'!J31=\"\",\"\",'6 - Unmit. Project Performance'!J31)","v":40956.449999999997},{"$f":"IF('6 - Unmit. Project Performance'!K31=\"\",\"\",'6 - Unmit. Project Performance'!K31)","v":40557.449999999997},{"$f":"IF('6 - Unmit. Project Performance'!L31=\"\",\"\",'6 - Unmit. Project Performance'!L31)","v":40956.449999999997},{"$f":"IF('6 - Unmit. Project Performance'!M31=\"\",\"\",'6 - Unmit. Project Performance'!M31)","v":0},{"$f":"IF('6 - Unmit. Project Performance'!N31=\"\",\"\",'6 - Unmit. Project Performance'!N31)","v":2.4782631230718697},null,null,null,null,null,null,null,null,null,null,null,null,null,null,null,null,null,null,null,null,null,null,null,null,null,null,null,null,null,null,null,null,null,null,{"$f":"IF('11 - Mit. Project Performance'!A30=\"\",\"\",'11 - Mit. Project Performance'!A30)","v":"Environmental Permits"},{"$f":"IF('11 - Mit. Project Performance'!B30=\"\",\"\",'11 - Mit. Project Performance'!B30)","v":6.3125},{"$f":"IF('11 - Mit. Project Performance'!C30=\"\",\"\",'11 - Mit. Project Performance'!C30)","v":40557.449999999997},{"$f":"IF('11 - Mit. Project Performance'!D30=\"\",\"\",'11 - Mit. Project Performance'!D30)","v":40749.35},{"$f":"IF('11 - Mit. Project Performance'!E30=\"\",\"\",'11 - Mit. Project Performance'!E30)","v":40582.149999999994},{"$f":"IF('11 - Mit. Project Performance'!F30=\"\",\"\",'11 - Mit. Project Performance'!F30)","v":40774.049999999996},{"$f":"IF('11 - Mit. Project Performance'!G30=\"\",\"\",'11 - Mit. Project Performance'!G30)","v":0.8124999999999043},{"$f":"IF('11 - Mit. Project Performance'!H30=\"\",\"\",'11 - Mit. Project Performance'!H30)","v":6.3125},{"$f":"IF('11 - Mit. Project Performance'!I30=\"\",\"\",'11 - Mit. Project Performance'!I30)","v":40557.449999999997},{"$f":"IF('11 - Mit. Project Performance'!J30=\"\",\"\",'11 - Mit. Project Performance'!J30)","v":40749.35},{"$f":"IF('11 - Mit. Project Performance'!K30=\"\",\"\",'11 - Mit. Project Performance'!K30)","v":40569.324999999997},{"$f":"IF('11 - Mit. Project Performance'!L30=\"\",\"\",'11 - Mit. Project Performance'!L30)","v":40761.224999999999},{"$f":"IF('11 - Mit. Project Performance'!M30=\"\",\"\",'11 - Mit. Project Performance'!M30)","v":0.390625},{"$f":"IF('11 - Mit. Project Performance'!N32=\"\",\"\",'11 - Mit. Project Performance'!N32)","v":2.2659444425839612}]
[null,null,null,null,null,null,null,null,null,null,null,null,null,null,null,null,null,null,"Agency/User Discount Factor",{"$f":"IF('1 - Project Structuring'!E81=\"\",\"\",'1 - Project Structuring'!E81)","v":1},null,null,null,null,null,null,{"$f":"IF('1 - Project Structuring'!C29=\"\",\"\",'1 - Project Structuring'!C29)","v":"Final Design"},{"$f":"IF('1 - Project Structuring'!D29=\"\",\"\",'1 - Project Structuring'!D29)","v":6},{"$f":"IF('1 - Project Structuring'!E29=\"\",\"\",'1 - Project Structuring'!E29)","v":40695.200000000004},{"$f":"IF('1 - Project Structuring'!F29=\"\",\"\",'1 - Project Structuring'!F29)","v":40877.600000000006},{"$f":"IF('1 - Project Structuring'!G29=\"\",\"\",'1 - Project Structuring'!G29)","v":40695.200000000004},{"$f":"IF('1 - Project Structuring'!H29=\"\",\"\",'1 - Project Structuring'!H29)","v":41029.600000000006},{"$f":"IF('1 - Project Structuring'!I29=\"\",\"\",'1 - Project Structuring'!I29)","v":5},null,null,null,null,null,null,null,null,null,null,null,null,null,null,null,null,null,null,null,null,{"$f":"IF('6 - Unmit. Project Performance'!A32=\"\",\"\",'6 - Unmit. Project Performance'!A32)","v":"Construction Funding Date"},{"$f":"IF('6 - Unmit. Project Performance'!B32=\"\",\"\",'6 - Unmit. Project Performance'!B32)","v":40148},{"$f":"IF('6 - Unmit. Project Performance'!C32=\"\",\"\",'6 - Unmit. Project Performance'!C32)","v":""},{"$f":"IF('6 - Unmit. Project Performance'!D32=\"\",\"\",'6 - Unmit. Project Performance'!D32)","v":40148},{"$f":"IF('6 - Unmit. Project Performance'!E32=\"\",\"\",'6 - Unmit. Project Performance'!E32)","v":""},{"$f":"IF('6 - Unmit. Project Performance'!F32=\"\",\"\",'6 - Unmit. Project Performance'!F32)","v":40512.800000000003},{"$f":"IF('6 - Unmit. Project Performance'!G32=\"\",\"\",'6 - Unmit. Project Performance'!G32)","v":12.000000000000096},{"$f":"IF('6 - Unmit. Project Performance'!H32=\"\",\"\",'6 - Unmit. Project Performance'!H32)","v":40148},{"$f":"IF('6 - Unmit. Project Performance'!I32=\"\",\"\",'6 - Unmit. Project Performance'!I32)","v":""},{"$f":"IF('6 - Unmit. Project Performance'!J32=\"\",\"\",'6 - Unmit. Project Performance'!J32)","v":40148},{"$f":"IF('6 - Unmit. Project Performance'!K32=\"\",\"\",'6 - Unmit. Project Performance'!K32)","v":""},{"$f":"IF('6 - Unmit. Project Performance'!L32=\"\",\"\",'6 - Unmit. Project Performance'!L32)","v":40582.862499999996},{"$f":"IF('6 - Unmit. Project Performance'!M32=\"\",\"\",'6 - Unmit. Project Performance'!M32)","v":14.304687499999858},{"$f":"IF('6 - Unmit. Project Performance'!N32=\"\",\"\",'6 - Unmit. Project Performance'!N32)","v":0},null,null,null,null,null,null,null,null,null,null,null,null,null,null,null,null,null,null,null,null,null,null,null,null,null,null,null,null,null,null,null,null,null,null,{"$f":"IF('11 - Mit. Project Performance'!A31=\"\",\"\",'11 - Mit. Project Performance'!A31)","v":"ROW/Util/RR Funding Date"},{"$f":"IF('11 - Mit. Project Performance'!B31=\"\",\"\",'11 - Mit. Project Performance'!B31)","v":40148},{"$f":"IF('11 - Mit. Project Performance'!C31=\"\",\"\",'11 - Mit. Project Performance'!C31)","v":""},{"$f":"IF('11 - Mit. Project Performance'!D31=\"\",\"\",'11 - Mit. Project Performance'!D31)","v":40148},{"$f":"IF('11 - Mit. Project Performance'!E31=\"\",\"\",'11 - Mit. Project Performance'!E31)","v":""},{"$f":"IF('11 - Mit. Project Performance'!F31=\"\",\"\",'11 - Mit. Project Performance'!F31)","v":40956.449999999997},{"$f":"IF('11 - Mit. Project Performance'!G31=\"\",\"\",'11 - Mit. Project Performance'!G31)","v":26.593749999999904},{"$f":"IF('11 - Mit. Project Performance'!H31=\"\",\"\",'11 - Mit. Project Performance'!H31)","v":40148},{"$f":"IF('11 - Mit. Project Performance'!I31=\"\",\"\",'11 - Mit. Project Performance'!I31)","v":""},{"$f":"IF('11 - Mit. Project Performance'!J31=\"\",\"\",'11 - Mit. Project Performance'!J31)","v":40148},{"$f":"IF('11 - Mit. Project Performance'!K31=\"\",\"\",'11 - Mit. Project Performance'!K31)","v":""},{"$f":"IF('11 - Mit. Project Performance'!L31=\"\",\"\",'11 - Mit. Project Performance'!L31)","v":40943.625},{"$f":"IF('11 - Mit. Project Performance'!M31=\"\",\"\",'11 - Mit. Project Performance'!M31)","v":26.171875},{"$f":"IF('11 - Mit. Project Performance'!N33=\"\",\"\",'11 - Mit. Project Performance'!N33)","v":0}]
[null,null,null,null,null,null,null,null,null,null,null,null,null,null,null,null,null,null,"Total Unescalated Cost ",{"$f":"IF('1 - Project Structuring'!D99=\"\",\"\",ROUND(SUM('1 - Project Structuring'!D99:D108),1))","v":""},"($M)",null,null,null,null,null,{"$f":"IF('1 - Project Structuring'!C30=\"\",\"\",'1 - Project Structuring'!C30)","v":"Construction"},{"$f":"IF('1 - Project Structuring'!D30=\"\",\"\",'1 - Project Structuring'!D30)","v":16},{"$f":"IF('1 - Project Structuring'!E30=\"\",\"\",'1 - Project Structuring'!E30)","v":40725.600000000006},{"$f":"IF('1 - Project Structuring'!F30=\"\",\"\",'1 - Project Structuring'!F30)","v":41212.000000000007},{"$f":"IF('1 - Project Structuring'!G30=\"\",\"\",'1 - Project Structuring'!G30)","v":40725.600000000006},{"$f":"IF('1 - Project Structuring'!H30=\"\",\"\",'1 - Project Structuring'!H30)","v":41212.000000000007},{"$f":"IF('1 - Project Structuring'!I30=\"\",\"\",'1 - Project Structuring'!I30)","v":0},null,null,null,null,null,null,null,null,null,null,null,null,null,null,null,null,null,null,null,null,{"$f":"IF('6 - Unmit. Project Performance'!A33=\"\",\"\",'6 - Unmit. Project Performance'!A33)","v":"Procurement"},{"$f":"IF('6 - Unmit. Project Performance'!B33=\"\",\"\",'6 - Unmit. Project Performance'!B33)","v":6},{"$f":"IF('6 - Unmit. Project Performance'!C33=\"\",\"\",'6 - Unmit. Project Performance'!C33)","v":40512.800000000003},{"$f":"IF('6 - Unmit. Project Performance'!D33=\"\",\"\",'6 - Unmit. Project Performance'!D33)","v":40695.200000000004},{"$f":"IF('6 - Unmit. Project Performance'!E33=\"\",\"\",'6 - Unmit. Project Performance'!E33)","v":40512.800000000003},{"$f":"IF('6 - Unmit. Project Performance'!F33=\"\",\"\",'6 - Unmit. Project Performance'!F33)","v":40695.200000000004},{"$f":"IF('6 - Unmit. Project Performance'!G33=\"\",\"\",'6 - Unmit. Project Performance'!G33)","v":0},{"$f":"IF('6 - Unmit. Project Performance'!H33=\"\",\"\",'6 - Unmit. Project Performance'!H33)","v":6.2890625},{"$f":"IF('6 - Unmit. Project Performance'!I33=\"\",\"\",'6 - Unmit. Project Performance'!I33)","v":40557.449999999997},{"$f":"IF('6 - Unmit. Project Performance'!J33=\"\",\"\",'6 - Unmit. Project Performance'!J33)","v":40774.049999999996},{"$f":"IF('6 - Unmit. Project Performance'!K33=\"\",\"\",'6 - Unmit. Project Performance'!K33)","v":40582.862499999996},{"$f":"IF('6 - Unmit. Project Performance'!L33=\"\",\"\",'6 - Unmit. Project Performance'!L33)","v":40774.049999999996},{"$f":"IF('6 - Unmit. Project Performance'!M33=\"\",\"\",'6 - Unmit. Project Performance'!M33)","v":0},{"$f":"IF('6 - Unmit. Project Performance'!N33=\"\",\"\",'6 - Unmit. Project Performance'!N33)","v":1.0108744292416232},null,null,null,null,null,null,null,null,null,null,null,null,null,null,null,null,null,null,null,null,null,null,null,null,null,null,null,null,null,null,null,null,null,null,{"$f":"IF('11 - Mit. Project Performance'!A32=\"\",\"\",'11 - Mit. Project Performance'!A32)","v":"ROW/Util/RR"},{"$f":"IF('11 - Mit. Project Performance'!B32=\"\",\"\",'11 - Mit. Project Performance'!B32)","v":13.125},{"$f":"IF('11 - Mit. Project Performance'!C32=\"\",\"\",'11 - Mit. Project Performance'!C32)","v":40557.449999999997},{"$f":"IF('11 - Mit. Project Performance'!D32=\"\",\"\",'11 - Mit. Project Performance'!D32)","v":40956.449999999997},{"$f":"IF('11 - Mit. Project Performance'!E32=\"\",\"\",'11 - Mit. Project Performance'!E32)","v":40557.449999999997},{"$f":"IF('11 - Mit. Project Performance'!F32=\"\",\"\",'11 - Mit. Project Performance'!F32)","v":40956.449999999997},{"$f":"IF('11 - Mit. Project Performance'!G32=\"\",\"\",'11 - Mit. Project Performance'!G32)","v":0},{"$f":"IF('11 - Mit. Project Performance'!H32=\"\",\"\",'11 - Mit. Project Performance'!H32)","v":12.703125},{"$f":"IF('11 - Mit. Project Performance'!I32=\"\",\"\",'11 - Mit. Project Performance'!I32)","v":40557.449999999997},{"$f":"IF('11 - Mit. Project Performance'!J32=\"\",\"\",'11 - Mit. Project Performance'!J32)","v":40943.625},{"$f":"IF('11 - Mit. Project Performance'!K32=\"\",\"\",'11 - Mit. Project Performance'!K32)","v":40557.449999999997},{"$f":"IF('11 - Mit. Project Performance'!L32=\"\",\"\",'11 - Mit. Project Performance'!L32)","v":40943.625},{"$f":"IF('11 - Mit. Project Performance'!M32=\"\",\"\",'11 - Mit. Project Performance'!M32)","v":0},{"$f":"IF('11 - Mit. Project Performance'!N34=\"\",\"\",'11 - Mit. Project Performance'!N34)","v":1.0108744292416232}]
[null,null,null,null,null,null,null,null,null,null,null,null,null,null,null,null,null,null,"Total Escalated Cost",{"$f":"IF('1 - Project Structuring'!D110=\"\",\"\",ROUND('1 - Project Structuring'!D110,1))","v":17},"($M)",null,null,null,null,null,{"$f":"IF('1 - Project Structuring'!C31=\"\",\"\",'1 - Project Structuring'!C31)","v":"Operations & Maintenance"},{"$f":"IF('1 - Project Structuring'!D31=\"\",\"\",'1 - Project Structuring'!D31)","v":600},{"$f":"IF('1 - Project Structuring'!E31=\"\",\"\",'1 - Project Structuring'!E31)","v":41212.000000000007},{"$f":"IF('1 - Project Structuring'!F31=\"\",\"\",'1 - Project Structuring'!F31)","v":59452.000000000007},{"$f":"IF('1 - Project Structuring'!G31=\"\",\"\",'1 - Project Structuring'!G31)","v":41212.000000000007},{"$f":"IF('1 - Project Structuring'!H31=\"\",\"\",'1 - Project Structuring'!H31)","v":59452.000000000007},{"$f":"IF('1 - Project Structuring'!I31=\"\",\"\",'1 - Project Structuring'!I31)","v":""},null,null,null,null,null,null,null,null,null,null,null,null,null,null,null,null,null,null,null,null,{"$f":"IF('6 - Unmit. Project Performance'!A34=\"\",\"\",'6 - Unmit. Project Performance'!A34)","v":"Final Design"},{"$f":"IF('6 - Unmit. Project Performance'!B34=\"\",\"\",'6 - Unmit. Project Performance'!B34)","v":6},{"$f":"IF('6 - Unmit. Project Performance'!C34=\"\",\"\",'6 - Unmit. Project Performance'!C34)","v":40695.200000000004},{"$f":"IF('6 - Unmit. Project Performance'!D34=\"\",\"\",'6 - Unmit. Project Performance'!D34)","v":40877.600000000006},{"$f":"IF('6 - Unmit. Project Performance'!E34=\"\",\"\",'6 - Unmit. Project Performance'!E34)","v":40695.200000000004},{"$f":"IF('6 - Unmit. Project Performance'!F34=\"\",\"\",'6 - Unmit. Project Performance'!F34)","v":41029.600000000006},{"$f":"IF('6 - Unmit. Project Performance'!G34=\"\",\"\",'6 - Unmit. Project Performance'!G34)","v":5},{"$f":"IF('6 - Unmit. Project Performance'!H34=\"\",\"\",'6 - Unmit. Project Performance'!H34)","v":6.75},{"$f":"IF('6 - Unmit. Project Performance'!I34=\"\",\"\",'6 - Unmit. Project Performance'!I34)","v":40774.049999999996},{"$f":"IF('6 - Unmit. Project Performance'!J34=\"\",\"\",'6 - Unmit. Project Performance'!J34)","v":40979.249999999993},{"$f":"IF('6 - Unmit. Project Performance'!K34=\"\",\"\",'6 - Unmit. Project Performance'!K34)","v":40774.049999999996},{"$f":"IF('6 - Unmit. Project Performance'!L34=\"\",\"\",'6 - Unmit. Project Performance'!L34)","v":41134.432499999995},{"$f":"IF('6 - Unmit. Project Performance'!M34=\"\",\"\",'6 - Unmit. Project Performance'!M34)","v":5.104687500000086},{"$f":"IF('6 - Unmit. Project Performance'!N34=\"\",\"\",'6 - Unmit. Project Performance'!N34)","v":0},null,null,null,null,null,null,null,null,null,null,null,null,null,null,null,null,null,null,null,null,null,null,null,null,null,null,null,null,null,null,null,null,null,null,{"$f":"IF('11 - Mit. Project Performance'!A33=\"\",\"\",'11 - Mit. Project Performance'!A33)","v":"Construction Funding Date"},{"$f":"IF('11 - Mit. Project Performance'!B33=\"\",\"\",'11 - Mit. Project Performance'!B33)","v":40148},{"$f":"IF('11 - Mit. Project Performance'!C33=\"\",\"\",'11 - Mit. Project Performance'!C33)","v":""},{"$f":"IF('11 - Mit. Project Performance'!D33=\"\",\"\",'11 - Mit. Project Performance'!D33)","v":40148},{"$f":"IF('11 - Mit. Project Performance'!E33=\"\",\"\",'11 - Mit. Project Performance'!E33)","v":""},{"$f":"IF('11 - Mit. Project Performance'!F33=\"\",\"\",'11 - Mit. Project Performance'!F33)","v":40582.862499999996},{"$f":"IF('11 - Mit. Project Performance'!G33=\"\",\"\",'11 - Mit. Project Performance'!G33)","v":14.304687499999858},{"$f":"IF('11 - Mit. Project Performance'!H33=\"\",\"\",'11 - Mit. Project Performance'!H33)","v":40148},{"$f":"IF('11 - Mit. Project Performance'!I33=\"\",\"\",'11 - Mit. Project Performance'!I33)","v":""},{"$f":"IF('11 - Mit. Project Performance'!J33=\"\",\"\",'11 - Mit. Project Performance'!J33)","v":40148},{"$f":"IF('11 - Mit. Project Performance'!K33=\"\",\"\",'11 - Mit. Project Performance'!K33)","v":""},{"$f":"IF('11 - Mit. Project Performance'!L33=\"\",\"\",'11 - Mit. Project Performance'!L33)","v":40570.037499999999},{"$f":"IF('11 - Mit. Project Performance'!M33=\"\",\"\",'11 - Mit. Project Performance'!M33)","v":13.882812499999952},{"$f":"IF('11 - Mit. Project Performance'!N35=\"\",\"\",'11 - Mit. Project Performance'!N35)","v":0}]
[null,null,null,null,null,null,null,null,null,null,null,null,null,null,null,null,null,null,"Base Construction Completion Date",{"$f":"IF('1 - Project Structuring'!D111=\"\",\"\",'1 - Project Structuring'!D111)","v":41212.000000000007},null,null,null,null,null,null,{"$f":"IF('1 - Project Structuring'!C32=\"\",\"\",'1 - Project Structuring'!C32)","v":"Replacement"},{"$f":"IF('1 - Project Structuring'!D32=\"\",\"\",'1 - Project Structuring'!D32)","v":0},{"$f":"IF('1 - Project Structuring'!E32=\"\",\"\",'1 - Project Structuring'!E32)","v":59452.000000000007},{"$f":"IF('1 - Project Structuring'!F32=\"\",\"\",'1 - Project Structuring'!F32)","v":59452.000000000007},{"$f":"IF('1 - Project Structuring'!G32=\"\",\"\",'1 - Project Structuring'!G32)","v":59452.000000000007},{"$f":"IF('1 - Project Structuring'!H32=\"\",\"\",'1 - Project Structuring'!H32)","v":59452.000000000007},{"$f":"IF('1 - Project Structuring'!I32=\"\",\"\",'1 - Project Structuring'!I32)","v":""},null,null,null,null,null,null,null,null,null,null,null,null,null,null,null,null,null,null,null,null,{"$f":"IF('6 - Unmit. Project Performance'!A35=\"\",\"\",'6 - Unmit. Project Performance'!A35)","v":"Construction"},{"$f":"IF('6 - Unmit. Project Performance'!B35=\"\",\"\",'6 - Unmit. Project Performance'!B35)","v":16},{"$f":"IF('6 - Unmit. Project Performance'!C35=\"\",\"\",'6 - Unmit. Project Performance'!C35)","v":40725.600000000006},{"$f":"IF('6 - Unmit. Project Performance'!D35=\"\",\"\",'6 - Unmit. Project Performance'!D35)","v":41212.000000000007},{"$f":"IF('6 - Unmit. Project Performance'!E35=\"\",\"\",'6 - Unmit. Project Performance'!E35)","v":40725.600000000006},{"$f":"IF('6 - Unmit. Project Performance'!F35=\"\",\"\",'6 - Unmit. Project Performance'!F35)","v":41212.000000000007},{"$f":"IF('6 - Unmit. Project Performance'!G35=\"\",\"\",'6 - Unmit. Project Performance'!G35)","v":0},{"$f":"IF('6 - Unmit. Project Performance'!H35=\"\",\"\",'6 - Unmit. Project Performance'!H35)","v":16.854687500000001},{"$f":"IF('6 - Unmit. Project Performance'!I35=\"\",\"\",'6 - Unmit. Project Performance'!I35)","v":40804.449999999997},{"$f":"IF('6 - Unmit. Project Performance'!J35=\"\",\"\",'6 - Unmit. Project Performance'!J35)","v":41316.832499999997},{"$f":"IF('6 - Unmit. Project Performance'!K35=\"\",\"\",'6 - Unmit. Project Performance'!K35)","v":40804.449999999997},{"$f":"IF('6 - Unmit. Project Performance'!L35=\"\",\"\",'6 - Unmit. Project Performance'!L35)","v":41316.832499999997},{"$f":"IF('6 - Unmit. Project Performance'!M35=\"\",\"\",'6 - Unmit. Project Performance'!M35)","v":0},{"$f":"IF('6 - Unmit. Project Performance'!N35=\"\",\"\",'6 - Unmit. Project Performance'!N35)","v":0.90954715361276117},null,null,null,null,null,null,null,null,null,null,null,null,null,null,null,null,null,null,null,null,null,null,null,null,null,null,null,null,null,null,null,null,null,null,{"$f":"IF('11 - Mit. Project Performance'!A34=\"\",\"\",'11 - Mit. Project Performance'!A34)","v":"Procurement"},{"$f":"IF('11 - Mit. Project Performance'!B34=\"\",\"\",'11 - Mit. Project Performance'!B34)","v":6.2890625},{"$f":"IF('11 - Mit. Project Performance'!C34=\"\",\"\",'11 - Mit. Project Performance'!C34)","v":40557.449999999997},{"$f":"IF('11 - Mit. Project Performance'!D34=\"\",\"\",'11 - Mit. Project Performance'!D34)","v":40774.049999999996},{"$f":"IF('11 - Mit. Project Performance'!E34=\"\",\"\",'11 - Mit. Project Performance'!E34)","v":40582.862499999996},{"$f":"IF('11 - Mit. Project Performance'!F34=\"\",\"\",'11 - Mit. Project Performance'!F34)","v":40774.049999999996},{"$f":"IF('11 - Mit. Project Performance'!G34=\"\",\"\",'11 - Mit. Project Performance'!G34)","v":0},{"$f":"IF('11 - Mit. Project Performance'!H34=\"\",\"\",'11 - Mit. Project Performance'!H34)","v":6.2890625},{"$f":"IF('11 - Mit. Project Performance'!I34=\"\",\"\",'11 - Mit. Project Performance'!I34)","v":40557.449999999997},{"$f":"IF('11 - Mit. Project Performance'!J34=\"\",\"\",'11 - Mit. Project Performance'!J34)","v":40761.224999999999},{"$f":"IF('11 - Mit. Project Performance'!K34=\"\",\"\",'11 - Mit. Project Performance'!K34)","v":40570.037499999999},{"$f":"IF('11 - Mit. Project Performance'!L34=\"\",\"\",'11 - Mit. Project Performance'!L34)","v":40761.224999999999},{"$f":"IF('11 - Mit. Project Performance'!M34=\"\",\"\",'11 - Mit. Project Performance'!M34)","v":0},{"$f":"IF('11 - Mit. Project Performance'!N36=\"\",\"\",'11 - Mit. Project Performance'!N36)","v":0.2014382348855901}]
[null,null,null,null,null,null,null,null,null,null,null,null,null,null,null,null,null,null,"Months to Construction Completion",{"$f":"IF('1 - Project Structuring'!D112=\"\",\"\",'1 - Project Structuring'!D112)","v":35.000000000000242},null,null,null,null,null,null,null,null,null,null,null,null,null,null,null,null,null,null,null,null,null,null,null,null,null,null,null,null,null,null,null,null,null,{"$f":"IF('6 - Unmit. Project Performance'!A36=\"\",\"\",'6 - Unmit. Project Performance'!A36)","v":"Operations & Maintenance"},{"$f":"IF('6 - Unmit. Project Performance'!B36=\"\",\"\",'6 - Unmit. Project Performance'!B36)","v":600},{"$f":"IF('6 - Unmit. Project Performance'!C36=\"\",\"\",'6 - Unmit. Project Performance'!C36)","v":41212.000000000007},{"$f":"IF('6 - Unmit. Project Performance'!D36=\"\",\"\",'6 - Unmit. Project Performance'!D36)","v":59452.000000000007},null,null,null,{"$f":"IF('6 - Unmit. Project Performance'!H36=\"\",\"\",'6 - Unmit. Project Performance'!H36)","v":600},null,null,null,null,null,{"$f":"IF('6 - Unmit. Project Performance'!N36=\"\",\"\",'6 - Unmit. Project Performance'!N36)","v":""},null,null,null,null,null,null,null,null,null,null,null,null,null,null,null,null,null,null,null,null,null,null,null,null,null,null,null,null,null,null,null,null,null,null,{"$f":"IF('11 - Mit. Project Performance'!A35=\"\",\"\",'11 - Mit. Project Performance'!A35)","v":"Final Design"},{"$f":"IF('11 - Mit. Project Performance'!B35=\"\",\"\",'11 - Mit. Project Performance'!B35)","v":6.75},{"$f":"IF('11 - Mit. Project Performance'!C35=\"\",\"\",'11 - Mit. Project Performance'!C35)","v":40774.049999999996},{"$f":"IF('11 - Mit. Project Performance'!D35=\"\",\"\",'11 - Mit. Project Performance'!D35)","v":40979.249999999993},{"$f":"IF('11 - Mit. Project Performance'!E35=\"\",\"\",'11 - Mit. Project Performance'!E35)","v":40774.049999999996},{"$f":"IF('11 - Mit. Project Performance'!F35=\"\",\"\",'11 - Mit. Project Performance'!F35)","v":41134.432499999995},{"$f":"IF('11 - Mit. Project Performance'!G35=\"\",\"\",'11 - Mit. Project Performance'!G35)","v":5.104687500000086},{"$f":"IF('11 - Mit. Project Performance'!H35=\"\",\"\",'11 - Mit. Project Performance'!H35)","v":6.75},{"$f":"IF('11 - Mit. Project Performance'!I35=\"\",\"\",'11 - Mit. Project Performance'!I35)","v":40761.224999999999},{"$f":"IF('11 - Mit. Project Performance'!J35=\"\",\"\",'11 - Mit. Project Performance'!J35)","v":40966.424999999996},{"$f":"IF('11 - Mit. Project Performance'!K35=\"\",\"\",'11 - Mit. Project Performance'!K35)","v":40761.224999999999},{"$f":"IF('11 - Mit. Project Performance'!L35=\"\",\"\",'11 - Mit. Project Performance'!L35)","v":41107.072500000002},{"$f":"IF('11 - Mit. Project Performance'!M35=\"\",\"\",'11 - Mit. Project Performance'!M35)","v":4.6265625000002109},{"$f":"IF('11 - Mit. Project Performance'!N37=\"\",\"\",'11 - Mit. Project Performance'!N37)","v":""}]
[null,null,null,null,null,null,null,null,null,null,null,null,null,null,null,null,null,null,"Dusruption Cost",{"$f":"IF('1 - Project Structuring'!D113=\"\",\"\",ROUND('1 - Project Structuring'!D113,1))","v":18.7},"($M)",null,null,null,null,null,null,null,null,null,null,null,null,null,null,null,null,null,null,null,null,null,null,null,null,null,null,null,null,null,null,null,null,{"$f":"IF('6 - Unmit. Project Performance'!A37=\"\",\"\",'6 - Unmit. Project Performance'!A37)","v":"Replacement"},{"$f":"IF('6 - Unmit. Project Performance'!B37=\"\",\"\",'6 - Unmit. Project Performance'!B37)","v":0},{"$f":"IF('6 - Unmit. Project Performance'!C37=\"\",\"\",'6 - Unmit. Project Performance'!C37)","v":59452.000000000007},null,null,null,null,{"$f":"IF('6 - Unmit. Project Performance'!H37=\"\",\"\",'6 - Unmit. Project Performance'!H37)","v":0},null,null,null,null,null,{"$f":"IF('6 - Unmit. Project Performance'!N37=\"\",\"\",'6 - Unmit. Project Performance'!N37)","v":""},null,null,null,null,null,null,null,null,null,null,null,null,null,null,null,null,null,null,null,null,null,null,null,null,null,null,null,null,null,null,null,null,null,null,{"$f":"IF('11 - Mit. Project Performance'!A36=\"\",\"\",'11 - Mit. Project Performance'!A36)","v":"Construction"},{"$f":"IF('11 - Mit. Project Performance'!B36=\"\",\"\",'11 - Mit. Project Performance'!B36)","v":16.854687500000001},{"$f":"IF('11 - Mit. Project Performance'!C36=\"\",\"\",'11 - Mit. Project Performance'!C36)","v":40804.449999999997},{"$f":"IF('11 - Mit. Project Performance'!D36=\"\",\"\",'11 - Mit. Project Performance'!D36)","v":41316.832499999997},{"$f":"IF('11 - Mit. Project Performance'!E36=\"\",\"\",'11 - Mit. Project Performance'!E36)","v":40804.449999999997},{"$f":"IF('11 - Mit. Project Performance'!F36=\"\",\"\",'11 - Mit. Project Performance'!F36)","v":41316.832499999997},{"$f":"IF('11 - Mit. Project Performance'!G36=\"\",\"\",'11 - Mit. Project Performance'!G36)","v":0},{"$f":"IF('11 - Mit. Project Performance'!H36=\"\",\"\",'11 - Mit. Project Performance'!H36)","v":16.376562499999999},{"$f":"IF('11 - Mit. Project Performance'!I36=\"\",\"\",'11 - Mit. Project Performance'!I36)","v":40791.625},{"$f":"IF('11 - Mit. Project Performance'!J36=\"\",\"\",'11 - Mit. Project Performance'!J36)","v":41289.472500000003},{"$f":"IF('11 - Mit. Project Performance'!K36=\"\",\"\",'11 - Mit. Project Performance'!K36)","v":40791.625},{"$f":"IF('11 - Mit. Project Performance'!L36=\"\",\"\",'11 - Mit. Project Performance'!L36)","v":41289.472500000003},{"$f":"IF('11 - Mit. Project Performance'!M36=\"\",\"\",'11 - Mit. Project Performance'!M36)","v":0},{"$f":"IF('11 - Mit. Project Performance'!N38=\"\",\"\",'11 - Mit. Project Performance'!N38)","v":""}]
[null,null,null,null,null,null,null,null,null,null,null,null,null,null,null,null,null,null,null,null,null,null,null,null,null,null,null,null,null,null,null,null,null,null,null,null,null,null,null,null,null,null,null,null,null,null,null,null,null,null,null,null,null,{"$f":"IF('6 - Unmit. Project Performance'!A38=\"\",\"\",'6 - Unmit. Project Performance'!A38)","v":"Project Start Date"},{"$f":"IF('6 - Unmit. Project Performance'!B38=\"\",\"\",'6 - Unmit. Project Performance'!B38)","v":40148},null,null,null,null,null,{"$f":"IF('6 - Unmit. Project Performance'!H38=\"\",\"\",'6 - Unmit. Project Performance'!H38)","v":40148},null,null,null,null,null,{"$f":"IF('6 - Unmit. Project Performance'!N38=\"\",\"\",'6 - Unmit. Project Performance'!N38)","v":6.7408251494120019},null,null,null,null,null,null,null,null,null,null,null,null,null,null,null,null,null,null,null,null,null,null,null,null,null,null,null,null,null,null,null,null,null,null,{"$f":"IF('11 - Mit. Project Performance'!A37=\"\",\"\",'11 - Mit. Project Performance'!A37)","v":"Operations & Maintenance"},{"$f":"IF('11 - Mit. Project Performance'!B37=\"\",\"\",'11 - Mit. Project Performance'!B37)","v":600},{"$f":"IF('11 - Mit. Project Performance'!C37=\"\",\"\",'11 - Mit. Project Performance'!C37)","v":41316.832499999997},{"$f":"IF('11 - Mit. Project Performance'!D37=\"\",\"\",'11 - Mit. Project Performance'!D37)","v":59556.832499999997},null,null,null,{"$f":"IF('11 - Mit. Project Performance'!H37=\"\",\"\",'11 - Mit. Project Performance'!H37)","v":600},null,null,null,null,null,{"$f":"IF('11 - Mit. Project Performance'!N39=\"\",\"\",'11 - Mit. Project Performance'!N39)","v":5.3243113381153186}]
[null,null,null,null,null,null,null,null,null,null,null,null,null,null,null,null,null,null,null,null,null,null,null,null,null,null,null,null,null,null,null,null,null,null,null,null,null,null,null,null,null,null,null,null,null,null,null,null,null,null,null,null,null,{"$f":"IF('6 - Unmit. Project Performance'!A39=\"\",\"\",'6 - Unmit. Project Performance'!A39)","v":"Construction Finish Date"},{"$f":"IF('6 - Unmit. Project Performance'!B39=\"\",\"\",'6 - Unmit. Project Performance'!B39)","v":41212.000000000007},null,null,null,null,null,{"$f":"IF('6 - Unmit. Project Performance'!H39=\"\",\"\",'6 - Unmit. Project Performance'!H39)","v":41316.832499999997},null,null,null,null,null,{"$f":"IF('6 - Unmit. Project Performance'!N39=\"\",\"\",'6 - Unmit. Project Performance'!N39)","v":""},null,null,null,null,null,null,null,null,null,null,null,null,null,null,null,null,null,null,null,null,null,null,null,null,null,null,null,null,null,null,null,null,null,null,{"$f":"IF('11 - Mit. Project Performance'!A38=\"\",\"\",'11 - Mit. Project Performance'!A38)","v":"Replacement"},{"$f":"IF('11 - Mit. Project Performance'!B38=\"\",\"\",'11 - Mit. Project Performance'!B38)","v":0},{"$f":"IF('11 - Mit. Project Performance'!C38=\"\",\"\",'11 - Mit. Project Performance'!C38)","v":59556.832499999997},null,null,null,null,{"$f":"IF('11 - Mit. Project Performance'!H38=\"\",\"\",'11 - Mit. Project Performance'!H38)","v":0},null,null,null,null,null,{"$f":"IF('11 - Mit. Project Performance'!N40=\"\",\"\",'11 - Mit. Project Performance'!N40)","v":""}]
[null,null,null,null,null,null,null,null,null,null,null,null,null,null,null,null,null,null,null,null,null,null,null,null,null,null,null,null,null,null,null,null,null,null,null,null,null,null,null,null,null,null,null,null,null,null,null,null,null,null,null,null,null,{"$f":"IF('6 - Unmit. Project Performance'!A40=\"\",\"\",'6 - Unmit. Project Performance'!A40)","v":"Project Duration (months)"},{"$f":"IF('6 - Unmit. Project Performance'!B40=\"\",\"\",'6 - Unmit. Project Performance'!B40)","v":35.000000000000242},null,null,null,null,null,{"$f":"IF('6 - Unmit. Project Performance'!H40=\"\",\"\",'6 - Unmit. Project Performance'!H40)","v":38.448437499999898},null,null,null,null,null,{"$f":"IF('6 - Unmit. Project Performance'!N40=\"\",\"\",'6 - Unmit. Project Performance'!N40)","v":""},null,null,null,null,null,null,null,null,null,null,null,null,null,null,null,null,null,null,null,null,null,null,null,null,null,null,null,null,null,null,null,null,null,null,{"$f":"IF('11 - Mit. Project Performance'!A39=\"\",\"\",'11 - Mit. Project Performance'!A39)","v":"Project Start Date"},{"$f":"IF('11 - Mit. Project Performance'!B39=\"\",\"\",'11 - Mit. Project Performance'!B39)","v":40148},null,null,null,null,null,{"$f":"IF('11 - Mit. Project Performance'!H39=\"\",\"\",'11 - Mit. Project Performance'!H39)","v":40148},null,null,null,null,null,{"$f":"IF('11 - Mit. Project Performance'!N41=\"\",\"\",'11 - Mit. Project Performance'!N41)","v":""}]
[null,null,null,null,null,null,null,null,null,null,null,null,null,null,null,null,null,null,null,null,null,null,null,null,null,null,null,null,null,null,null,null,null,null,null,null,null,null,null,null,null,null,null,null,null,null,null,null,null,null,null,null,null,null,null,null,null,null,null,null,null,null,null,null,null,null,null,null,null,null,null,null,null,null,null,null,null,null,null,null,null,null,null,null,null,null,null,null,null,null,null,null,null,null,null,null,null,null,null,null,null,{"$f":"IF('11 - Mit. Project Performance'!A40=\"\",\"\",'11 - Mit. Project Performance'!A40)","v":"Construction Finish Date"},{"$f":"IF('11 - Mit. Project Performance'!B40=\"\",\"\",'11 - Mit. Project Performance'!B40)","v":41316.832499999997},null,null,null,null,null,{"$f":"IF('11 - Mit. Project Performance'!H40=\"\",\"\",'11 - Mit. Project Performance'!H40)","v":41289.472500000003},null,null,null,null,null,{"$f":"IF('11 - Mit. Project Performance'!N42=\"\",\"\",'11 - Mit. Project Performance'!N42)","v":""}]
[null,null,null,null,null,null,null,null,null,null,null,null,null,null,null,null,null,null,null,null,null,null,null,null,null,null,null,"Base","Disruption",null,null,null,null,null,null,null,null,null,null,null,null,null,null,null,null,"UNMITIGATED RISK REGISTER",null,null,null,null,null,null,null,null,null,null,null,null,null,null,null,null,null,null,null,null,null,null,null,null,null,null,null,null,null,null,null,null,null,null,null,null,null,null,null,null,null,null,null,null,null,null,null,null,null,null,null,null,null,null,null,{"$f":"IF('11 - Mit. Project Performance'!A41=\"\",\"\",'11 - Mit. Project Performance'!A41)","v":"Project Duration (months)"},{"$f":"IF('11 - Mit. Project Performance'!B41=\"\",\"\",'11 - Mit. Project Performance'!B41)","v":38.448437499999898},null,null,null,null,null,{"$f":"IF('11 - Mit. Project Performance'!H41=\"\",\"\",'11 - Mit. Project Performance'!H41)","v":37.548437500000119},null,null,null,null,null,{"$f":"IF('11 - Mit. Project Performance'!N43=\"\",\"\",'11 - Mit. Project Performance'!N43)","v":""}]
[null,null,null,null,null,null,null,null,null,null,null,null,null,null,null,null,null,null,null,null,null,null,null,null,null,null,{"$f":"'1 - Project Structuring'!C83","v":"Project Phase"},{"$f":"'1 - Project Structuring'!D83","v":" "},{"$f":"'1 - Project Structuring'!E83","v":"Disruption"},null,null,null,null,null,null,null,null,null,null,null,null,null,null,null,null,"Risk \nLabel","Risk Description",null,null,"Risk Type","Mean Severity \n\n (YOE $M)","Percent of Total Severity ","Mean Severity Ranking"]
[null,null,null,null,null,null,null,null,null,null,null,null,null,null,null,null,null,null,null,null,null,null,null,null,null,null,null,{"$f":"'1 - Project Structuring'!D84","v":"M Veh-Hours/Day"},{"$f":"'1 - Project Structuring'!E84","v":"No. of Days"},{"$f":"'1 - Project Structuring'!F84","v":"M-Hrs"},{"$f":"'1 - Project Structuring'!G84","v":"Cost ($M)"}]
[null,null,null,null,null,null,null,null,null,null,null,null,null,null,null,null,null,null,null,null,null,null,null,null,null,null,{"$f":"'1 - Project Structuring'!C85","v":"Planning"},{"$f":"IF('1 - Project Structuring'!D85=\"\",\"\",'1 - Project Structuring'!D85)","v":""},{"$f":"IF('1 - Project Structuring'!E85=\"\",\"\",'1 - Project Structuring'!E85)","v":""},{"$f":"IF('1 - Project Structuring'!F85=\"\",\"\",'1 - Project Structuring'!F85)","v":0},{"$f":"IF('1 - Project Structuring'!G85=\"\",\"\",'1 - Project Structuring'!G85)","v":0}]
[null,null,null,null,null,null,null,null,null,null,null,null,null,null,null,null,null,null,null,null,null,null,null,null,null,null,{"$f":"'1 - Project Structuring'!C86","v":"Scoping"},{"$f":"IF('1 - Project Structuring'!D86=\"\",\"\",'1 - Project Structuring'!D86)","v":""},{"$f":"IF('1 - Project Structuring'!E86=\"\",\"\",'1 - Project Structuring'!E86)","v":""},{"$f":"IF('1 - Project Structuring'!F86=\"\",\"\",'1 - Project Structuring'!F86)","v":0},{"$f":"IF('1 - Project Structuring'!G86=\"\",\"\",'1 - Project Structuring'!G86)","v":0}]
[null,null,null,null,null,null,null,null,null,null,null,null,null,null,null,null,null,null,null,null,null,null,null,null,null,null,{"$f":"'1 - Project Structuring'!C87","v":"Prelim Design/Environmental Process"},{"$f":"IF('1 - Project Structuring'!D87=\"\",\"\",'1 - Project Structuring'!D87)","v":""},{"$f":"IF('1 - Project Structuring'!E87=\"\",\"\",'1 - Project Structuring'!E87)","v":""},{"$f":"IF('1 - Project Structuring'!F87=\"\",\"\",'1 - Project Structuring'!F87)","v":0},{"$f":"IF('1 - Project Structuring'!G87=\"\",\"\",'1 - Project Structuring'!G87)","v":0},null,null,null,null,null,null,null,null,null,null,null,null,null,null,{"$f":"IF('5 - Unmit. Risk Register'!A5=\"\",\"\",'5 - Unmit. Risk Register'!A5)","v":"SC-6"},{"$f":"IF('5 - Unmit. Risk Register'!B5=\"\",\"\",'5 - Unmit. Risk Register'!B5)","v":"Provide new lighting throughout project."},null,null,{"$f":"IF('5 - Unmit. Risk Register'!C5=\"\",\"\",'5 - Unmit. Risk Register'!C5)","v":"Threat"},{"$f":"IF('5 - Unmit. Risk Register'!H5=\"\",\"\",'5 - Unmit. Risk Register'!H5)","v":0.61716339357451888},{"$f":"IF('5 - Unmit. Risk Register'!I5=\"\",\"\",'5 - Unmit. Risk Register'!I5)","v":8.2144690317082616E-2},{"$f":"IF('5 - Unmit. Risk Register'!J5=\"\",\"\",'5 - Unmit. Risk Register'!J5)","v":1}]
[null,null,null,null,null,null,null,null,null,null,null,null,null,null,null,null,null,null,null,null,null,null,null,null,null,null,{"$f":"'1 - Project Structuring'!C88","v":"Environmental Permits"},{"$f":"IF('1 - Project Structuring'!D88=\"\",\"\",'1 - Project Structuring'!D88)","v":""},{"$f":"IF('1 - Project Structuring'!E88=\"\",\"\",'1 - Project Structuring'!E88)","v":""},{"$f":"IF('1 - Project Structuring'!F88=\"\",\"\",'1 - Project Structuring'!F88)","v":0},{"$f":"IF('1 - Project Structuring'!G88=\"\",\"\",'1 - Project Structuring'!G88)","v":0},null,null,null,null,null,null,null,null,null,null,null,null,null,null,{"$f":"IF('5 - Unmit. Risk Register'!A6=\"\",\"\",'5 - Unmit. Risk Register'!A6)","v":"PR-1"},{"$f":"IF('5 - Unmit. Risk Register'!B6=\"\",\"\",'5 - Unmit. Risk Register'!B6)","v":"Uncertainty in construction-cost inflation rate"},null,null,{"$f":"IF('5 - Unmit. Risk Register'!C6=\"\",\"\",'5 - Unmit. Risk Register'!C6)","v":"Threat"},{"$f":"IF('5 - Unmit. Risk Register'!H6=\"\",\"\",'5 - Unmit. Risk Register'!H6)","v":0.61716339357451888},{"$f":"IF('5 - Unmit. Risk Register'!I6=\"\",\"\",'5 - Unmit. Risk Register'!I6)","v":8.2144690317082616E-2},{"$f":"IF('5 - Unmit. Risk Register'!J6=\"\",\"\",'5 - Unmit. Risk Register'!J6)","v":2}]
[null,null,null,null,null,null,null,null,null,null,null,null,null,null,null,null,null,null,null,null,null,null,null,null,null,null,{"$f":"'1 - Project Structuring'!C89","v":"ROW/Util/RR"},{"$f":"IF('1 - Project Structuring'!D89=\"\",\"\",'1 - Project Structuring'!D89)","v":0.02},{"$f":"IF('1 - Project Structuring'!E89=\"\",\"\",'1 - Project Structuring'!E89)","v":10},{"$f":"IF('1 - Project Structuring'!F89=\"\",\"\",'1 - Project Structuring'!F89)","v":0.2},{"$f":"IF('1 - Project Structuring'!G89=\"\",\"\",'1 - Project Structuring'!G89)","v":2},null,null,null,null,null,null,null,null,null,null,null,null,null,null,{"$f":"IF('5 - Unmit. Risk Register'!A7=\"\",\"\",'5 - Unmit. Risk Register'!A7)","v":"RR-1"},{"$f":"IF('5 - Unmit. Risk Register'!B7=\"\",\"\",'5 - Unmit. Risk Register'!B7)","v":"Uncertainty in ROW inflation rate"},null,null,{"$f":"IF('5 - Unmit. Risk Register'!C7=\"\",\"\",'5 - Unmit. Risk Register'!C7)","v":"Threat"},{"$f":"IF('5 - Unmit. Risk Register'!H7=\"\",\"\",'5 - Unmit. Risk Register'!H7)","v":0.60364846664440241},{"$f":"IF('5 - Unmit. Risk Register'!I7=\"\",\"\",'5 - Unmit. Risk Register'!I7)","v":8.0345848229410474E-2},{"$f":"IF('5 - Unmit. Risk Register'!J7=\"\",\"\",'5 - Unmit. Risk Register'!J7)","v":3}]
[null,null,null,null,null,null,null,null,null,null,null,null,null,null,null,null,null,null,null,null,null,null,null,null,null,null,{"$f":"'1 - Project Structuring'!C90","v":"Procurement"},{"$f":"IF('1 - Project Structuring'!D90=\"\",\"\",'1 - Project Structuring'!D90)","v":""},{"$f":"IF('1 - Project Structuring'!E90=\"\",\"\",'1 - Project Structuring'!E90)","v":""},{"$f":"IF('1 - Project Structuring'!F90=\"\",\"\",'1 - Project Structuring'!F90)","v":0},{"$f":"IF('1 - Project Structuring'!G90=\"\",\"\",'1 - Project Structuring'!G90)","v":0},null,null,null,null,null,null,null,null,null,null,null,null,null,null,{"$f":"IF('5 - Unmit. Risk Register'!A8=\"\",\"\",'5 - Unmit. Risk Register'!A8)","v":"RR-3"},null,null,null,{"$f":"IF('5 - Unmit. Risk Register'!C8=\"\",\"\",'5 - Unmit. Risk Register'!C8)","v":"Threat"},{"$f":"IF('5 - Unmit. Risk Register'!H8=\"\",\"\",'5 - Unmit. Risk Register'!H8)","v":0.60364846664440241},{"$f":"IF('5 - Unmit. Risk Register'!I8=\"\",\"\",'5 - Unmit. Risk Register'!I8)","v":8.0345848229410474E-2},{"$f":"IF('5 - Unmit. Risk Register'!J8=\"\",\"\",'5 - Unmit. Risk Register'!J8)","v":4}]
[null,null,null,null,null,null,null,null,null,null,null,null,null,null,null,null,null,null,null,null,null,null,null,null,null,null,{"$f":"'1 - Project Structuring'!C91","v":"Final Design"},{"$f":"IF('1 - Project Structuring'!D91=\"\",\"\",'1 - Project Structuring'!D91)","v":""},{"$f":"IF('1 - Project Structuring'!E91=\"\",\"\",'1 - Project Structuring'!E91)","v":""},{"$f":"IF('1 - Project Structuring'!F91=\"\",\"\",'1 - Project Structuring'!F91)","v":0},{"$f":"IF('1 - Project Structuring'!G91=\"\",\"\",'1 - Project Structuring'!G91)","v":0},null,null,null,null,null,null,null,null,null,null,null,null,null,null,{"$f":"IF('5 - Unmit. Risk Register'!A9=\"\",\"\",'5 - Unmit. Risk Register'!A9)","v":"RR-8"},{"$f":"IF('5 - Unmit. Risk Register'!B9=\"\",\"\",'5 - Unmit. Risk Register'!B9)","v":"QDOT helps City pay for water and sewer-line relocation"},null,null,{"$f":"IF('5 - Unmit. Risk Register'!C9=\"\",\"\",'5 - Unmit. Risk Register'!C9)","v":"Threat"},{"$f":"IF('5 - Unmit. Risk Register'!H9=\"\",\"\",'5 - Unmit. Risk Register'!H9)","v":0.60364846664440241},{"$f":"IF('5 - Unmit. Risk Register'!I9=\"\",\"\",'5 - Unmit. Risk Register'!I9)","v":8.0345848229410474E-2},{"$f":"IF('5 - Unmit. Risk Register'!J9=\"\",\"\",'5 - Unmit. Risk Register'!J9)","v":5}]
[null,null,null,null,null,null,null,null,null,null,null,null,null,null,null,null,null,null,null,null,null,null,null,null,null,null,{"$f":"'1 - Project Structuring'!C92","v":"Construction"},{"$f":"IF('1 - Project Structuring'!D92=\"\",\"\",'1 - Project Structuring'!D92)","v":0.05},{"$f":"IF('1 - Project Structuring'!E92=\"\",\"\",'1 - Project Structuring'!E92)","v":10},{"$f":"IF('1 - Project Structuring'!F92=\"\",\"\",'1 - Project Structuring'!F92)","v":0.5},{"$f":"IF('1 - Project Structuring'!G92=\"\",\"\",'1 - Project Structuring'!G92)","v":5},null,null,null,null,null,null,null,null,null,null,null,null,null,null,{"$f":"IF('5 - Unmit. Risk Register'!A10=\"\",\"\",'5 - Unmit. Risk Register'!A10)","v":"RR-2"},{"$f":"IF('5 - Unmit. Risk Register'!B10=\"\",\"\",'5 - Unmit. Risk Register'!B10)","v":"Accelerating pace of development in interchange area"},null,null,{"$f":"IF('5 - Unmit. Risk Register'!C10=\"\",\"\",'5 - Unmit. Risk Register'!C10)","v":"Threat"},{"$f":"IF('5 - Unmit. Risk Register'!H10=\"\",\"\",'5 - Unmit. Risk Register'!H10)","v":0.51205073247056643},{"$f":"IF('5 - Unmit. Risk Register'!I10=\"\",\"\",'5 - Unmit. Risk Register'!I10)","v":6.8154153800036144E-2},{"$f":"IF('5 - Unmit. Risk Register'!J10=\"\",\"\",'5 - Unmit. Risk Register'!J10)","v":6}]
[null,null,null,null,null,null,null,null,null,null,null,null,null,null,null,null,null,null,null,null,null,null,null,null,null,null,{"$f":"'1 - Project Structuring'!C93","v":"Operations & Maintenance"},{"$f":"IF('1 - Project Structuring'!D93=\"\",\"\",'1 - Project Structuring'!D93)","v":""},{"$f":"IF('1 - Project Structuring'!E93=\"\",\"\",'1 - Project Structuring'!E93)","v":""},{"$f":"IF('1 - Project Structuring'!F93=\"\",\"\",'1 - Project Structuring'!F93)","v":1.4},{"$f":"IF('1 - Project Structuring'!G93=\"\",\"\",'1 - Project Structuring'!G93)","v":14},null,null,null,null,null,null,null,null,null,null,null,null,null,null,{"$f":"IF('5 - Unmit. Risk Register'!A11=\"\",\"\",'5 - Unmit. Risk Register'!A11)","v":"CR-2"},{"$f":"IF('5 - Unmit. Risk Register'!B11=\"\",\"\",'5 - Unmit. Risk Register'!B11)","v":"Additional Maintenance of Traffic required"},null,null,{"$f":"IF('5 - Unmit. Risk Register'!C11=\"\",\"\",'5 - Unmit. Risk Register'!C11)","v":"Threat"},{"$f":"IF('5 - Unmit. Risk Register'!H11=\"\",\"\",'5 - Unmit. Risk Register'!H11)","v":0.50630970876113679},{"$f":"IF('5 - Unmit. Risk Register'!I11=\"\",\"\",'5 - Unmit. Risk Register'!I11)","v":6.7390021287278515E-2},{"$f":"IF('5 - Unmit. Risk Register'!J11=\"\",\"\",'5 - Unmit. Risk Register'!J11)","v":7}]
[null,null,null,null,null,null,null,null,null,null,null,null,null,null,null,null,null,null,null,null,null,null,null,null,null,null,{"$f":"'1 - Project Structuring'!C94","v":"Replacement"},{"$f":"IF('1 - Project Structuring'!D94=\"\",\"\",'1 - Project Structuring'!D94)","v":""},{"$f":"IF('1 - Project Structuring'!E94=\"\",\"\",'1 - Project Structuring'!E94)","v":""},{"$f":"IF('1 - Project Structuring'!F94=\"\",\"\",'1 - Project Structuring'!F94)","v":0.7},{"$f":"IF('1 - Project Structuring'!G94=\"\",\"\",'1 - Project Structuring'!G94)","v":7},null,null,null,null,null,null,null,null,null,null,null,null,null,null,{"$f":"IF('5 - Unmit. Risk Register'!A12=\"\",\"\",'5 - Unmit. Risk Register'!A12)","v":"CR-4"},{"$f":"IF('5 - Unmit. Risk Register'!B12=\"\",\"\",'5 - Unmit. Risk Register'!B12)","v":"Unable to construct interchange embankments as rapidly as assumed"},null,null,{"$f":"IF('5 - Unmit. Risk Register'!C12=\"\",\"\",'5 - Unmit. Risk Register'!C12)","v":"Threat"},{"$f":"IF('5 - Unmit. Risk Register'!H12=\"\",\"\",'5 - Unmit. Risk Register'!H12)","v":0.39150962528795719},{"$f":"IF('5 - Unmit. Risk Register'!I12=\"\",\"\",'5 - Unmit. Risk Register'!I12)","v":5.2110085044363728E-2},{"$f":"IF('5 - Unmit. Risk Register'!J12=\"\",\"\",'5 - Unmit. Risk Register'!J12)","v":8}]
[null,null,null,null,null,null,null,null,null,null,null,null,null,null,null,null,null,null,null,null,null,null,null,null,null,null,{"$f":"'1 - Project Structuring'!C95","v":"Total Disruption through OMR"},{"$f":"IF('1 - Project Structuring'!D95=\"\",\"\",'1 - Project Structuring'!D95)","v":""},{"$f":"IF('1 - Project Structuring'!E95=\"\",\"\",'1 - Project Structuring'!E95)","v":""},{"$f":"IF('1 - Project Structuring'!F95=\"\",\"\",'1 - Project Structuring'!F95)","v":2.8},{"$f":"IF('1 - Project Structuring'!G95=\"\",\"\",'1 - Project Structuring'!G95)","v":28},null,null,null,null,null,null,null,null,null,null,null,null,null,null,{"$f":"IF('5 - Unmit. Risk Register'!A13=\"\",\"\",'5 - Unmit. Risk Register'!A13)","v":"PD-13"},{"$f":"IF('5 - Unmit. Risk Register'!B13=\"\",\"\",'5 - Unmit. Risk Register'!B13)","v":"Change in environmental documentation."},null,null,{"$f":"IF('5 - Unmit. Risk Register'!C13=\"\",\"\",'5 - Unmit. Risk Register'!C13)","v":"Threat"},{"$f":"IF('5 - Unmit. Risk Register'!H13=\"\",\"\",'5 - Unmit. Risk Register'!H13)","v":0.37949026879033604},{"$f":"IF('5 - Unmit. Risk Register'!I13=\"\",\"\",'5 - Unmit. Risk Register'!I13)","v":5.0510303969226955E-2},{"$f":"IF('5 - Unmit. Risk Register'!J13=\"\",\"\",'5 - Unmit. Risk Register'!J13)","v":9}]
[null,null,null,null,null,null,null,null,null,null,null,null,null,null,null,null,null,null,null,null,null,null,null,null,null,null,null,null,null,null,null,null,null,null,null,null,null,null,null,null,null,null,null,null,null,{"$f":"IF('5 - Unmit. Risk Register'!A14=\"\",\"\",'5 - Unmit. Risk Register'!A14)","v":"PR-2"},{"$f":"IF('5 - Unmit. Risk Register'!B14=\"\",\"\",'5 - Unmit. Risk Register'!B14)","v":"Uncertain Design/Build contracting market conditions at time of bid"},null,null,{"$f":"IF('5 - Unmit. Risk Register'!C14=\"\",\"\",'5 - Unmit. Risk Register'!C14)","v":"Threat"},{"$f":"IF('5 - Unmit. Risk Register'!H14=\"\",\"\",'5 - Unmit. Risk Register'!H14)","v":0.37535351374470216},{"$f":"IF('5 - Unmit. Risk Register'!I14=\"\",\"\",'5 - Unmit. Risk Register'!I14)","v":4.9959700246324533E-2},{"$f":"IF('5 - Unmit. Risk Register'!J14=\"\",\"\",'5 - Unmit. Risk Register'!J14)","v":10}]
[null,null,null,null,null,null,null,null,null,null,null,null,null,null,null,null,null,null,null,null,null,null,null,null,null,null,null,null,null,null,null,null,null,null,null,null,null,null,null,null,null,null,null,null,null,{"$f":"IF('5 - Unmit. Risk Register'!A15=\"\",\"\",'5 - Unmit. Risk Register'!A15)","v":"PD-11"},{"$f":"IF('5 - Unmit. Risk Register'!B15=\"\",\"\",'5 - Unmit. Risk Register'!B15)","v":"Cannot use City sewer system for project runoff (or City charges for use)."},null,null,{"$f":"IF('5 - Unmit. Risk Register'!C15=\"\",\"\",'5 - Unmit. Risk Register'!C15)","v":"Threat"},{"$f":"IF('5 - Unmit. Risk Register'!H15=\"\",\"\",'5 - Unmit. Risk Register'!H15)","v":0.37492763121006484},{"$f":"IF('5 - Unmit. Risk Register'!I15=\"\",\"\",'5 - Unmit. Risk Register'!I15)","v":4.9903015113532359E-2},{"$f":"IF('5 - Unmit. Risk Register'!J15=\"\",\"\",'5 - Unmit. Risk Register'!J15)","v":11}]
[null,null,null,null,null,null,null,null,null,null,null,null,null,null,null,null,null,null,null,null,null,null,null,null,null,null,null,null,null,null,null,null,null,null,null,null,null,null,null,null,null,null,null,null,null,{"$f":"IF('5 - Unmit. Risk Register'!A16=\"\",\"\",'5 - Unmit. Risk Register'!A16)","v":"CR-3"},{"$f":"IF('5 - Unmit. Risk Register'!B16=\"\",\"\",'5 - Unmit. Risk Register'!B16)","v":"Problems with planned accelerated bridge construction (ABC) technique"},null,null,{"$f":"IF('5 - Unmit. Risk Register'!C16=\"\",\"\",'5 - Unmit. Risk Register'!C16)","v":"Threat"},{"$f":"IF('5 - Unmit. Risk Register'!H16=\"\",\"\",'5 - Unmit. Risk Register'!H16)","v":0.33372372970696446},{"$f":"IF('5 - Unmit. Risk Register'!I16=\"\",\"\",'5 - Unmit. Risk Register'!I16)","v":4.4418759624521291E-2},{"$f":"IF('5 - Unmit. Risk Register'!J16=\"\",\"\",'5 - Unmit. Risk Register'!J16)","v":12}]
[null,null,null,null,null,null,null,null,null,null,null,null,null,null,null,null,null,null,null,null,null,null,null,null,null,null,null,null,null,null,null,null,null,null,null,null,null,null,null,null,null,null,null,null,null,{"$f":"IF('5 - Unmit. Risk Register'!A17=\"\",\"\",'5 - Unmit. Risk Register'!A17)","v":"PD-12"},{"$f":"IF('5 - Unmit. Risk Register'!B17=\"\",\"\",'5 - Unmit. Risk Register'!B17)","v":"Structures impacted by Main Street realignment are eligible for Historic Register."},null,null,{"$f":"IF('5 - Unmit. Risk Register'!C17=\"\",\"\",'5 - Unmit. Risk Register'!C17)","v":"Threat"},{"$f":"IF('5 - Unmit. Risk Register'!H17=\"\",\"\",'5 - Unmit. Risk Register'!H17)","v":0.21316488261655067},{"$f":"IF('5 - Unmit. Risk Register'!I17=\"\",\"\",'5 - Unmit. Risk Register'!I17)","v":2.8372329680145796E-2},{"$f":"IF('5 - Unmit. Risk Register'!J17=\"\",\"\",'5 - Unmit. Risk Register'!J17)","v":13}]
[null,null,null,null,null,null,null,null,null,null,null,null,null,null,null,null,null,null,null,null,null,null,null,null,null,null,null,null,null,null,null,null,null,null,null,null,null,null,null,null,null,null,null,null,null,{"$f":"IF('5 - Unmit. Risk Register'!A18=\"\",\"\",'5 - Unmit. Risk Register'!A18)","v":"PD-14"},{"$f":"IF('5 - Unmit. Risk Register'!B18=\"\",\"\",'5 - Unmit. Risk Register'!B18)","v":"Delays completing environmental documentation."},null,null,{"$f":"IF('5 - Unmit. Risk Register'!C18=\"\",\"\",'5 - Unmit. Risk Register'!C18)","v":"Threat"},{"$f":"IF('5 - Unmit. Risk Register'!H18=\"\",\"\",'5 - Unmit. Risk Register'!H18)","v":0.18441227221618048},{"$f":"IF('5 - Unmit. Risk Register'!I18=\"\",\"\",'5 - Unmit. Risk Register'!I18)","v":2.4545345932022771E-2},{"$f":"IF('5 - Unmit. Risk Register'!J18=\"\",\"\",'5 - Unmit. Risk Register'!J18)","v":14}]
[null,null,null,null,null,null,null,null,null,null,null,null,null,null,null,null,null,null,null,null,null,null,null,null,null,null,null,null,null,null,null,null,null,null,null,null,null,null,null,null,null,null,null,null,null,{"$f":"IF('5 - Unmit. Risk Register'!A19=\"\",\"\",'5 - Unmit. Risk Register'!A19)","v":"PD-4"},{"$f":"IF('5 - Unmit. Risk Register'!B19=\"\",\"\",'5 - Unmit. Risk Register'!B19)","v":"Ground improvement required in interchange area. "},null,null,{"$f":"IF('5 - Unmit. Risk Register'!C19=\"\",\"\",'5 - Unmit. Risk Register'!C19)","v":"Threat"},{"$f":"IF('5 - Unmit. Risk Register'!H19=\"\",\"\",'5 - Unmit. Risk Register'!H19)","v":0.16933020146133226},{"$f":"IF('5 - Unmit. Risk Register'!I19=\"\",\"\",'5 - Unmit. Risk Register'!I19)","v":2.2537916385170127E-2},{"$f":"IF('5 - Unmit. Risk Register'!J19=\"\",\"\",'5 - Unmit. Risk Register'!J19)","v":15}]
[null,null,null,null,null,null,null,null,null,null,null,null,null,null,null,null,null,null,null,null,null,null,null,null,null,null,null,null,null,null,null,null,null,null,null,null,null,null,null,null,null,null,null,null,null,{"$f":"IF('5 - Unmit. Risk Register'!A20=\"\",\"\",'5 - Unmit. Risk Register'!A20)","v":"SC-3"},{"$f":"IF('5 - Unmit. Risk Register'!B20=\"\",\"\",'5 - Unmit. Risk Register'!B20)","v":"Additional local improvements required. "},null,null,{"$f":"IF('5 - Unmit. Risk Register'!C20=\"\",\"\",'5 - Unmit. Risk Register'!C20)","v":"Threat"},{"$f":"IF('5 - Unmit. Risk Register'!H20=\"\",\"\",'5 - Unmit. Risk Register'!H20)","v":0.15828216097404291},{"$f":"IF('5 - Unmit. Risk Register'!I20=\"\",\"\",'5 - Unmit. Risk Register'!I20)","v":2.1067417852872788E-2},{"$f":"IF('5 - Unmit. Risk Register'!J20=\"\",\"\",'5 - Unmit. Risk Register'!J20)","v":16}]
[null,null,null,null,null,null,null,null,null,null,null,null,null,null,null,null,null,null,null,null,null,null,null,null,null,null,null,null,null,null,null,null,null,null,null,null,null,null,null,null,null,null,null,null,null,{"$f":"IF('5 - Unmit. Risk Register'!A21=\"\",\"\",'5 - Unmit. Risk Register'!A21)","v":"SC-5"},{"$f":"IF('5 - Unmit. Risk Register'!B21=\"\",\"\",'5 - Unmit. Risk Register'!B21)","v":"Replace culvert over Wandering Creek. "},null,null,{"$f":"IF('5 - Unmit. Risk Register'!C21=\"\",\"\",'5 - Unmit. Risk Register'!C21)","v":"Threat"},{"$f":"IF('5 - Unmit. Risk Register'!H21=\"\",\"\",'5 - Unmit. Risk Register'!H21)","v":0.11221152610445796},{"$f":"IF('5 - Unmit. Risk Register'!I21=\"\",\"\",'5 - Unmit. Risk Register'!I21)","v":1.4935398239469565E-2},{"$f":"IF('5 - Unmit. Risk Register'!J21=\"\",\"\",'5 - Unmit. Risk Register'!J21)","v":17}]
[null,null,null,null,null,null,null,null,null,null,null,null,null,null,null,null,null,null,null,null,null,null,null,null,null,null,null,null,null,null,null,null,null,null,null,null,null,null,null,null,null,null,null,null,null,{"$f":"IF('5 - Unmit. Risk Register'!A22=\"\",\"\",'5 - Unmit. Risk Register'!A22)","v":"PD-16"},{"$f":"IF('5 - Unmit. Risk Register'!B22=\"\",\"\",'5 - Unmit. Risk Register'!B22)","v":"Additional wetland mitigation required for planned alignment."},null,null,{"$f":"IF('5 - Unmit. Risk Register'!C22=\"\",\"\",'5 - Unmit. Risk Register'!C22)","v":"Threat"},{"$f":"IF('5 - Unmit. Risk Register'!H22=\"\",\"\",'5 - Unmit. Risk Register'!H22)","v":0.11221152610445796},{"$f":"IF('5 - Unmit. Risk Register'!I22=\"\",\"\",'5 - Unmit. Risk Register'!I22)","v":1.4935398239469565E-2},{"$f":"IF('5 - Unmit. Risk Register'!J22=\"\",\"\",'5 - Unmit. Risk Register'!J22)","v":18}]
[null,null,null,null,null,null,null,null,null,null,null,null,null,null,null,null,null,null,null,null,null,null,null,null,null,null,null,null,null,null,null,null,null,null,null,null,null,null,null,null,null,null,null,null,null,{"$f":"IF('5 - Unmit. Risk Register'!A23=\"\",\"\",'5 - Unmit. Risk Register'!A23)","v":"RR-7"},{"$f":"IF('5 - Unmit. Risk Register'!B23=\"\",\"\",'5 - Unmit. Risk Register'!B23)","v":"Telecom utility wants a cost-sharing agreement"},null,null,{"$f":"IF('5 - Unmit. Risk Register'!C23=\"\",\"\",'5 - Unmit. Risk Register'!C23)","v":"Threat"},{"$f":"IF('5 - Unmit. Risk Register'!H23=\"\",\"\",'5 - Unmit. Risk Register'!H23)","v":0.10975426666261862},{"$f":"IF('5 - Unmit. Risk Register'!I23=\"\",\"\",'5 - Unmit. Risk Register'!I23)","v":1.4608336041710994E-2},{"$f":"IF('5 - Unmit. Risk Register'!J23=\"\",\"\",'5 - Unmit. Risk Register'!J23)","v":19}]
[null,null,null,null,null,null,null,null,null,null,null,null,null,null,null,null,null,null,null,null,null,null,null,null,null,null,null,null,null,null,null,null,null,null,null,null,null,null,null,null,null,null,null,null,null,{"$f":"IF('5 - Unmit. Risk Register'!A24=\"\",\"\",'5 - Unmit. Risk Register'!A24)","v":"PD-5"},{"$f":"IF('5 - Unmit. Risk Register'!B24=\"\",\"\",'5 - Unmit. Risk Register'!B24)","v":"Shoulders required on US-555. "},null,null,{"$f":"IF('5 - Unmit. Risk Register'!C24=\"\",\"\",'5 - Unmit. Risk Register'!C24)","v":"Threat"},{"$f":"IF('5 - Unmit. Risk Register'!H24=\"\",\"\",'5 - Unmit. Risk Register'!H24)","v":9.8049624709276778E-2},{"$f":"IF('5 - Unmit. Risk Register'!I24=\"\",\"\",'5 - Unmit. Risk Register'!I24)","v":1.3050443596145028E-2},{"$f":"IF('5 - Unmit. Risk Register'!J24=\"\",\"\",'5 - Unmit. Risk Register'!J24)","v":20}]
[null,null,null,null,null,null,null,null,null,null,null,null,null,null,null,null,null,null,null,null,null,null,null,null,null,null,null,null,null,null,null,null,null,null,null,null,null,null,null,null,null,null,null,null,null,{"$f":"IF('5 - Unmit. Risk Register'!A25=\"\",\"\",'5 - Unmit. Risk Register'!A25)","v":"PD-6"},{"$f":"IF('5 - Unmit. Risk Register'!B25=\"\",\"\",'5 - Unmit. Risk Register'!B25)","v":"Shoulders required on SH-111."},null,null,{"$f":"IF('5 - Unmit. Risk Register'!C25=\"\",\"\",'5 - Unmit. Risk Register'!C25)","v":"Threat"},{"$f":"IF('5 - Unmit. Risk Register'!H25=\"\",\"\",'5 - Unmit. Risk Register'!H25)","v":9.8049624709276778E-2},{"$f":"IF('5 - Unmit. Risk Register'!I25=\"\",\"\",'5 - Unmit. Risk Register'!I25)","v":1.3050443596145028E-2},{"$f":"IF('5 - Unmit. Risk Register'!J25=\"\",\"\",'5 - Unmit. Risk Register'!J25)","v":21}]
[null,null,null,null,null,null,null,null,null,null,null,null,null,null,null,null,null,null,null,null,null,null,null,null,null,null,null,null,null,null,null,null,null,null,null,null,null,null,null,null,null,null,null,null,null,{"$f":"IF('5 - Unmit. Risk Register'!A26=\"\",\"\",'5 - Unmit. Risk Register'!A26)","v":"CR-5"},{"$f":"IF('5 - Unmit. Risk Register'!B26=\"\",\"\",'5 - Unmit. Risk Register'!B26)","v":"Difficult foundation installation"},null,null,{"$f":"IF('5 - Unmit. Risk Register'!C26=\"\",\"\",'5 - Unmit. Risk Register'!C26)","v":"Threat"},{"$f":"IF('5 - Unmit. Risk Register'!H26=\"\",\"\",'5 - Unmit. Risk Register'!H26)","v":7.5802599643183061E-2},{"$f":"IF('5 - Unmit. Risk Register'!I26=\"\",\"\",'5 - Unmit. Risk Register'!I26)","v":1.0089355813627372E-2},{"$f":"IF('5 - Unmit. Risk Register'!J26=\"\",\"\",'5 - Unmit. Risk Register'!J26)","v":22}]
[null,null,null,null,null,null,null,null,null,null,null,null,null,null,null,null,null,null,null,null,null,null,null,null,null,null,null,null,null,null,null,null,null,null,null,null,null,null,null,null,null,null,null,null,null,{"$f":"IF('5 - Unmit. Risk Register'!A27=\"\",\"\",'5 - Unmit. Risk Register'!A27)","v":"EP-2"},{"$f":"IF('5 - Unmit. Risk Register'!B27=\"\",\"\",'5 - Unmit. Risk Register'!B27)","v":"Delay obtaining the 404 permit"},null,null,{"$f":"IF('5 - Unmit. Risk Register'!C27=\"\",\"\",'5 - Unmit. Risk Register'!C27)","v":"Threat"},{"$f":"IF('5 - Unmit. Risk Register'!H27=\"\",\"\",'5 - Unmit. Risk Register'!H27)","v":7.3451630977436261E-2},{"$f":"IF('5 - Unmit. Risk Register'!I27=\"\",\"\",'5 - Unmit. Risk Register'!I27)","v":9.7764409599539939E-3},{"$f":"IF('5 - Unmit. Risk Register'!J27=\"\",\"\",'5 - Unmit. Risk Register'!J27)","v":23}]
[null,null,null,null,null,null,null,null,null,null,null,null,null,null,null,null,null,null,null,null,null,null,null,null,null,null,null,null,null,null,null,null,null,null,null,null,null,null,null,null,null,null,null,null,null,{"$f":"IF('5 - Unmit. Risk Register'!A28=\"\",\"\",'5 - Unmit. Risk Register'!A28)","v":"RR-6"},{"$f":"IF('5 - Unmit. Risk Register'!B28=\"\",\"\",'5 - Unmit. Risk Register'!B28)","v":"Other delays to ROW planning"},null,null,{"$f":"IF('5 - Unmit. Risk Register'!C28=\"\",\"\",'5 - Unmit. Risk Register'!C28)","v":"Threat"},{"$f":"IF('5 - Unmit. Risk Register'!H28=\"\",\"\",'5 - Unmit. Risk Register'!H28)","v":4.551272400547713E-2},{"$f":"IF('5 - Unmit. Risk Register'!I28=\"\",\"\",'5 - Unmit. Risk Register'!I28)","v":6.0577614580527668E-3},{"$f":"IF('5 - Unmit. Risk Register'!J28=\"\",\"\",'5 - Unmit. Risk Register'!J28)","v":24}]
[null,null,null,null,null,null,null,null,null,null,null,null,null,null,null,null,null,null,null,null,null,null,null,null,null,null,null,null,null,null,null,null,null,null,null,null,null,null,null,null,null,null,null,null,null,{"$f":"IF('5 - Unmit. Risk Register'!A29=\"\",\"\",'5 - Unmit. Risk Register'!A29)","v":"PD-1"},{"$f":"IF('5 - Unmit. Risk Register'!B29=\"\",\"\",'5 - Unmit. Risk Register'!B29)","v":"Shift alignment of US 555 at east end of project"},null,null,{"$f":"IF('5 - Unmit. Risk Register'!C29=\"\",\"\",'5 - Unmit. Risk Register'!C29)","v":"Threat"},{"$f":"IF('5 - Unmit. Risk Register'!H29=\"\",\"\",'5 - Unmit. Risk Register'!H29)","v":4.2611327308908681E-2},{"$f":"IF('5 - Unmit. Risk Register'!I29=\"\",\"\",'5 - Unmit. Risk Register'!I29)","v":5.6715844170811287E-3},{"$f":"IF('5 - Unmit. Risk Register'!J29=\"\",\"\",'5 - Unmit. Risk Register'!J29)","v":25}]
[null,null,null,null,null,null,null,null,null,null,null,null,null,null,null,null,null,null,null,null,null,null,null,null,null,null,null,null,null,null,null,null,null,null,null,null,null,null,null,null,null,null,null,null,null,{"$f":"IF('5 - Unmit. Risk Register'!A30=\"\",\"\",'5 - Unmit. Risk Register'!A30)","v":"PD-15"},{"$f":"IF('5 - Unmit. Risk Register'!B30=\"\",\"\",'5 - Unmit. Risk Register'!B30)","v":"Encounter unanticipated contamination in interchange area."},null,null,{"$f":"IF('5 - Unmit. Risk Register'!C30=\"\",\"\",'5 - Unmit. Risk Register'!C30)","v":"Threat"},{"$f":"IF('5 - Unmit. Risk Register'!H30=\"\",\"\",'5 - Unmit. Risk Register'!H30)","v":3.2060436029845138E-2},{"$f":"IF('5 - Unmit. Risk Register'!I30=\"\",\"\",'5 - Unmit. Risk Register'!I30)","v":4.2672566398484482E-3},{"$f":"IF('5 - Unmit. Risk Register'!J30=\"\",\"\",'5 - Unmit. Risk Register'!J30)","v":26}]
[null,null,null,null,null,null,null,null,null,null,null,null,null,null,null,null,null,null,null,null,null,null,null,null,null,null,null,null,null,null,null,null,null,null,null,null,null,null,null,null,null,null,null,null,null,{"$f":"IF('5 - Unmit. Risk Register'!A31=\"\",\"\",'5 - Unmit. Risk Register'!A31)","v":"CR-9"},{"$f":"IF('5 - Unmit. Risk Register'!B31=\"\",\"\",'5 - Unmit. Risk Register'!B31)","v":"Limited construction staging area in vicinity of interchange"},null,null,{"$f":"IF('5 - Unmit. Risk Register'!C31=\"\",\"\",'5 - Unmit. Risk Register'!C31)","v":"Threat"},{"$f":"IF('5 - Unmit. Risk Register'!H31=\"\",\"\",'5 - Unmit. Risk Register'!H31)","v":3.2060436029845138E-2},{"$f":"IF('5 - Unmit. Risk Register'!I31=\"\",\"\",'5 - Unmit. Risk Register'!I31)","v":4.2672566398484482E-3},{"$f":"IF('5 - Unmit. Risk Register'!J31=\"\",\"\",'5 - Unmit. Risk Register'!J31)","v":27}]
[null,null,null,null,null,null,null,null,null,null,null,null,null,null,null,null,null,null,null,null,null,null,null,null,null,null,null,null,null,null,null,null,null,null,null,null,null,null,null,null,null,null,null,null,null,{"$f":"IF('5 - Unmit. Risk Register'!A32=\"\",\"\",'5 - Unmit. Risk Register'!A32)","v":"PR-8"},{"$f":"IF('5 - Unmit. Risk Register'!B32=\"\",\"\",'5 - Unmit. Risk Register'!B32)","v":"Other problems with D/B contract procurement"},null,null,{"$f":"IF('5 - Unmit. Risk Register'!C32=\"\",\"\",'5 - Unmit. Risk Register'!C32)","v":"Threat"},{"$f":"IF('5 - Unmit. Risk Register'!H32=\"\",\"\",'5 - Unmit. Risk Register'!H32)","v":1.8357521922402198E-2},{"$f":"IF('5 - Unmit. Risk Register'!I32=\"\",\"\",'5 - Unmit. Risk Register'!I32)","v":2.4433933849686514E-3},{"$f":"IF('5 - Unmit. Risk Register'!J32=\"\",\"\",'5 - Unmit. Risk Register'!J32)","v":28}]
[null,null,null,null,null,null,null,null,null,null,null,null,null,null,null,null,null,null,null,null,null,null,null,null,null,null,null,null,null,null,null,null,null,null,null,null,null,null,null,null,null,null,null,null,null,{"$f":"IF('5 - Unmit. Risk Register'!A33=\"\",\"\",'5 - Unmit. Risk Register'!A33)","v":"PL-2"},{"$f":"IF('5 - Unmit. Risk Register'!B33=\"\",\"\",'5 - Unmit. Risk Register'!B33)","v":"Opposition to removing access to US-555 fro 12th St."},null,null,{"$f":"IF('5 - Unmit. Risk Register'!C33=\"\",\"\",'5 - Unmit. Risk Register'!C33)","v":"Threat"},{"$f":"IF('5 - Unmit. Risk Register'!H33=\"\",\"\",'5 - Unmit. Risk Register'!H33)","v":1.3358515012435471E-2},{"$f":"IF('5 - Unmit. Risk Register'!I33=\"\",\"\",'5 - Unmit. Risk Register'!I33)","v":1.7780235999368529E-3},{"$f":"IF('5 - Unmit. Risk Register'!J33=\"\",\"\",'5 - Unmit. Risk Register'!J33)","v":29}]
[null,null,null,null,null,null,null,null,null,null,null,null,null,null,null,null,null,null,null,null,null,null,null,null,null,null,null,null,null,null,null,null,null,null,null,null,null,null,null,null,null,null,null,null,null,{"$f":"IF('5 - Unmit. Risk Register'!A34=\"\",\"\",'5 - Unmit. Risk Register'!A34)","v":"CR-7"},{"$f":"IF('5 - Unmit. Risk Register'!B34=\"\",\"\",'5 - Unmit. Risk Register'!B34)","v":"Colder-than-usual winter "},null,null,{"$f":"IF('5 - Unmit. Risk Register'!C34=\"\",\"\",'5 - Unmit. Risk Register'!C34)","v":"Threat"},{"$f":"IF('5 - Unmit. Risk Register'!H34=\"\",\"\",'5 - Unmit. Risk Register'!H34)","v":5.8071437477329509E-3},{"$f":"IF('5 - Unmit. Risk Register'!I34=\"\",\"\",'5 - Unmit. Risk Register'!I34)","v":7.729331158503128E-4},{"$f":"IF('5 - Unmit. Risk Register'!J34=\"\",\"\",'5 - Unmit. Risk Register'!J34)","v":30}]
[null,null,null,null,null,null,null,null,null,null,null,null,null,null,null,null,null,null,null,null,null,null,null,null,null,null,null,null,null,null,null,null,null,null,null,null,null,null,null,null,null,null,null,null,null,{"$f":"IF('5 - Unmit. Risk Register'!A35=\"\",\"\",'5 - Unmit. Risk Register'!A35)","v":"CR-1"},{"$f":"IF('5 - Unmit. Risk Register'!B35=\"\",\"\",'5 - Unmit. Risk Register'!B35)","v":"D/B construction phasing significantly different than assumed"},null,null,{"$f":"IF('5 - Unmit. Risk Register'!C35=\"\",\"\",'5 - Unmit. Risk Register'!C35)","v":"Opportunity"},{"$f":"IF('5 - Unmit. Risk Register'!H35=\"\",\"\",'5 - Unmit. Risk Register'!H35)","v":-0.43566608956405839},{"$f":"IF('5 - Unmit. Risk Register'!I35=\"\",\"\",'5 - Unmit. Risk Register'!I35)","v":0.56411460935470881},{"$f":"IF('5 - Unmit. Risk Register'!J35=\"\",\"\",'5 - Unmit. Risk Register'!J35)","v":1}]
[null,null,null,null,null,null,null,null,null,null,null,null,null,null,null,null,null,null,null,null,null,null,null,null,null,null,null,null,null,null,null,null,null,null,null,null,null,null,null,null,null,null,null,null,null,{"$f":"IF('5 - Unmit. Risk Register'!A36=\"\",\"\",'5 - Unmit. Risk Register'!A36)","v":"PD-8"},{"$f":"IF('5 - Unmit. Risk Register'!B36=\"\",\"\",'5 - Unmit. Risk Register'!B36)","v":"Change in pavement section and/or type."},null,null,{"$f":"IF('5 - Unmit. Risk Register'!C36=\"\",\"\",'5 - Unmit. Risk Register'!C36)","v":"Opportunity"},{"$f":"IF('5 - Unmit. Risk Register'!H36=\"\",\"\",'5 - Unmit. Risk Register'!H36)","v":-0.3366345783133739},{"$f":"IF('5 - Unmit. Risk Register'!I36=\"\",\"\",'5 - Unmit. Risk Register'!I36)","v":0.43588539064529125},{"$f":"IF('5 - Unmit. Risk Register'!J36=\"\",\"\",'5 - Unmit. Risk Register'!J36)","v":2}]
[null,null,null,null,null,null,null,null,null,null,null,null,null,null,null,null,null,null,null,null,null,null,null,null,null,null,null,null,null,null,null,null,null,null,null,null,null,null,null,null,null,null,null,null,null,{"$f":"IF('5 - Unmit. Risk Register'!A37=\"\",\"\",'5 - Unmit. Risk Register'!A37)","v":"PL-1"},{"$f":"IF('5 - Unmit. Risk Register'!B37=\"\",\"\",'5 - Unmit. Risk Register'!B37)","v":"Project funding delayed or reduced."},null,null,{"$f":"IF('5 - Unmit. Risk Register'!C37=\"\",\"\",'5 - Unmit. Risk Register'!C37)","v":"No Impact"},{"$f":"IF('5 - Unmit. Risk Register'!H37=\"\",\"\",'5 - Unmit. Risk Register'!H37)","v":0},{"$f":"IF('5 - Unmit. Risk Register'!I37=\"\",\"\",'5 - Unmit. Risk Register'!I37)","v":0},{"$f":"IF('5 - Unmit. Risk Register'!J37=\"\",\"\",'5 - Unmit. Risk Register'!J37)","v":""}]
[null,null,null,null,null,null,null,null,null,null,null,null,null,null,null,null,null,null,null,null,null,null,null,null,null,null,null,null,null,null,null,null,null,null,null,null,null,null,null,null,null,null,null,null,null,{"$f":"IF('5 - Unmit. Risk Register'!A38=\"\",\"\",'5 - Unmit. Risk Register'!A38)","v":"PL-3"},{"$f":"IF('5 - Unmit. Risk Register'!B38=\"\",\"\",'5 - Unmit. Risk Register'!B38)","v":"Opposition to \"splitting\" alignment of SH-111 in the interchange area."},null,null,{"$f":"IF('5 - Unmit. Risk Register'!C38=\"\",\"\",'5 - Unmit. Risk Register'!C38)","v":"No Impact"},{"$f":"IF('5 - Unmit. Risk Register'!H38=\"\",\"\",'5 - Unmit. Risk Register'!H38)","v":0},{"$f":"IF('5 - Unmit. Risk Register'!I38=\"\",\"\",'5 - Unmit. Risk Register'!I38)","v":0},{"$f":"IF('5 - Unmit. Risk Register'!J38=\"\",\"\",'5 - Unmit. Risk Register'!J38)","v":""}]
[null,null,null,null,null,null,null,null,null,null,null,null,null,null,null,null,null,null,null,null,null,null,null,null,null,null,null,null,null,null,null,null,null,null,null,null,null,null,null,null,null,null,null,null,null,{"$f":"IF('5 - Unmit. Risk Register'!A39=\"\",\"\",'5 - Unmit. Risk Register'!A39)","v":"PL-4"},{"$f":"IF('5 - Unmit. Risk Register'!B39=\"\",\"\",'5 - Unmit. Risk Register'!B39)","v":"Other stakeholder issues not captured separately."},null,null,{"$f":"IF('5 - Unmit. Risk Register'!C39=\"\",\"\",'5 - Unmit. Risk Register'!C39)","v":"No Impact"},{"$f":"IF('5 - Unmit. Risk Register'!H39=\"\",\"\",'5 - Unmit. Risk Register'!H39)","v":0},{"$f":"IF('5 - Unmit. Risk Register'!I39=\"\",\"\",'5 - Unmit. Risk Register'!I39)","v":0},{"$f":"IF('5 - Unmit. Risk Register'!J39=\"\",\"\",'5 - Unmit. Risk Register'!J39)","v":""}]
[null,null,null,null,null,null,null,null,null,null,null,null,null,null,null,null,null,null,null,null,null,null,null,null,null,null,null,null,null,null,null,null,null,null,null,null,null,null,null,null,null,null,null,null,null,{"$f":"IF('5 - Unmit. Risk Register'!A40=\"\",\"\",'5 - Unmit. Risk Register'!A40)","v":"SC-1"},{"$f":"IF('5 - Unmit. Risk Register'!B40=\"\",\"\",'5 - Unmit. Risk Register'!B40)","v":"Change in East-West project limits. "},null,null,{"$f":"IF('5 - Unmit. Risk Register'!C40=\"\",\"\",'5 - Unmit. Risk Register'!C40)","v":"No Impact"},{"$f":"IF('5 - Unmit. Risk Register'!H40=\"\",\"\",'5 - Unmit. Risk Register'!H40)","v":0},{"$f":"IF('5 - Unmit. Risk Register'!I40=\"\",\"\",'5 - Unmit. Risk Register'!I40)","v":0},{"$f":"IF('5 - Unmit. Risk Register'!J40=\"\",\"\",'5 - Unmit. Risk Register'!J40)","v":""}]
[null,null,null,null,null,null,null,null,null,null,null,null,null,null,null,null,null,null,null,null,null,null,null,null,null,null,null,null,null,null,null,null,null,null,null,null,null,null,null,null,null,null,null,null,null,{"$f":"IF('5 - Unmit. Risk Register'!A41=\"\",\"\",'5 - Unmit. Risk Register'!A41)","v":"SC-2"},{"$f":"IF('5 - Unmit. Risk Register'!B41=\"\",\"\",'5 - Unmit. Risk Register'!B41)","v":"Change in North-South project limits. "},null,null,{"$f":"IF('5 - Unmit. Risk Register'!C41=\"\",\"\",'5 - Unmit. Risk Register'!C41)","v":"No Impact"},{"$f":"IF('5 - Unmit. Risk Register'!H41=\"\",\"\",'5 - Unmit. Risk Register'!H41)","v":0},{"$f":"IF('5 - Unmit. Risk Register'!I41=\"\",\"\",'5 - Unmit. Risk Register'!I41)","v":0},{"$f":"IF('5 - Unmit. Risk Register'!J41=\"\",\"\",'5 - Unmit. Risk Register'!J41)","v":""}]
[null,null,null,null,null,null,null,null,null,null,null,null,null,null,null,null,null,null,null,null,null,null,null,null,null,null,null,null,null,null,null,null,null,null,null,null,null,null,null,null,null,null,null,null,null,{"$f":"IF('5 - Unmit. Risk Register'!A42=\"\",\"\",'5 - Unmit. Risk Register'!A42)","v":"SC-4"},{"$f":"IF('5 - Unmit. Risk Register'!B42=\"\",\"\",'5 - Unmit. Risk Register'!B42)","v":"Increased aestethetics for US-555/SH-111 interchange. "},null,null,{"$f":"IF('5 - Unmit. Risk Register'!C42=\"\",\"\",'5 - Unmit. Risk Register'!C42)","v":"No Impact"},{"$f":"IF('5 - Unmit. Risk Register'!H42=\"\",\"\",'5 - Unmit. Risk Register'!H42)","v":0},{"$f":"IF('5 - Unmit. Risk Register'!I42=\"\",\"\",'5 - Unmit. Risk Register'!I42)","v":0},{"$f":"IF('5 - Unmit. Risk Register'!J42=\"\",\"\",'5 - Unmit. Risk Register'!J42)","v":""}]
[null,null,null,null,null,null,null,null,null,null,null,null,null,null,null,null,null,null,null,null,null,null,null,null,null,null,null,null,null,null,null,null,null,null,null,null,null,null,null,null,null,null,null,null,null,{"$f":"IF('5 - Unmit. Risk Register'!A43=\"\",\"\",'5 - Unmit. Risk Register'!A43)","v":"SC-7"},{"$f":"IF('5 - Unmit. Risk Register'!B43=\"\",\"\",'5 - Unmit. Risk Register'!B43)","v":"ITS added to this project. "},null,null,{"$f":"IF('5 - Unmit. Risk Register'!C43=\"\",\"\",'5 - Unmit. Risk Register'!C43)","v":"No Impact"},{"$f":"IF('5 - Unmit. Risk Register'!H43=\"\",\"\",'5 - Unmit. Risk Register'!H43)","v":0},{"$f":"IF('5 - Unmit. Risk Register'!I43=\"\",\"\",'5 - Unmit. Risk Register'!I43)","v":0},{"$f":"IF('5 - Unmit. Risk Register'!J43=\"\",\"\",'5 - Unmit. Risk Register'!J43)","v":""}]
[null,null,null,null,null,null,null,null,null,null,null,null,null,null,null,null,null,null,null,null,null,null,null,null,null,null,null,null,null,null,null,null,null,null,null,null,null,null,null,null,null,null,null,null,null,{"$f":"IF('5 - Unmit. Risk Register'!A44=\"\",\"\",'5 - Unmit. Risk Register'!A44)","v":"PD-2"},{"$f":"IF('5 - Unmit. Risk Register'!B44=\"\",\"\",'5 - Unmit. Risk Register'!B44)","v":"Split alignment of SH-111 at US-555 interchange. "},null,null,{"$f":"IF('5 - Unmit. Risk Register'!C44=\"\",\"\",'5 - Unmit. Risk Register'!C44)","v":"No Impact"},{"$f":"IF('5 - Unmit. Risk Register'!H44=\"\",\"\",'5 - Unmit. Risk Register'!H44)","v":0},{"$f":"IF('5 - Unmit. Risk Register'!I44=\"\",\"\",'5 - Unmit. Risk Register'!I44)","v":0},{"$f":"IF('5 - Unmit. Risk Register'!J44=\"\",\"\",'5 - Unmit. Risk Register'!J44)","v":""}]
[null,null,null,null,null,null,null,null,null,null,null,null,null,null,null,null,null,null,null,null,null,null,null,null,null,null,null,null,null,null,null,null,null,null,null,null,null,null,null,null,null,null,null,null,null,{"$f":"IF('5 - Unmit. Risk Register'!A45=\"\",\"\",'5 - Unmit. Risk Register'!A45)","v":"PD-3"},{"$f":"IF('5 - Unmit. Risk Register'!B45=\"\",\"\",'5 - Unmit. Risk Register'!B45)","v":"Change in configuration of SH 111 / US 555 interchange."},null,null,{"$f":"IF('5 - Unmit. Risk Register'!C45=\"\",\"\",'5 - Unmit. Risk Register'!C45)","v":"No Impact"},{"$f":"IF('5 - Unmit. Risk Register'!H45=\"\",\"\",'5 - Unmit. Risk Register'!H45)","v":0},{"$f":"IF('5 - Unmit. Risk Register'!I45=\"\",\"\",'5 - Unmit. Risk Register'!I45)","v":0},{"$f":"IF('5 - Unmit. Risk Register'!J45=\"\",\"\",'5 - Unmit. Risk Register'!J45)","v":""}]
[null,null,null,null,null,null,null,null,null,null,null,null,null,null,null,null,null,null,null,null,null,null,null,null,null,null,null,null,null,null,null,null,null,null,null,null,null,null,null,null,null,null,null,null,null,{"$f":"IF('5 - Unmit. Risk Register'!A46=\"\",\"\",'5 - Unmit. Risk Register'!A46)","v":"PD-7"},{"$f":"IF('5 - Unmit. Risk Register'!B46=\"\",\"\",'5 - Unmit. Risk Register'!B46)","v":"Additional cost for signalized intersections."},null,null,{"$f":"IF('5 - Unmit. Risk Register'!C46=\"\",\"\",'5 - Unmit. Risk Register'!C46)","v":"No Impact"},{"$f":"IF('5 - Unmit. Risk Register'!H46=\"\",\"\",'5 - Unmit. Risk Register'!H46)","v":0},{"$f":"IF('5 - Unmit. Risk Register'!I46=\"\",\"\",'5 - Unmit. Risk Register'!I46)","v":0},{"$f":"IF('5 - Unmit. Risk Register'!J46=\"\",\"\",'5 - Unmit. Risk Register'!J46)","v":""}]
[null,null,null,null,null,null,null,null,null,null,null,null,null,null,null,null,null,null,null,null,null,null,null,null,null,null,null,null,null,null,null,null,null,null,null,null,null,null,null,null,null,null,null,null,null,{"$f":"IF('5 - Unmit. Risk Register'!A47=\"\",\"\",'5 - Unmit. Risk Register'!A47)","v":"PD-9"},{"$f":"IF('5 - Unmit. Risk Register'!B47=\"\",\"\",'5 - Unmit. Risk Register'!B47)","v":"Rehabilitate instead of reconstruct existing roadway (e.g., overlay instead)."},null,null,{"$f":"IF('5 - Unmit. Risk Register'!C47=\"\",\"\",'5 - Unmit. Risk Register'!C47)","v":"No Impact"},{"$f":"IF('5 - Unmit. Risk Register'!H47=\"\",\"\",'5 - Unmit. Risk Register'!H47)","v":0},{"$f":"IF('5 - Unmit. Risk Register'!I47=\"\",\"\",'5 - Unmit. Risk Register'!I47)","v":0},{"$f":"IF('5 - Unmit. Risk Register'!J47=\"\",\"\",'5 - Unmit. Risk Register'!J47)","v":""}]
[null,null,null,null,null,null,null,null,null,null,null,null,null,null,null,null,null,null,null,null,null,null,null,null,null,null,null,null,null,null,null,null,null,null,null,null,null,null,null,null,null,null,null,null,null,{"$f":"IF('5 - Unmit. Risk Register'!A48=\"\",\"\",'5 - Unmit. Risk Register'!A48)","v":"PD-10"},{"$f":"IF('5 - Unmit. Risk Register'!B48=\"\",\"\",'5 - Unmit. Risk Register'!B48)","v":"Change in stormwater design standards."},null,null,{"$f":"IF('5 - Unmit. Risk Register'!C48=\"\",\"\",'5 - Unmit. Risk Register'!C48)","v":"No Impact"},{"$f":"IF('5 - Unmit. Risk Register'!H48=\"\",\"\",'5 - Unmit. Risk Register'!H48)","v":0},{"$f":"IF('5 - Unmit. Risk Register'!I48=\"\",\"\",'5 - Unmit. Risk Register'!I48)","v":0},{"$f":"IF('5 - Unmit. Risk Register'!J48=\"\",\"\",'5 - Unmit. Risk Register'!J48)","v":""}]
[null,null,null,null,null,null,null,null,null,null,null,null,null,null,null,null,null,null,null,null,null,null,null,null,null,null,null,null,null,null,null,null,null,null,null,null,null,null,null,null,null,null,null,null,null,{"$f":"IF('5 - Unmit. Risk Register'!A49=\"\",\"\",'5 - Unmit. Risk Register'!A49)","v":"EP-1"},{"$f":"IF('5 - Unmit. Risk Register'!B49=\"\",\"\",'5 - Unmit. Risk Register'!B49)","v":"Challenge to environmental determination or permits"},null,null,{"$f":"IF('5 - Unmit. Risk Register'!C49=\"\",\"\",'5 - Unmit. Risk Register'!C49)","v":"No Impact"},{"$f":"IF('5 - Unmit. Risk Register'!H49=\"\",\"\",'5 - Unmit. Risk Register'!H49)","v":0},{"$f":"IF('5 - Unmit. Risk Register'!I49=\"\",\"\",'5 - Unmit. Risk Register'!I49)","v":0},{"$f":"IF('5 - Unmit. Risk Register'!J49=\"\",\"\",'5 - Unmit. Risk Register'!J49)","v":""}]
[null,null,null,null,null,null,null,null,null,null,null,null,null,null,null,null,null,null,null,null,null,null,null,null,null,null,null,null,null,null,null,null,null,null,null,null,null,null,null,null,null,null,null,null,null,{"$f":"IF('5 - Unmit. Risk Register'!A50=\"\",\"\",'5 - Unmit. Risk Register'!A50)","v":"RR-4"},{"$f":"IF('5 - Unmit. Risk Register'!B50=\"\",\"\",'5 - Unmit. Risk Register'!B50)","v":"Additional relocation or demolition required"},null,null,{"$f":"IF('5 - Unmit. Risk Register'!C50=\"\",\"\",'5 - Unmit. Risk Register'!C50)","v":"No Impact"},{"$f":"IF('5 - Unmit. Risk Register'!H50=\"\",\"\",'5 - Unmit. Risk Register'!H50)","v":0},{"$f":"IF('5 - Unmit. Risk Register'!I50=\"\",\"\",'5 - Unmit. Risk Register'!I50)","v":0},{"$f":"IF('5 - Unmit. Risk Register'!J50=\"\",\"\",'5 - Unmit. Risk Register'!J50)","v":""}]
[null,null,null,null,null,null,null,null,null,null,null,null,null,null,null,null,null,null,null,null,null,null,null,null,null,null,null,null,null,null,null,null,null,null,null,null,null,null,null,null,null,null,null,null,null,{"$f":"IF('5 - Unmit. Risk Register'!A51=\"\",\"\",'5 - Unmit. Risk Register'!A51)","v":"RR-5"},{"$f":"IF('5 - Unmit. Risk Register'!B51=\"\",\"\",'5 - Unmit. Risk Register'!B51)","v":"Additional ROW required for planned project"},null,null,{"$f":"IF('5 - Unmit. Risk Register'!C51=\"\",\"\",'5 - Unmit. Risk Register'!C51)","v":"No Impact"},{"$f":"IF('5 - Unmit. Risk Register'!H51=\"\",\"\",'5 - Unmit. Risk Register'!H51)","v":0},{"$f":"IF('5 - Unmit. Risk Register'!I51=\"\",\"\",'5 - Unmit. Risk Register'!I51)","v":0},{"$f":"IF('5 - Unmit. Risk Register'!J51=\"\",\"\",'5 - Unmit. Risk Register'!J51)","v":""}]
[null,null,null,null,null,null,null,null,null,null,null,null,null,null,null,null,null,null,null,null,null,null,null,null,null,null,null,null,null,null,null,null,null,null,null,null,null,null,null,null,null,null,null,null,null,{"$f":"IF('5 - Unmit. Risk Register'!A52=\"\",\"\",'5 - Unmit. Risk Register'!A52)","v":"RR-9"},{"$f":"IF('5 - Unmit. Risk Register'!B52=\"\",\"\",'5 - Unmit. Risk Register'!B52)","v":"Other utility relocations not completed on time"},null,null,{"$f":"IF('5 - Unmit. Risk Register'!C52=\"\",\"\",'5 - Unmit. Risk Register'!C52)","v":"No Impact"},{"$f":"IF('5 - Unmit. Risk Register'!H52=\"\",\"\",'5 - Unmit. Risk Register'!H52)","v":0},{"$f":"IF('5 - Unmit. Risk Register'!I52=\"\",\"\",'5 - Unmit. Risk Register'!I52)","v":0},{"$f":"IF('5 - Unmit. Risk Register'!J52=\"\",\"\",'5 - Unmit. Risk Register'!J52)","v":""}]
[null,null,null,null,null,null,null,null,null,null,null,null,null,null,null,null,null,null,null,null,null,null,null,null,null,null,null,null,null,null,null,null,null,null,null,null,null,null,null,null,null,null,null,null,null,{"$f":"IF('5 - Unmit. Risk Register'!A53=\"\",\"\",'5 - Unmit. Risk Register'!A53)","v":"RR-10"},{"$f":"IF('5 - Unmit. Risk Register'!B53=\"\",\"\",'5 - Unmit. Risk Register'!B53)","v":"Damage existing utility or encounter unanticipated utility during construction"},null,null,{"$f":"IF('5 - Unmit. Risk Register'!C53=\"\",\"\",'5 - Unmit. Risk Register'!C53)","v":"No Impact"},{"$f":"IF('5 - Unmit. Risk Register'!H53=\"\",\"\",'5 - Unmit. Risk Register'!H53)","v":0},{"$f":"IF('5 - Unmit. Risk Register'!I53=\"\",\"\",'5 - Unmit. Risk Register'!I53)","v":0},{"$f":"IF('5 - Unmit. Risk Register'!J53=\"\",\"\",'5 - Unmit. Risk Register'!J53)","v":""}]
[null,null,null,null,null,null,null,null,null,null,null,null,null,null,null,null,null,null,null,null,null,null,null,null,null,null,null,null,null,null,null,null,null,null,null,null,null,null,null,null,null,null,null,null,null,{"$f":"IF('5 - Unmit. Risk Register'!A54=\"\",\"\",'5 - Unmit. Risk Register'!A54)","v":"PR-3"},{"$f":"IF('5 - Unmit. Risk Register'!B54=\"\",\"\",'5 - Unmit. Risk Register'!B54)","v":"Material-supply issues"},null,null,{"$f":"IF('5 - Unmit. Risk Register'!C54=\"\",\"\",'5 - Unmit. Risk Register'!C54)","v":"No Impact"},{"$f":"IF('5 - Unmit. Risk Register'!H54=\"\",\"\",'5 - Unmit. Risk Register'!H54)","v":0},{"$f":"IF('5 - Unmit. Risk Register'!I54=\"\",\"\",'5 - Unmit. Risk Register'!I54)","v":0},{"$f":"IF('5 - Unmit. Risk Register'!J54=\"\",\"\",'5 - Unmit. Risk Register'!J54)","v":""}]
[null,null,null,null,null,null,null,null,null,null,null,null,null,null,null,null,null,null,null,null,null,null,null,null,null,null,null,null,null,null,null,null,null,null,null,null,null,null,null,null,null,null,null,null,null,{"$f":"IF('5 - Unmit. Risk Register'!A55=\"\",\"\",'5 - Unmit. Risk Register'!A55)","v":"PR-4"},{"$f":"IF('5 - Unmit. Risk Register'!B55=\"\",\"\",'5 - Unmit. Risk Register'!B55)","v":"Change in project delivery method"},null,null,{"$f":"IF('5 - Unmit. Risk Register'!C55=\"\",\"\",'5 - Unmit. Risk Register'!C55)","v":"No Impact"},{"$f":"IF('5 - Unmit. Risk Register'!H55=\"\",\"\",'5 - Unmit. Risk Register'!H55)","v":0},{"$f":"IF('5 - Unmit. Risk Register'!I55=\"\",\"\",'5 - Unmit. Risk Register'!I55)","v":0},{"$f":"IF('5 - Unmit. Risk Register'!J55=\"\",\"\",'5 - Unmit. Risk Register'!J55)","v":""}]
[null,null,null,null,null,null,null,null,null,null,null,null,null,null,null,null,null,null,null,null,null,null,null,null,null,null,null,null,null,null,null,null,null,null,null,null,null,null,null,null,null,null,null,null,null,{"$f":"IF('5 - Unmit. Risk Register'!A56=\"\",\"\",'5 - Unmit. Risk Register'!A56)","v":"PR-5"},{"$f":"IF('5 - Unmit. Risk Register'!B56=\"\",\"\",'5 - Unmit. Risk Register'!B56)","v":"Accelerate pre-construction activities to reach NTP sooner"},null,null,{"$f":"IF('5 - Unmit. Risk Register'!C56=\"\",\"\",'5 - Unmit. Risk Register'!C56)","v":"No Impact"},{"$f":"IF('5 - Unmit. Risk Register'!H56=\"\",\"\",'5 - Unmit. Risk Register'!H56)","v":0},{"$f":"IF('5 - Unmit. Risk Register'!I56=\"\",\"\",'5 - Unmit. Risk Register'!I56)","v":0},{"$f":"IF('5 - Unmit. Risk Register'!J56=\"\",\"\",'5 - Unmit. Risk Register'!J56)","v":""}]
[null,null,null,null,null,null,null,null,null,null,null,null,null,null,null,null,null,null,null,null,null,null,null,null,null,null,null,null,null,null,null,null,null,null,null,null,null,null,null,null,null,null,null,null,null,{"$f":"IF('5 - Unmit. Risk Register'!A57=\"\",\"\",'5 - Unmit. Risk Register'!A57)","v":"PR-6"},{"$f":"IF('5 - Unmit. Risk Register'!B57=\"\",\"\",'5 - Unmit. Risk Register'!B57)","v":"Use incentives to accelerate D/B construction"},null,null,{"$f":"IF('5 - Unmit. Risk Register'!C57=\"\",\"\",'5 - Unmit. Risk Register'!C57)","v":"No Impact"},{"$f":"IF('5 - Unmit. Risk Register'!H57=\"\",\"\",'5 - Unmit. Risk Register'!H57)","v":0},{"$f":"IF('5 - Unmit. Risk Register'!I57=\"\",\"\",'5 - Unmit. Risk Register'!I57)","v":0},{"$f":"IF('5 - Unmit. Risk Register'!J57=\"\",\"\",'5 - Unmit. Risk Register'!J57)","v":""}]
[null,null,null,null,null,null,null,null,null,null,null,null,null,null,null,null,null,null,null,null,null,null,null,null,null,null,null,null,null,null,null,null,null,null,null,null,null,null,null,null,null,null,null,null,null,{"$f":"IF('5 - Unmit. Risk Register'!A58=\"\",\"\",'5 - Unmit. Risk Register'!A58)","v":"PR-7"},{"$f":"IF('5 - Unmit. Risk Register'!B58=\"\",\"\",'5 - Unmit. Risk Register'!B58)","v":"Issues with D/B design or submittals"},null,null,{"$f":"IF('5 - Unmit. Risk Register'!C58=\"\",\"\",'5 - Unmit. Risk Register'!C58)","v":"No Impact"},{"$f":"IF('5 - Unmit. Risk Register'!H58=\"\",\"\",'5 - Unmit. Risk Register'!H58)","v":0},{"$f":"IF('5 - Unmit. Risk Register'!I58=\"\",\"\",'5 - Unmit. Risk Register'!I58)","v":0},{"$f":"IF('5 - Unmit. Risk Register'!J58=\"\",\"\",'5 - Unmit. Risk Register'!J58)","v":""}]
[null,null,null,null,null,null,null,null,null,null,null,null,null,null,null,null,null,null,null,null,null,null,null,null,null,null,null,null,null,null,null,null,null,null,null,null,null,null,null,null,null,null,null,null,null,{"$f":"IF('5 - Unmit. Risk Register'!A59=\"\",\"\",'5 - Unmit. Risk Register'!A59)","v":"CR-6"},{"$f":"IF('5 - Unmit. Risk Register'!B59=\"\",\"\",'5 - Unmit. Risk Register'!B59)","v":"Severe weather event significantly impacts construction"},null,null,{"$f":"IF('5 - Unmit. Risk Register'!C59=\"\",\"\",'5 - Unmit. Risk Register'!C59)","v":"No Impact"},{"$f":"IF('5 - Unmit. Risk Register'!H59=\"\",\"\",'5 - Unmit. Risk Register'!H59)","v":0},{"$f":"IF('5 - Unmit. Risk Register'!I59=\"\",\"\",'5 - Unmit. Risk Register'!I59)","v":0},{"$f":"IF('5 - Unmit. Risk Register'!J59=\"\",\"\",'5 - Unmit. Risk Register'!J59)","v":""}]
[null,null,null,null,null,null,null,null,null,null,null,null,null,null,null,null,null,null,null,null,null,null,null,null,null,null,null,null,null,null,null,null,null,null,null,null,null,null,null,null,null,null,null,null,null,{"$f":"IF('5 - Unmit. Risk Register'!A60=\"\",\"\",'5 - Unmit. Risk Register'!A60)","v":"CR-8"},{"$f":"IF('5 - Unmit. Risk Register'!B60=\"\",\"\",'5 - Unmit. Risk Register'!B60)","v":"Significant accident during construction"},null,null,{"$f":"IF('5 - Unmit. Risk Register'!C60=\"\",\"\",'5 - Unmit. Risk Register'!C60)","v":"No Impact"},{"$f":"IF('5 - Unmit. Risk Register'!H60=\"\",\"\",'5 - Unmit. Risk Register'!H60)","v":0},{"$f":"IF('5 - Unmit. Risk Register'!I60=\"\",\"\",'5 - Unmit. Risk Register'!I60)","v":0},{"$f":"IF('5 - Unmit. Risk Register'!J60=\"\",\"\",'5 - Unmit. Risk Register'!J60)","v":""}]
[null,null,null,null,null,null,null,null,null,null,null,null,null,null,null,null,null,null,null,null,null,null,null,null,null,null,null,null,null,null,null,null,null,null,null,null,null,null,null,null,null,null,null,null,null,{"$f":"IF('5 - Unmit. Risk Register'!A61=\"\",\"\",'5 - Unmit. Risk Register'!A61)","v":"CR-10"},{"$f":"IF('5 - Unmit. Risk Register'!B61=\"\",\"\",'5 - Unmit. Risk Register'!B61)","v":"Fish window in Wandering Creek"},null,null,{"$f":"IF('5 - Unmit. Risk Register'!C61=\"\",\"\",'5 - Unmit. Risk Register'!C61)","v":"No Impact"},{"$f":"IF('5 - Unmit. Risk Register'!H61=\"\",\"\",'5 - Unmit. Risk Register'!H61)","v":0},{"$f":"IF('5 - Unmit. Risk Register'!I61=\"\",\"\",'5 - Unmit. Risk Register'!I61)","v":0},{"$f":"IF('5 - Unmit. Risk Register'!J61=\"\",\"\",'5 - Unmit. Risk Register'!J61)","v":""}]
[null,null,null,null,null,null,null,null,null,null,null,null,null,null,null,null,null,null,null,null,null,null,null,null,null,null,null,null,null,null,null,null,null,null,null,null,null,null,null,null,null,null,null,null,null,{"$f":"IF('5 - Unmit. Risk Register'!A62=\"\",\"\",'5 - Unmit. Risk Register'!A62)","v":"CR-11"},{"$f":"IF('5 - Unmit. Risk Register'!B62=\"\",\"\",'5 - Unmit. Risk Register'!B62)","v":"Non-compliance with permits during construction"},null,null,{"$f":"IF('5 - Unmit. Risk Register'!C62=\"\",\"\",'5 - Unmit. Risk Register'!C62)","v":"No Impact"},{"$f":"IF('5 - Unmit. Risk Register'!H62=\"\",\"\",'5 - Unmit. Risk Register'!H62)","v":0},{"$f":"IF('5 - Unmit. Risk Register'!I62=\"\",\"\",'5 - Unmit. Risk Register'!I62)","v":0},{"$f":"IF('5 - Unmit. Risk Register'!J62=\"\",\"\",'5 - Unmit. Risk Register'!J62)","v":""}]
[null,null,null,null,null,null,null,null,null,null,null,null,null,null,null,null,null,null,null,null,null,null,null,null,null,null,null,null,null,null,null,null,null,null,null,null,null,null,null,null,null,null,null,null,null,{"$f":"IF('5 - Unmit. Risk Register'!A63=\"\",\"\",'5 - Unmit. Risk Register'!A63)","v":"CR-12"},{"$f":"IF('5 - Unmit. Risk Register'!B63=\"\",\"\",'5 - Unmit. Risk Register'!B63)","v":"Extended overheads as a function of project delays"},null,null,{"$f":"IF('5 - Unmit. Risk Register'!C63=\"\",\"\",'5 - Unmit. Risk Register'!C63)","v":"No Impact"},{"$f":"IF('5 - Unmit. Risk Register'!H63=\"\",\"\",'5 - Unmit. Risk Register'!H63)","v":0},{"$f":"IF('5 - Unmit. Risk Register'!I63=\"\",\"\",'5 - Unmit. Risk Register'!I63)","v":0},{"$f":"IF('5 - Unmit. Risk Register'!J63=\"\",\"\",'5 - Unmit. Risk Register'!J63)","v":""}]
[null,null,null,null,null,null,null,null,null,null,null,null,null,null,null,null,null,null,null,null,null,null,null,null,null,null,null,null,null,null,null,null,null,null,null,null,null,null,null,null,null,null,null,null,null,{"$f":"IF('5 - Unmit. Risk Register'!A64=\"\",\"\",'5 - Unmit. Risk Register'!A64)","v":""},{"$f":"IF('5 - Unmit. Risk Register'!B64=\"\",\"\",'5 - Unmit. Risk Register'!B64)","v":""},null,null,{"$f":"IF('5 - Unmit. Risk Register'!C64=\"\",\"\",'5 - Unmit. Risk Register'!C64)","v":""},{"$f":"IF('5 - Unmit. Risk Register'!H64=\"\",\"\",'5 - Unmit. Risk Register'!H64)","v":""},{"$f":"IF('5 - Unmit. Risk Register'!I64=\"\",\"\",'5 - Unmit. Risk Register'!I64)","v":""},{"$f":"IF('5 - Unmit. Risk Register'!J64=\"\",\"\",'5 - Unmit. Risk Register'!J64)","v":""}]
[null,null,null,null,null,null,null,null,null,null,null,null,null,null,null,null,null,null,null,null,null,null,null,null,null,null,null,null,null,null,null,null,null,null,null,null,null,null,null,null,null,null,null,null,null,{"$f":"IF('5 - Unmit. Risk Register'!A65=\"\",\"\",'5 - Unmit. Risk Register'!A65)","v":""},{"$f":"IF('5 - Unmit. Risk Register'!B65=\"\",\"\",'5 - Unmit. Risk Register'!B65)","v":""},null,null,{"$f":"IF('5 - Unmit. Risk Register'!C65=\"\",\"\",'5 - Unmit. Risk Register'!C65)","v":""},{"$f":"IF('5 - Unmit. Risk Register'!H65=\"\",\"\",'5 - Unmit. Risk Register'!H65)","v":""},{"$f":"IF('5 - Unmit. Risk Register'!I65=\"\",\"\",'5 - Unmit. Risk Register'!I65)","v":""},{"$f":"IF('5 - Unmit. Risk Register'!J65=\"\",\"\",'5 - Unmit. Risk Register'!J65)","v":""}]
[null,null,null,null,null,null,null,null,null,null,null,null,null,null,null,null,null,null,null,null,null,null,null,null,null,null,null,null,null,null,null,null,null,null,null,null,null,null,null,null,null,null,null,null,null,{"$f":"IF('5 - Unmit. Risk Register'!A66=\"\",\"\",'5 - Unmit. Risk Register'!A66)","v":""},{"$f":"IF('5 - Unmit. Risk Register'!B66=\"\",\"\",'5 - Unmit. Risk Register'!B66)","v":""},null,null,{"$f":"IF('5 - Unmit. Risk Register'!C66=\"\",\"\",'5 - Unmit. Risk Register'!C66)","v":""},{"$f":"IF('5 - Unmit. Risk Register'!H66=\"\",\"\",'5 - Unmit. Risk Register'!H66)","v":""},{"$f":"IF('5 - Unmit. Risk Register'!I66=\"\",\"\",'5 - Unmit. Risk Register'!I66)","v":""},{"$f":"IF('5 - Unmit. Risk Register'!J66=\"\",\"\",'5 - Unmit. Risk Register'!J66)","v":""}]
[null,null,null,null,null,null,null,null,null,null,null,null,null,null,null,null,null,null,null,null,null,null,null,null,null,null,null,null,null,null,null,null,null,null,null,null,null,null,null,null,null,null,null,null,null,{"$f":"IF('5 - Unmit. Risk Register'!A67=\"\",\"\",'5 - Unmit. Risk Register'!A67)","v":""},{"$f":"IF('5 - Unmit. Risk Register'!B67=\"\",\"\",'5 - Unmit. Risk Register'!B67)","v":""},null,null,{"$f":"IF('5 - Unmit. Risk Register'!C67=\"\",\"\",'5 - Unmit. Risk Register'!C67)","v":""},{"$f":"IF('5 - Unmit. Risk Register'!H67=\"\",\"\",'5 - Unmit. Risk Register'!H67)","v":""},{"$f":"IF('5 - Unmit. Risk Register'!I67=\"\",\"\",'5 - Unmit. Risk Register'!I67)","v":""},{"$f":"IF('5 - Unmit. Risk Register'!J67=\"\",\"\",'5 - Unmit. Risk Register'!J67)","v":""}]
[null,null,null,null,null,null,null,null,null,null,null,null,null,null,null,null,null,null,null,null,null,null,null,null,null,null,null,null,null,null,null,null,null,null,null,null,null,null,null,null,null,null,null,null,null,{"$f":"IF('5 - Unmit. Risk Register'!A68=\"\",\"\",'5 - Unmit. Risk Register'!A68)","v":""},{"$f":"IF('5 - Unmit. Risk Register'!B68=\"\",\"\",'5 - Unmit. Risk Register'!B68)","v":""},null,null,{"$f":"IF('5 - Unmit. Risk Register'!C68=\"\",\"\",'5 - Unmit. Risk Register'!C68)","v":""},{"$f":"IF('5 - Unmit. Risk Register'!H68=\"\",\"\",'5 - Unmit. Risk Register'!H68)","v":""},{"$f":"IF('5 - Unmit. Risk Register'!I68=\"\",\"\",'5 - Unmit. Risk Register'!I68)","v":""},{"$f":"IF('5 - Unmit. Risk Register'!J68=\"\",\"\",'5 - Unmit. Risk Register'!J68)","v":""}]
[null,null,null,null,null,null,null,null,null,null,null,null,null,null,null,null,null,null,null,null,null,null,null,null,null,null,null,null,null,null,null,null,null,null,null,null,null,null,null,null,null,null,null,null,null,{"$f":"IF('5 - Unmit. Risk Register'!A69=\"\",\"\",'5 - Unmit. Risk Register'!A69)","v":""},{"$f":"IF('5 - Unmit. Risk Register'!B69=\"\",\"\",'5 - Unmit. Risk Register'!B69)","v":""},null,null,{"$f":"IF('5 - Unmit. Risk Register'!C69=\"\",\"\",'5 - Unmit. Risk Register'!C69)","v":""},{"$f":"IF('5 - Unmit. Risk Register'!H69=\"\",\"\",'5 - Unmit. Risk Register'!H69)","v":""},{"$f":"IF('5 - Unmit. Risk Register'!I69=\"\",\"\",'5 - Unmit. Risk Register'!I69)","v":""},{"$f":"IF('5 - Unmit. Risk Register'!J69=\"\",\"\",'5 - Unmit. Risk Register'!J69)","v":""}]
[null,null,null,null,null,null,null,null,null,null,null,null,null,null,null,null,null,null,null,null,null,null,null,null,null,null,null,null,null,null,null,null,null,null,null,null,null,null,null,null,null,null,null,null,null,{"$f":"IF('5 - Unmit. Risk Register'!A70=\"\",\"\",'5 - Unmit. Risk Register'!A70)","v":""},{"$f":"IF('5 - Unmit. Risk Register'!B70=\"\",\"\",'5 - Unmit. Risk Register'!B70)","v":""},null,null,{"$f":"IF('5 - Unmit. Risk Register'!C70=\"\",\"\",'5 - Unmit. Risk Register'!C70)","v":""},{"$f":"IF('5 - Unmit. Risk Register'!H70=\"\",\"\",'5 - Unmit. Risk Register'!H70)","v":""},{"$f":"IF('5 - Unmit. Risk Register'!I70=\"\",\"\",'5 - Unmit. Risk Register'!I70)","v":""},{"$f":"IF('5 - Unmit. Risk Register'!J70=\"\",\"\",'5 - Unmit. Risk Register'!J70)","v":""}]
[null,null,null,null,null,null,null,null,null,null,null,null,null,null,null,null,null,null,null,null,null,null,null,null,null,null,null,null,null,null,null,null,null,null,null,null,null,null,null,null,null,null,null,null,null,{"$f":"IF('5 - Unmit. Risk Register'!A71=\"\",\"\",'5 - Unmit. Risk Register'!A71)","v":""},{"$f":"IF('5 - Unmit. Risk Register'!B71=\"\",\"\",'5 - Unmit. Risk Register'!B71)","v":""},null,null,{"$f":"IF('5 - Unmit. Risk Register'!C71=\"\",\"\",'5 - Unmit. Risk Register'!C71)","v":""},{"$f":"IF('5 - Unmit. Risk Register'!H71=\"\",\"\",'5 - Unmit. Risk Register'!H71)","v":""},{"$f":"IF('5 - Unmit. Risk Register'!I71=\"\",\"\",'5 - Unmit. Risk Register'!I71)","v":""},{"$f":"IF('5 - Unmit. Risk Register'!J71=\"\",\"\",'5 - Unmit. Risk Register'!J71)","v":""}]
[null,null,null,null,null,null,null,null,null,null,null,null,null,null,null,null,null,null,null,null,null,null,null,null,null,null,null,null,null,null,null,null,null,null,null,null,null,null,null,null,null,null,null,null,null,{"$f":"IF('5 - Unmit. Risk Register'!A72=\"\",\"\",'5 - Unmit. Risk Register'!A72)","v":""},{"$f":"IF('5 - Unmit. Risk Register'!B72=\"\",\"\",'5 - Unmit. Risk Register'!B72)","v":""},null,null,{"$f":"IF('5 - Unmit. Risk Register'!C72=\"\",\"\",'5 - Unmit. Risk Register'!C72)","v":""},{"$f":"IF('5 - Unmit. Risk Register'!H72=\"\",\"\",'5 - Unmit. Risk Register'!H72)","v":""},{"$f":"IF('5 - Unmit. Risk Register'!I72=\"\",\"\",'5 - Unmit. Risk Register'!I72)","v":""},{"$f":"IF('5 - Unmit. Risk Register'!J72=\"\",\"\",'5 - Unmit. Risk Register'!J72)","v":""}]
[null,null,null,null,null,null,null,null,null,null,null,null,null,null,null,null,null,null,null,null,null,null,null,null,null,null,null,null,null,null,null,null,null,null,null,null,null,null,null,null,null,null,null,null,null,{"$f":"IF('5 - Unmit. Risk Register'!A73=\"\",\"\",'5 - Unmit. Risk Register'!A73)","v":""},{"$f":"IF('5 - Unmit. Risk Register'!B73=\"\",\"\",'5 - Unmit. Risk Register'!B73)","v":""},null,null,{"$f":"IF('5 - Unmit. Risk Register'!C73=\"\",\"\",'5 - Unmit. Risk Register'!C73)","v":""},{"$f":"IF('5 - Unmit. Risk Register'!H73=\"\",\"\",'5 - Unmit. Risk Register'!H73)","v":""},{"$f":"IF('5 - Unmit. Risk Register'!I73=\"\",\"\",'5 - Unmit. Risk Register'!I73)","v":""},{"$f":"IF('5 - Unmit. Risk Register'!J73=\"\",\"\",'5 - Unmit. Risk Register'!J73)","v":""}]
[null,null,null,null,null,null,null,null,null,null,null,null,null,null,null,null,null,null,null,null,null,null,null,null,null,null,null,null,null,null,null,null,null,null,null,null,null,null,null,null,null,null,null,null,null,{"$f":"IF('5 - Unmit. Risk Register'!A74=\"\",\"\",'5 - Unmit. Risk Register'!A74)","v":""},{"$f":"IF('5 - Unmit. Risk Register'!B74=\"\",\"\",'5 - Unmit. Risk Register'!B74)","v":""},null,null,{"$f":"IF('5 - Unmit. Risk Register'!C74=\"\",\"\",'5 - Unmit. Risk Register'!C74)","v":""},{"$f":"IF('5 - Unmit. Risk Register'!H74=\"\",\"\",'5 - Unmit. Risk Register'!H74)","v":""},{"$f":"IF('5 - Unmit. Risk Register'!I74=\"\",\"\",'5 - Unmit. Risk Register'!I74)","v":""},{"$f":"IF('5 - Unmit. Risk Register'!J74=\"\",\"\",'5 - Unmit. Risk Register'!J74)","v":""}]
[null,null,null,null,null,null,null,null,null,null,null,null,null,null,null,null,null,null,null,null,null,null,null,null,null,null,null,null,null,null,null,null,null,null,null,null,null,null,null,null,null,null,null,null,null,{"$f":"IF('5 - Unmit. Risk Register'!A75=\"\",\"\",'5 - Unmit. Risk Register'!A75)","v":""},{"$f":"IF('5 - Unmit. Risk Register'!B75=\"\",\"\",'5 - Unmit. Risk Register'!B75)","v":""},null,null,{"$f":"IF('5 - Unmit. Risk Register'!C75=\"\",\"\",'5 - Unmit. Risk Register'!C75)","v":""},{"$f":"IF('5 - Unmit. Risk Register'!H75=\"\",\"\",'5 - Unmit. Risk Register'!H75)","v":""},{"$f":"IF('5 - Unmit. Risk Register'!I75=\"\",\"\",'5 - Unmit. Risk Register'!I75)","v":""},{"$f":"IF('5 - Unmit. Risk Register'!J75=\"\",\"\",'5 - Unmit. Risk Register'!J75)","v":""}]
[null,null,null,null,null,null,null,null,null,null,null,null,null,null,null,null,null,null,null,null,null,null,null,null,null,null,null,null,null,null,null,null,null,null,null,null,null,null,null,null,null,null,null,null,null,{"$f":"IF('5 - Unmit. Risk Register'!A76=\"\",\"\",'5 - Unmit. Risk Register'!A76)","v":""},{"$f":"IF('5 - Unmit. Risk Register'!B76=\"\",\"\",'5 - Unmit. Risk Register'!B76)","v":""},null,null,{"$f":"IF('5 - Unmit. Risk Register'!C76=\"\",\"\",'5 - Unmit. Risk Register'!C76)","v":""},{"$f":"IF('5 - Unmit. Risk Register'!H76=\"\",\"\",'5 - Unmit. Risk Register'!H76)","v":""},{"$f":"IF('5 - Unmit. Risk Register'!I76=\"\",\"\",'5 - Unmit. Risk Register'!I76)","v":""},{"$f":"IF('5 - Unmit. Risk Register'!J76=\"\",\"\",'5 - Unmit. Risk Register'!J76)","v":""}]
[null,null,null,null,null,null,null,null,null,null,null,null,null,null,null,null,null,null,null,null,null,null,null,null,null,null,null,null,null,null,null,null,null,null,null,null,null,null,null,null,null,null,null,null,null,{"$f":"IF('5 - Unmit. Risk Register'!A77=\"\",\"\",'5 - Unmit. Risk Register'!A77)","v":""},{"$f":"IF('5 - Unmit. Risk Register'!B77=\"\",\"\",'5 - Unmit. Risk Register'!B77)","v":""},null,null,{"$f":"IF('5 - Unmit. Risk Register'!C77=\"\",\"\",'5 - Unmit. Risk Register'!C77)","v":""},{"$f":"IF('5 - Unmit. Risk Register'!H77=\"\",\"\",'5 - Unmit. Risk Register'!H77)","v":""},{"$f":"IF('5 - Unmit. Risk Register'!I77=\"\",\"\",'5 - Unmit. Risk Register'!I77)","v":""},{"$f":"IF('5 - Unmit. Risk Register'!J77=\"\",\"\",'5 - Unmit. Risk Register'!J77)","v":""}]
[null,null,null,null,null,null,null,null,null,null,null,null,null,null,null,null,null,null,null,null,null,null,null,null,null,null,null,null,null,null,null,null,null,null,null,null,null,null,null,null,null,null,null,null,null,{"$f":"IF('5 - Unmit. Risk Register'!A78=\"\",\"\",'5 - Unmit. Risk Register'!A78)","v":""},{"$f":"IF('5 - Unmit. Risk Register'!B78=\"\",\"\",'5 - Unmit. Risk Register'!B78)","v":""},null,null,{"$f":"IF('5 - Unmit. Risk Register'!C78=\"\",\"\",'5 - Unmit. Risk Register'!C78)","v":""},{"$f":"IF('5 - Unmit. Risk Register'!H78=\"\",\"\",'5 - Unmit. Risk Register'!H78)","v":""},{"$f":"IF('5 - Unmit. Risk Register'!I78=\"\",\"\",'5 - Unmit. Risk Register'!I78)","v":""},{"$f":"IF('5 - Unmit. Risk Register'!J78=\"\",\"\",'5 - Unmit. Risk Register'!J78)","v":""}]
[null,null,null,null,null,null,null,null,null,null,null,null,null,null,null,null,null,null,null,null,null,null,null,null,null,null,null,null,null,null,null,null,null,null,null,null,null,null,null,null,null,null,null,null,null,{"$f":"IF('5 - Unmit. Risk Register'!A79=\"\",\"\",'5 - Unmit. Risk Register'!A79)","v":""},{"$f":"IF('5 - Unmit. Risk Register'!B79=\"\",\"\",'5 - Unmit. Risk Register'!B79)","v":""},null,null,{"$f":"IF('5 - Unmit. Risk Register'!C79=\"\",\"\",'5 - Unmit. Risk Register'!C79)","v":""},{"$f":"IF('5 - Unmit. Risk Register'!H79=\"\",\"\",'5 - Unmit. Risk Register'!H79)","v":""},{"$f":"IF('5 - Unmit. Risk Register'!I79=\"\",\"\",'5 - Unmit. Risk Register'!I79)","v":""},{"$f":"IF('5 - Unmit. Risk Register'!J79=\"\",\"\",'5 - Unmit. Risk Register'!J79)","v":""}]
[null,null,null,null,null,null,null,null,null,null,null,null,null,null,null,null,null,null,null,null,null,null,null,null,null,null,null,null,null,null,null,null,null,null,null,null,null,null,null,null,null,null,null,null,null,{"$f":"IF('5 - Unmit. Risk Register'!A80=\"\",\"\",'5 - Unmit. Risk Register'!A80)","v":""},{"$f":"IF('5 - Unmit. Risk Register'!B80=\"\",\"\",'5 - Unmit. Risk Register'!B80)","v":""},null,null,{"$f":"IF('5 - Unmit. Risk Register'!C80=\"\",\"\",'5 - Unmit. Risk Register'!C80)","v":""},{"$f":"IF('5 - Unmit. Risk Register'!H80=\"\",\"\",'5 - Unmit. Risk Register'!H80)","v":""},{"$f":"IF('5 - Unmit. Risk Register'!I80=\"\",\"\",'5 - Unmit. Risk Register'!I80)","v":""},{"$f":"IF('5 - Unmit. Risk Register'!J80=\"\",\"\",'5 - Unmit. Risk Register'!J80)","v":""}]
[null,null,null,null,null,null,null,null,null,null,null,null,null,null,null,null,null,null,null,null,null,null,null,null,null,null,null,null,null,null,null,null,null,null,null,null,null,null,null,null,null,null,null,null,null,{"$f":"IF('5 - Unmit. Risk Register'!A81=\"\",\"\",'5 - Unmit. Risk Register'!A81)","v":""},{"$f":"IF('5 - Unmit. Risk Register'!B81=\"\",\"\",'5 - Unmit. Risk Register'!B81)","v":""},null,null,{"$f":"IF('5 - Unmit. Risk Register'!C81=\"\",\"\",'5 - Unmit. Risk Register'!C81)","v":""},{"$f":"IF('5 - Unmit. Risk Register'!H81=\"\",\"\",'5 - Unmit. Risk Register'!H81)","v":""},{"$f":"IF('5 - Unmit. Risk Register'!I81=\"\",\"\",'5 - Unmit. Risk Register'!I81)","v":""},{"$f":"IF('5 - Unmit. Risk Register'!J81=\"\",\"\",'5 - Unmit. Risk Register'!J81)","v":""}]
[null,null,null,null,null,null,null,null,null,null,null,null,null,null,null,null,null,null,null,null,null,null,null,null,null,null,null,null,null,null,null,null,null,null,null,null,null,null,null,null,null,null,null,null,null,{"$f":"IF('5 - Unmit. Risk Register'!A82=\"\",\"\",'5 - Unmit. Risk Register'!A82)","v":""},{"$f":"IF('5 - Unmit. Risk Register'!B82=\"\",\"\",'5 - Unmit. Risk Register'!B82)","v":""},null,null,{"$f":"IF('5 - Unmit. Risk Register'!C82=\"\",\"\",'5 - Unmit. Risk Register'!C82)","v":""},{"$f":"IF('5 - Unmit. Risk Register'!H82=\"\",\"\",'5 - Unmit. Risk Register'!H82)","v":""},{"$f":"IF('5 - Unmit. Risk Register'!I82=\"\",\"\",'5 - Unmit. Risk Register'!I82)","v":""},{"$f":"IF('5 - Unmit. Risk Register'!J82=\"\",\"\",'5 - Unmit. Risk Register'!J82)","v":""}]
[null,null,null,null,null,null,null,null,null,null,null,null,null,null,null,null,null,null,null,null,null,null,null,null,null,null,null,null,null,null,null,null,null,null,null,null,null,null,null,null,null,null,null,null,null,{"$f":"IF('5 - Unmit. Risk Register'!A83=\"\",\"\",'5 - Unmit. Risk Register'!A83)","v":""},{"$f":"IF('5 - Unmit. Risk Register'!B83=\"\",\"\",'5 - Unmit. Risk Register'!B83)","v":""},null,null,{"$f":"IF('5 - Unmit. Risk Register'!C83=\"\",\"\",'5 - Unmit. Risk Register'!C83)","v":""},{"$f":"IF('5 - Unmit. Risk Register'!H83=\"\",\"\",'5 - Unmit. Risk Register'!H83)","v":""},{"$f":"IF('5 - Unmit. Risk Register'!I83=\"\",\"\",'5 - Unmit. Risk Register'!I83)","v":""},{"$f":"IF('5 - Unmit. Risk Register'!J83=\"\",\"\",'5 - Unmit. Risk Register'!J83)","v":""}]
[null,null,null,null,null,null,null,null,null,null,null,null,null,null,null,null,null,null,null,null,null,null,null,null,null,null,null,null,null,null,null,null,null,null,null,null,null,null,null,null,null,null,null,null,null,{"$f":"IF('5 - Unmit. Risk Register'!A84=\"\",\"\",'5 - Unmit. Risk Register'!A84)","v":""},{"$f":"IF('5 - Unmit. Risk Register'!B84=\"\",\"\",'5 - Unmit. Risk Register'!B84)","v":""},null,null,{"$f":"IF('5 - Unmit. Risk Register'!C84=\"\",\"\",'5 - Unmit. Risk Register'!C84)","v":""},{"$f":"IF('5 - Unmit. Risk Register'!H84=\"\",\"\",'5 - Unmit. Risk Register'!H84)","v":""},{"$f":"IF('5 - Unmit. Risk Register'!I84=\"\",\"\",'5 - Unmit. Risk Register'!I84)","v":""},{"$f":"IF('5 - Unmit. Risk Register'!J84=\"\",\"\",'5 - Unmit. Risk Register'!J84)","v":""}]
[null,null,null,null,null,null,null,null,null,null,null,null,null,null,null,null,null,null,null,null,null,null,null,null,null,null,null,null,null,null,null,null,null,null,null,null,null,null,null,null,null,null,null,null,null,{"$f":"IF('5 - Unmit. Risk Register'!A85=\"\",\"\",'5 - Unmit. Risk Register'!A85)","v":""},{"$f":"IF('5 - Unmit. Risk Register'!B85=\"\",\"\",'5 - Unmit. Risk Register'!B85)","v":""},null,null,{"$f":"IF('5 - Unmit. Risk Register'!C85=\"\",\"\",'5 - Unmit. Risk Register'!C85)","v":""},{"$f":"IF('5 - Unmit. Risk Register'!H85=\"\",\"\",'5 - Unmit. Risk Register'!H85)","v":""},{"$f":"IF('5 - Unmit. Risk Register'!I85=\"\",\"\",'5 - Unmit. Risk Register'!I85)","v":""},{"$f":"IF('5 - Unmit. Risk Register'!J85=\"\",\"\",'5 - Unmit. Risk Register'!J85)","v":""}]
[null,null,null,null,null,null,null,null,null,null,null,null,null,null,null,null,null,null,null,null,null,null,null,null,null,null,null,null,null,null,null,null,null,null,null,null,null,null,null,null,null,null,null,null,null,{"$f":"IF('5 - Unmit. Risk Register'!A86=\"\",\"\",'5 - Unmit. Risk Register'!A86)","v":""},{"$f":"IF('5 - Unmit. Risk Register'!B86=\"\",\"\",'5 - Unmit. Risk Register'!B86)","v":""},null,null,{"$f":"IF('5 - Unmit. Risk Register'!C86=\"\",\"\",'5 - Unmit. Risk Register'!C86)","v":""},{"$f":"IF('5 - Unmit. Risk Register'!H86=\"\",\"\",'5 - Unmit. Risk Register'!H86)","v":""},{"$f":"IF('5 - Unmit. Risk Register'!I86=\"\",\"\",'5 - Unmit. Risk Register'!I86)","v":""},{"$f":"IF('5 - Unmit. Risk Register'!J86=\"\",\"\",'5 - Unmit. Risk Register'!J86)","v":""}]
[null,null,null,null,null,null,null,null,null,null,null,null,null,null,null,null,null,null,null,null,null,null,null,null,null,null,null,null,null,null,null,null,null,null,null,null,null,null,null,null,null,null,null,null,null,{"$f":"IF('5 - Unmit. Risk Register'!A87=\"\",\"\",'5 - Unmit. Risk Register'!A87)","v":""},{"$f":"IF('5 - Unmit. Risk Register'!B87=\"\",\"\",'5 - Unmit. Risk Register'!B87)","v":""},null,null,{"$f":"IF('5 - Unmit. Risk Register'!C87=\"\",\"\",'5 - Unmit. Risk Register'!C87)","v":""},{"$f":"IF('5 - Unmit. Risk Register'!H87=\"\",\"\",'5 - Unmit. Risk Register'!H87)","v":""},{"$f":"IF('5 - Unmit. Risk Register'!I87=\"\",\"\",'5 - Unmit. Risk Register'!I87)","v":""},{"$f":"IF('5 - Unmit. Risk Register'!J87=\"\",\"\",'5 - Unmit. Risk Register'!J87)","v":""}]
[null,null,null,null,null,null,null,null,null,null,null,null,null,null,null,null,null,null,null,null,null,null,null,null,null,null,null,null,null,null,null,null,null,null,null,null,null,null,null,null,null,null,null,null,null,{"$f":"IF('5 - Unmit. Risk Register'!A88=\"\",\"\",'5 - Unmit. Risk Register'!A88)","v":""},{"$f":"IF('5 - Unmit. Risk Register'!B88=\"\",\"\",'5 - Unmit. Risk Register'!B88)","v":""},null,null,{"$f":"IF('5 - Unmit. Risk Register'!C88=\"\",\"\",'5 - Unmit. Risk Register'!C88)","v":""},{"$f":"IF('5 - Unmit. Risk Register'!H88=\"\",\"\",'5 - Unmit. Risk Register'!H88)","v":""},{"$f":"IF('5 - Unmit. Risk Register'!I88=\"\",\"\",'5 - Unmit. Risk Register'!I88)","v":""},{"$f":"IF('5 - Unmit. Risk Register'!J88=\"\",\"\",'5 - Unmit. Risk Register'!J88)","v":""}]
[null,null,null,null,null,null,null,null,null,null,null,null,null,null,null,null,null,null,null,null,null,null,null,null,null,null,null,null,null,null,null,null,null,null,null,null,null,null,null,null,null,null,null,null,null,{"$f":"IF('5 - Unmit. Risk Register'!A89=\"\",\"\",'5 - Unmit. Risk Register'!A89)","v":""},{"$f":"IF('5 - Unmit. Risk Register'!B89=\"\",\"\",'5 - Unmit. Risk Register'!B89)","v":""},null,null,{"$f":"IF('5 - Unmit. Risk Register'!C89=\"\",\"\",'5 - Unmit. Risk Register'!C89)","v":""},{"$f":"IF('5 - Unmit. Risk Register'!H89=\"\",\"\",'5 - Unmit. Risk Register'!H89)","v":""},{"$f":"IF('5 - Unmit. Risk Register'!I89=\"\",\"\",'5 - Unmit. Risk Register'!I89)","v":""},{"$f":"IF('5 - Unmit. Risk Register'!J89=\"\",\"\",'5 - Unmit. Risk Register'!J89)","v":""}]
[null,null,null,null,null,null,null,null,null,null,null,null,null,null,null,null,null,null,null,null,null,null,null,null,null,null,null,null,null,null,null,null,null,null,null,null,null,null,null,null,null,null,null,null,null,{"$f":"IF('5 - Unmit. Risk Register'!A90=\"\",\"\",'5 - Unmit. Risk Register'!A90)","v":""},{"$f":"IF('5 - Unmit. Risk Register'!B90=\"\",\"\",'5 - Unmit. Risk Register'!B90)","v":""},null,null,{"$f":"IF('5 - Unmit. Risk Register'!C90=\"\",\"\",'5 - Unmit. Risk Register'!C90)","v":""},{"$f":"IF('5 - Unmit. Risk Register'!H90=\"\",\"\",'5 - Unmit. Risk Register'!H90)","v":""},{"$f":"IF('5 - Unmit. Risk Register'!I90=\"\",\"\",'5 - Unmit. Risk Register'!I90)","v":""},{"$f":"IF('5 - Unmit. Risk Register'!J90=\"\",\"\",'5 - Unmit. Risk Register'!J90)","v":""}]
[null,null,null,null,null,null,null,null,null,null,null,null,null,null,null,null,null,null,null,null,null,null,null,null,null,null,null,null,null,null,null,null,null,null,null,null,null,null,null,null,null,null,null,null,null,{"$f":"IF('5 - Unmit. Risk Register'!A91=\"\",\"\",'5 - Unmit. Risk Register'!A91)","v":""},{"$f":"IF('5 - Unmit. Risk Register'!B91=\"\",\"\",'5 - Unmit. Risk Register'!B91)","v":""},null,null,{"$f":"IF('5 - Unmit. Risk Register'!C91=\"\",\"\",'5 - Unmit. Risk Register'!C91)","v":""},{"$f":"IF('5 - Unmit. Risk Register'!H91=\"\",\"\",'5 - Unmit. Risk Register'!H91)","v":""},{"$f":"IF('5 - Unmit. Risk Register'!I91=\"\",\"\",'5 - Unmit. Risk Register'!I91)","v":""},{"$f":"IF('5 - Unmit. Risk Register'!J91=\"\",\"\",'5 - Unmit. Risk Register'!J91)","v":""}]
[null,null,null,null,null,null,null,null,null,null,null,null,null,null,null,null,null,null,null,null,null,null,null,null,null,null,null,null,null,null,null,null,null,null,null,null,null,null,null,null,null,null,null,null,null,{"$f":"IF('5 - Unmit. Risk Register'!A92=\"\",\"\",'5 - Unmit. Risk Register'!A92)","v":""},{"$f":"IF('5 - Unmit. Risk Register'!B92=\"\",\"\",'5 - Unmit. Risk Register'!B92)","v":""},null,null,{"$f":"IF('5 - Unmit. Risk Register'!C92=\"\",\"\",'5 - Unmit. Risk Register'!C92)","v":""},{"$f":"IF('5 - Unmit. Risk Register'!H92=\"\",\"\",'5 - Unmit. Risk Register'!H92)","v":""},{"$f":"IF('5 - Unmit. Risk Register'!I92=\"\",\"\",'5 - Unmit. Risk Register'!I92)","v":""},{"$f":"IF('5 - Unmit. Risk Register'!J92=\"\",\"\",'5 - Unmit. Risk Register'!J92)","v":""}]
[null,null,null,null,null,null,null,null,null,null,null,null,null,null,null,null,null,null,null,null,null,null,null,null,null,null,null,null,null,null,null,null,null,null,null,null,null,null,null,null,null,null,null,null,null,{"$f":"IF('5 - Unmit. Risk Register'!A93=\"\",\"\",'5 - Unmit. Risk Register'!A93)","v":""},{"$f":"IF('5 - Unmit. Risk Register'!B93=\"\",\"\",'5 - Unmit. Risk Register'!B93)","v":""},null,null,{"$f":"IF('5 - Unmit. Risk Register'!C93=\"\",\"\",'5 - Unmit. Risk Register'!C93)","v":""},{"$f":"IF('5 - Unmit. Risk Register'!H93=\"\",\"\",'5 - Unmit. Risk Register'!H93)","v":""},{"$f":"IF('5 - Unmit. Risk Register'!I93=\"\",\"\",'5 - Unmit. Risk Register'!I93)","v":""},{"$f":"IF('5 - Unmit. Risk Register'!J93=\"\",\"\",'5 - Unmit. Risk Register'!J93)","v":""}]
[null,null,null,null,null,null,null,null,null,null,null,null,null,null,null,null,null,null,null,null,null,null,null,null,null,null,null,null,null,null,null,null,null,null,null,null,null,null,null,null,null,null,null,null,null,{"$f":"IF('5 - Unmit. Risk Register'!A94=\"\",\"\",'5 - Unmit. Risk Register'!A94)","v":""},{"$f":"IF('5 - Unmit. Risk Register'!B94=\"\",\"\",'5 - Unmit. Risk Register'!B94)","v":""},null,null,{"$f":"IF('5 - Unmit. Risk Register'!C94=\"\",\"\",'5 - Unmit. Risk Register'!C94)","v":""},{"$f":"IF('5 - Unmit. Risk Register'!H94=\"\",\"\",'5 - Unmit. Risk Register'!H94)","v":""},{"$f":"IF('5 - Unmit. Risk Register'!I94=\"\",\"\",'5 - Unmit. Risk Register'!I94)","v":""},{"$f":"IF('5 - Unmit. Risk Register'!J94=\"\",\"\",'5 - Unmit. Risk Register'!J94)","v":""}]
[null,null,null,null,null,null,null,null,null,null,null,null,null,null,null,null,null,null,null,null,null,null,null,null,null,null,null,null,null,null,null,null,null,null,null,null,null,null,null,null,null,null,null,null,null,{"$f":"IF('5 - Unmit. Risk Register'!A95=\"\",\"\",'5 - Unmit. Risk Register'!A95)","v":""},{"$f":"IF('5 - Unmit. Risk Register'!B95=\"\",\"\",'5 - Unmit. Risk Register'!B95)","v":""},null,null,{"$f":"IF('5 - Unmit. Risk Register'!C95=\"\",\"\",'5 - Unmit. Risk Register'!C95)","v":""},{"$f":"IF('5 - Unmit. Risk Register'!H95=\"\",\"\",'5 - Unmit. Risk Register'!H95)","v":""},{"$f":"IF('5 - Unmit. Risk Register'!I95=\"\",\"\",'5 - Unmit. Risk Register'!I95)","v":""},{"$f":"IF('5 - Unmit. Risk Register'!J95=\"\",\"\",'5 - Unmit. Risk Register'!J95)","v":""}]
[null,null,null,null,null,null,null,null,null,null,null,null,null,null,null,null,null,null,null,null,null,null,null,null,null,null,null,null,null,null,null,null,null,null,null,null,null,null,null,null,null,null,null,null,null,{"$f":"IF('5 - Unmit. Risk Register'!A96=\"\",\"\",'5 - Unmit. Risk Register'!A96)","v":""},{"$f":"IF('5 - Unmit. Risk Register'!B96=\"\",\"\",'5 - Unmit. Risk Register'!B96)","v":""},null,null,{"$f":"IF('5 - Unmit. Risk Register'!C96=\"\",\"\",'5 - Unmit. Risk Register'!C96)","v":""},{"$f":"IF('5 - Unmit. Risk Register'!H96=\"\",\"\",'5 - Unmit. Risk Register'!H96)","v":""},{"$f":"IF('5 - Unmit. Risk Register'!I96=\"\",\"\",'5 - Unmit. Risk Register'!I96)","v":""},{"$f":"IF('5 - Unmit. Risk Register'!J96=\"\",\"\",'5 - Unmit. Risk Register'!J96)","v":""}]
[null,null,null,null,null,null,null,null,null,null,null,null,null,null,null,null,null,null,null,null,null,null,null,null,null,null,null,null,null,null,null,null,null,null,null,null,null,null,null,null,null,null,null,null,null,{"$f":"IF('5 - Unmit. Risk Register'!A97=\"\",\"\",'5 - Unmit. Risk Register'!A97)","v":""},{"$f":"IF('5 - Unmit. Risk Register'!B97=\"\",\"\",'5 - Unmit. Risk Register'!B97)","v":""},null,null,{"$f":"IF('5 - Unmit. Risk Register'!C97=\"\",\"\",'5 - Unmit. Risk Register'!C97)","v":""},{"$f":"IF('5 - Unmit. Risk Register'!H97=\"\",\"\",'5 - Unmit. Risk Register'!H97)","v":""},{"$f":"IF('5 - Unmit. Risk Register'!I97=\"\",\"\",'5 - Unmit. Risk Register'!I97)","v":""},{"$f":"IF('5 - Unmit. Risk Register'!J97=\"\",\"\",'5 - Unmit. Risk Register'!J97)","v":""}]
[null,null,null,null,null,null,null,null,null,null,null,null,null,null,null,null,null,null,null,null,null,null,null,null,null,null,null,null,null,null,null,null,null,null,null,null,null,null,null,null,null,null,null,null,null,{"$f":"IF('5 - Unmit. Risk Register'!A98=\"\",\"\",'5 - Unmit. Risk Register'!A98)","v":""},{"$f":"IF('5 - Unmit. Risk Register'!B98=\"\",\"\",'5 - Unmit. Risk Register'!B98)","v":""},null,null,{"$f":"IF('5 - Unmit. Risk Register'!C98=\"\",\"\",'5 - Unmit. Risk Register'!C98)","v":""},{"$f":"IF('5 - Unmit. Risk Register'!H98=\"\",\"\",'5 - Unmit. Risk Register'!H98)","v":""},{"$f":"IF('5 - Unmit. Risk Register'!I98=\"\",\"\",'5 - Unmit. Risk Register'!I98)","v":""},{"$f":"IF('5 - Unmit. Risk Register'!J98=\"\",\"\",'5 - Unmit. Risk Register'!J98)","v":""}]
[null,null,null,null,null,null,null,null,null,null,null,null,null,null,null,null,null,null,null,null,null,null,null,null,null,null,null,null,null,null,null,null,null,null,null,null,null,null,null,null,null,null,null,null,null,{"$f":"IF('5 - Unmit. Risk Register'!A99=\"\",\"\",'5 - Unmit. Risk Register'!A99)","v":""},{"$f":"IF('5 - Unmit. Risk Register'!B99=\"\",\"\",'5 - Unmit. Risk Register'!B99)","v":""},null,null,{"$f":"IF('5 - Unmit. Risk Register'!C99=\"\",\"\",'5 - Unmit. Risk Register'!C99)","v":""},{"$f":"IF('5 - Unmit. Risk Register'!H99=\"\",\"\",'5 - Unmit. Risk Register'!H99)","v":""},{"$f":"IF('5 - Unmit. Risk Register'!I99=\"\",\"\",'5 - Unmit. Risk Register'!I99)","v":""},{"$f":"IF('5 - Unmit. Risk Register'!J99=\"\",\"\",'5 - Unmit. Risk Register'!J99)","v":""}]
[null,null,null,null,null,null,null,null,null,null,null,null,null,null,null,null,null,null,null,null,null,null,null,null,null,null,null,null,null,null,null,null,null,null,null,null,null,null,null,null,null,null,null,null,null,{"$f":"IF('5 - Unmit. Risk Register'!A100=\"\",\"\",'5 - Unmit. Risk Register'!A100)","v":""},{"$f":"IF('5 - Unmit. Risk Register'!B100=\"\",\"\",'5 - Unmit. Risk Register'!B100)","v":""},null,null,{"$f":"IF('5 - Unmit. Risk Register'!C100=\"\",\"\",'5 - Unmit. Risk Register'!C100)","v":""},{"$f":"IF('5 - Unmit. Risk Register'!H100=\"\",\"\",'5 - Unmit. Risk Register'!H100)","v":""},{"$f":"IF('5 - Unmit. Risk Register'!I100=\"\",\"\",'5 - Unmit. Risk Register'!I100)","v":""},{"$f":"IF('5 - Unmit. Risk Register'!J100=\"\",\"\",'5 - Unmit. Risk Register'!J100)","v":""}]
[null,null,null,null,null,null,null,null,null,null,null,null,null,null,null,null,null,null,null,null,null,null,null,null,null,null,null,null,null,null,null,null,null,null,null,null,null,null,null,null,null,null,null,null,null,{"$f":"IF('5 - Unmit. Risk Register'!A101=\"\",\"\",'5 - Unmit. Risk Register'!A101)","v":""},{"$f":"IF('5 - Unmit. Risk Register'!B101=\"\",\"\",'5 - Unmit. Risk Register'!B101)","v":""},null,null,{"$f":"IF('5 - Unmit. Risk Register'!C101=\"\",\"\",'5 - Unmit. Risk Register'!C101)","v":""},{"$f":"IF('5 - Unmit. Risk Register'!H101=\"\",\"\",'5 - Unmit. Risk Register'!H101)","v":""},{"$f":"IF('5 - Unmit. Risk Register'!I101=\"\",\"\",'5 - Unmit. Risk Register'!I101)","v":""},{"$f":"IF('5 - Unmit. Risk Register'!J101=\"\",\"\",'5 - Unmit. Risk Register'!J101)","v":""}]
[null,null,null,null,null,null,null,null,null,null,null,null,null,null,null,null,null,null,null,null,null,null,null,null,null,null,null,null,null,null,null,null,null,null,null,null,null,null,null,null,null,null,null,null,null,{"$f":"IF('5 - Unmit. Risk Register'!A102=\"\",\"\",'5 - Unmit. Risk Register'!A102)","v":""},{"$f":"IF('5 - Unmit. Risk Register'!B102=\"\",\"\",'5 - Unmit. Risk Register'!B102)","v":""},null,null,{"$f":"IF('5 - Unmit. Risk Register'!C102=\"\",\"\",'5 - Unmit. Risk Register'!C102)","v":""},{"$f":"IF('5 - Unmit. Risk Register'!H102=\"\",\"\",'5 - Unmit. Risk Register'!H102)","v":""},{"$f":"IF('5 - Unmit. Risk Register'!I102=\"\",\"\",'5 - Unmit. Risk Register'!I102)","v":""},{"$f":"IF('5 - Unmit. Risk Register'!J102=\"\",\"\",'5 - Unmit. Risk Register'!J102)","v":""}]
[null,null,null,null,null,null,null,null,null,null,null,null,null,null,null,null,null,null,null,null,null,null,null,null,null,null,null,null,null,null,null,null,null,null,null,null,null,null,null,null,null,null,null,null,null,{"$f":"IF('5 - Unmit. Risk Register'!A103=\"\",\"\",'5 - Unmit. Risk Register'!A103)","v":""},{"$f":"IF('5 - Unmit. Risk Register'!B103=\"\",\"\",'5 - Unmit. Risk Register'!B103)","v":""},null,null,{"$f":"IF('5 - Unmit. Risk Register'!C103=\"\",\"\",'5 - Unmit. Risk Register'!C103)","v":""},{"$f":"IF('5 - Unmit. Risk Register'!H103=\"\",\"\",'5 - Unmit. Risk Register'!H103)","v":""},{"$f":"IF('5 - Unmit. Risk Register'!I103=\"\",\"\",'5 - Unmit. Risk Register'!I103)","v":""},{"$f":"IF('5 - Unmit. Risk Register'!J103=\"\",\"\",'5 - Unmit. Risk Register'!J103)","v":""}]
[null,null,null,null,null,null,null,null,null,null,null,null,null,null,null,null,null,null,null,null,null,null,null,null,null,null,null,null,null,null,null,null,null,null,null,null,null,null,null,null,null,null,null,null,null,{"$f":"IF('5 - Unmit. Risk Register'!A104=\"\",\"\",'5 - Unmit. Risk Register'!A104)","v":""},{"$f":"IF('5 - Unmit. Risk Register'!B104=\"\",\"\",'5 - Unmit. Risk Register'!B104)","v":""},null,null,{"$f":"IF('5 - Unmit. Risk Register'!C104=\"\",\"\",'5 - Unmit. Risk Register'!C104)","v":""},{"$f":"IF('5 - Unmit. Risk Register'!H104=\"\",\"\",'5 - Unmit. Risk Register'!H104)","v":""},{"$f":"IF('5 - Unmit. Risk Register'!I104=\"\",\"\",'5 - Unmit. Risk Register'!I104)","v":""},{"$f":"IF('5 - Unmit. Risk Register'!J104=\"\",\"\",'5 - Unmit. Risk Register'!J104)","v":""}]
[]
[]
[null,null,null,null,null,null,null,null,null,null,null,null,null,null,null,null,null,null,null,null,null,null,null,null,null,null,null,null,null,null,null,null,null,null,null,null,null,null,null,null,null,null,null,null,null,"MITIGATED RISK REGISTER"]
[null,null,null,null,null,null,null,null,null,null,null,null,null,null,null,null,null,null,null,null,null,null,null,null,null,null,null,null,null,null,null,null,null,null,null,null,null,null,null,null,null,null,null,null,null,"Risk Label","Risk Description","Risk Type","Mean Severity Value       (YOE $M)","Mitigated Mean Severity Value       (YOE $M)","Percent Change in Mean Severity Value","Percent of Total Mitigated Severity Value","Mean Severity Ranking"]
[]
[]
[]
[]
[null,null,null,null,null,null,null,null,null,null,null,null,null,null,null,null,null,null,null,null,null,null,null,null,null,null,null,null,null,null,null,null,null,null,null,null,null,null,null,null,null,null,null,null,null,{"$f":"IF('10 - Mit. Risk Register'!A5=\"\",\"\",'10 - Mit. Risk Register'!A5)","v":"RR-8"},{"$f":"IF('10 - Mit. Risk Register'!B5=\"\",\"\",'10 - Mit. Risk Register'!B5)","v":"QDOT helps City pay for water and sewer-line relocation"},{"$f":"IF('10 - Mit. Risk Register'!C5=\"\",\"\",'10 - Mit. Risk Register'!C5)","v":"Threat"},{"$f":"IF('10 - Mit. Risk Register'!H5=\"\", \"\", '10 - Mit. Risk Register'!H5)","v":0.94937440663165085},{"$f":"IF('10 - Mit. Risk Register'!H5=\"\",\"\",'10 - Mit. Risk Register'!H5)","v":0.94937440663165085},{"$f":"IFERROR(IF(AX155=\"\",\"\",(AX155-AW155)/ABS(AW155)),0)","v":0},{"$f":"IF('10 - Mit. Risk Register'!I5=\"\",\"\",'10 - Mit. Risk Register'!I5)","v":0.15572163780448056},{"$f":"IF('10 - Mit. Risk Register'!J5=\"\",\"\",'10 - Mit. Risk Register'!J5)","v":1}]
[null,null,null,null,null,null,null,null,null,null,null,null,null,null,null,null,null,null,null,null,null,null,null,null,null,null,null,null,null,null,null,null,null,null,null,null,null,null,null,null,null,null,null,null,null,{"$f":"IF('10 - Mit. Risk Register'!A6=\"\",\"\",'10 - Mit. Risk Register'!A6)","v":"PR-1"},{"$f":"IF('10 - Mit. Risk Register'!B6=\"\",\"\",'10 - Mit. Risk Register'!B6)","v":"Uncertainty in construction-cost inflation rate"},{"$f":"IF('10 - Mit. Risk Register'!C6=\"\",\"\",'10 - Mit. Risk Register'!C6)","v":"Threat"},{"$f":"IF('10 - Mit. Risk Register'!H6=\"\", \"\", '10 - Mit. Risk Register'!H6)","v":0.61716339357451888},{"$f":"IF('10 - Mit. Risk Register'!H6=\"\",\"\",'10 - Mit. Risk Register'!H6)","v":0.61716339357451888},{"$f":"IFERROR(IF(AX156=\"\",\"\",(AX156-AW156)/ABS(AW156)),0)","v":0},{"$f":"IF('10 - Mit. Risk Register'!I6=\"\",\"\",'10 - Mit. Risk Register'!I6)","v":0.1012305511598687},{"$f":"IF('10 - Mit. Risk Register'!J6=\"\",\"\",'10 - Mit. Risk Register'!J6)","v":2}]
[null,null,null,null,null,null,null,null,null,null,null,null,null,null,null,null,null,null,null,null,null,null,null,null,null,null,null,null,null,null,null,null,null,null,null,null,null,null,null,null,null,null,null,null,null,{"$f":"IF('10 - Mit. Risk Register'!A7=\"\",\"\",'10 - Mit. Risk Register'!A7)","v":"RR-1"},{"$f":"IF('10 - Mit. Risk Register'!B7=\"\",\"\",'10 - Mit. Risk Register'!B7)","v":"Uncertainty in ROW inflation rate"},{"$f":"IF('10 - Mit. Risk Register'!C7=\"\",\"\",'10 - Mit. Risk Register'!C7)","v":"Threat"},{"$f":"IF('10 - Mit. Risk Register'!H7=\"\", \"\", '10 - Mit. Risk Register'!H7)","v":0.60364846664440241},{"$f":"IF('10 - Mit. Risk Register'!H7=\"\",\"\",'10 - Mit. Risk Register'!H7)","v":0.60364846664440241},0,{"$f":"IF('10 - Mit. Risk Register'!I7=\"\",\"\",'10 - Mit. Risk Register'!I7)","v":9.9013758141577271E-2},{"$f":"IF('10 - Mit. Risk Register'!J7=\"\",\"\",'10 - Mit. Risk Register'!J7)","v":3}]
[null,null,null,null,null,null,null,null,null,null,null,null,null,null,null,null,null,null,null,null,null,null,null,null,null,null,null,null,null,null,null,null,null,null,null,null,null,null,null,null,null,null,null,null,null,{"$f":"IF('10 - Mit. Risk Register'!A8=\"\",\"\",'10 - Mit. Risk Register'!A8)","v":"PD-13"},{"$f":"IF('10 - Mit. Risk Register'!B8=\"\",\"\",'10 - Mit. Risk Register'!B8)","v":"Change in environmental documentation."},{"$f":"IF('10 - Mit. Risk Register'!C8=\"\",\"\",'10 - Mit. Risk Register'!C8)","v":"Threat"},{"$f":"IF('10 - Mit. Risk Register'!H8=\"\", \"\", '10 - Mit. Risk Register'!H8)","v":0.37949026879033604},{"$f":"IF('10 - Mit. Risk Register'!H8=\"\",\"\",'10 - Mit. Risk Register'!H8)","v":0.37949026879033604},0,{"$f":"IF('10 - Mit. Risk Register'!I8=\"\",\"\",'10 - Mit. Risk Register'!I8)","v":6.2246091504151932E-2},{"$f":"IF('10 - Mit. Risk Register'!J8=\"\",\"\",'10 - Mit. Risk Register'!J8)","v":4}]
[null,null,null,null,null,null,null,null,null,null,null,null,null,null,null,null,null,null,null,null,null,null,null,null,null,null,null,null,null,null,null,null,null,null,null,null,null,null,null,null,null,null,null,null,null,{"$f":"IF('10 - Mit. Risk Register'!A9=\"\",\"\",'10 - Mit. Risk Register'!A9)","v":"PR-2"},{"$f":"IF('10 - Mit. Risk Register'!B9=\"\",\"\",'10 - Mit. Risk Register'!B9)","v":"Uncertain Design/Build contracting market conditions at time of bid"},{"$f":"IF('10 - Mit. Risk Register'!C9=\"\",\"\",'10 - Mit. Risk Register'!C9)","v":"Threat"},{"$f":"IF('10 - Mit. Risk Register'!H9=\"\", \"\", '10 - Mit. Risk Register'!H9)","v":0.37535351374470216},{"$f":"IF('10 - Mit. Risk Register'!H9=\"\",\"\",'10 - Mit. Risk Register'!H9)","v":0.37535351374470216},0,{"$f":"IF('10 - Mit. Risk Register'!I9=\"\",\"\",'10 - Mit. Risk Register'!I9)","v":6.1567558075820331E-2},{"$f":"IF('10 - Mit. Risk Register'!J9=\"\",\"\",'10 - Mit. Risk Register'!J9)","v":5}]
[null,null,null,null,null,null,null,null,null,null,null,null,null,null,null,null,null,null,null,null,null,null,null,null,null,null,null,null,null,null,null,null,null,null,null,null,null,null,null,null,null,null,null,null,null,{"$f":"IF('10 - Mit. Risk Register'!A10=\"\",\"\",'10 - Mit. Risk Register'!A10)","v":"SC-6"},{"$f":"IF('10 - Mit. Risk Register'!B10=\"\",\"\",'10 - Mit. Risk Register'!B10)","v":"Provide new lighting throughout project."},{"$f":"IF('10 - Mit. Risk Register'!C10=\"\",\"\",'10 - Mit. Risk Register'!C10)","v":"Threat"},{"$f":"IF('10 - Mit. Risk Register'!H10=\"\", \"\", '10 - Mit. Risk Register'!H10)","v":0.30858169678725944},{"$f":"IF('10 - Mit. Risk Register'!H10=\"\",\"\",'10 - Mit. Risk Register'!H10)","v":0.30858169678725944},0,{"$f":"IF('10 - Mit. Risk Register'!I10=\"\",\"\",'10 - Mit. Risk Register'!I10)","v":5.0615275579934352E-2},{"$f":"IF('10 - Mit. Risk Register'!J10=\"\",\"\",'10 - Mit. Risk Register'!J10)","v":6}]
[null,null,null,null,null,null,null,null,null,null,null,null,null,null,null,null,null,null,null,null,null,null,null,null,null,null,null,null,null,null,null,null,null,null,null,null,null,null,null,null,null,null,null,null,null,{"$f":"IF('10 - Mit. Risk Register'!A11=\"\",\"\",'10 - Mit. Risk Register'!A11)","v":"RR-3"},{"$f":"IF('10 - Mit. Risk Register'!B11=\"\",\"\",'10 - Mit. Risk Register'!B11)","v":"Unwilling sellers"},{"$f":"IF('10 - Mit. Risk Register'!C11=\"\",\"\",'10 - Mit. Risk Register'!C11)","v":"Threat"},{"$f":"IF('10 - Mit. Risk Register'!H11=\"\", \"\", '10 - Mit. Risk Register'!H11)","v":0.30182423332220121},{"$f":"IF('10 - Mit. Risk Register'!H11=\"\",\"\",'10 - Mit. Risk Register'!H11)","v":0.30182423332220121},0,{"$f":"IF('10 - Mit. Risk Register'!I11=\"\",\"\",'10 - Mit. Risk Register'!I11)","v":4.9506879070788636E-2},{"$f":"IF('10 - Mit. Risk Register'!J11=\"\",\"\",'10 - Mit. Risk Register'!J11)","v":7}]
[null,null,null,null,null,null,null,null,null,null,null,null,null,null,null,null,null,null,null,null,null,null,null,null,null,null,null,null,null,null,null,null,null,null,null,null,null,null,null,null,null,null,null,null,null,{"$f":"IF('10 - Mit. Risk Register'!A12=\"\",\"\",'10 - Mit. Risk Register'!A12)","v":"RR-2"},{"$f":"IF('10 - Mit. Risk Register'!B12=\"\",\"\",'10 - Mit. Risk Register'!B12)","v":"Accelerating pace of development in interchange area"},{"$f":"IF('10 - Mit. Risk Register'!C12=\"\",\"\",'10 - Mit. Risk Register'!C12)","v":"Threat"},{"$f":"IF('10 - Mit. Risk Register'!H12=\"\", \"\", '10 - Mit. Risk Register'!H12)","v":0.25583034531761062},{"$f":"IF('10 - Mit. Risk Register'!H12=\"\",\"\",'10 - Mit. Risk Register'!H12)","v":0.25583034531761062},0,{"$f":"IF('10 - Mit. Risk Register'!I12=\"\",\"\",'10 - Mit. Risk Register'!I12)","v":4.1962707330914048E-2},{"$f":"IF('10 - Mit. Risk Register'!J12=\"\",\"\",'10 - Mit. Risk Register'!J12)","v":8}]
[null,null,null,null,null,null,null,null,null,null,null,null,null,null,null,null,null,null,null,null,null,null,null,null,null,null,null,null,null,null,null,null,null,null,null,null,null,null,null,null,null,null,null,null,null,{"$f":"IF('10 - Mit. Risk Register'!A13=\"\",\"\",'10 - Mit. Risk Register'!A13)","v":"PD-12"},{"$f":"IF('10 - Mit. Risk Register'!B13=\"\",\"\",'10 - Mit. Risk Register'!B13)","v":"Structures impacted by Main Street realignment are eligible for Historic Register."},{"$f":"IF('10 - Mit. Risk Register'!C13=\"\",\"\",'10 - Mit. Risk Register'!C13)","v":"Threat"},{"$f":"IF('10 - Mit. Risk Register'!H13=\"\", \"\", '10 - Mit. Risk Register'!H13)","v":0.21316488261655067},{"$f":"IF('10 - Mit. Risk Register'!H13=\"\",\"\",'10 - Mit. Risk Register'!H13)","v":0.21316488261655067},0,{"$f":"IF('10 - Mit. Risk Register'!I13=\"\",\"\",'10 - Mit. Risk Register'!I13)","v":3.4964482307061243E-2},{"$f":"IF('10 - Mit. Risk Register'!J13=\"\",\"\",'10 - Mit. Risk Register'!J13)","v":9}]
[null,null,null,null,null,null,null,null,null,null,null,null,null,null,null,null,null,null,null,null,null,null,null,null,null,null,null,null,null,null,null,null,null,null,null,null,null,null,null,null,null,null,null,null,null,{"$f":"IF('10 - Mit. Risk Register'!A14=\"\",\"\",'10 - Mit. Risk Register'!A14)","v":"CR-4"},{"$f":"IF('10 - Mit. Risk Register'!B14=\"\",\"\",'10 - Mit. Risk Register'!B14)","v":"Unable to construct interchange embankments as rapidly as assumed"},{"$f":"IF('10 - Mit. Risk Register'!C14=\"\",\"\",'10 - Mit. Risk Register'!C14)","v":"Threat"},{"$f":"IF('10 - Mit. Risk Register'!H14=\"\", \"\", '10 - Mit. Risk Register'!H14)","v":0.19561410087124037},{"$f":"IF('10 - Mit. Risk Register'!H14=\"\",\"\",'10 - Mit. Risk Register'!H14)","v":0.19561410087124037},0,{"$f":"IF('10 - Mit. Risk Register'!I14=\"\",\"\",'10 - Mit. Risk Register'!I14)","v":3.2085706073956936E-2},{"$f":"IF('10 - Mit. Risk Register'!J14=\"\",\"\",'10 - Mit. Risk Register'!J14)","v":10}]
[null,null,null,null,null,null,null,null,null,null,null,null,null,null,null,null,null,null,null,null,null,null,null,null,null,null,null,null,null,null,null,null,null,null,null,null,null,null,null,null,null,null,null,null,null,{"$f":"IF('10 - Mit. Risk Register'!A15=\"\",\"\",'10 - Mit. Risk Register'!A15)","v":"PD-11"},{"$f":"IF('10 - Mit. Risk Register'!B15=\"\",\"\",'10 - Mit. Risk Register'!B15)","v":"Cannot use City sewer system for project runoff (or City charges for use)."},{"$f":"IF('10 - Mit. Risk Register'!C15=\"\",\"\",'10 - Mit. Risk Register'!C15)","v":"Threat"},{"$f":"IF('10 - Mit. Risk Register'!H15=\"\", \"\", '10 - Mit. Risk Register'!H15)","v":0.18742311591572172},{"$f":"IF('10 - Mit. Risk Register'!H15=\"\",\"\",'10 - Mit. Risk Register'!H15)","v":0.18742311591572172},0,{"$f":"IF('10 - Mit. Risk Register'!I15=\"\",\"\",'10 - Mit. Risk Register'!I15)","v":3.0742175446213656E-2},{"$f":"IF('10 - Mit. Risk Register'!J15=\"\",\"\",'10 - Mit. Risk Register'!J15)","v":11}]
[null,null,null,null,null,null,null,null,null,null,null,null,null,null,null,null,null,null,null,null,null,null,null,null,null,null,null,null,null,null,null,null,null,null,null,null,null,null,null,null,null,null,null,null,null,{"$f":"IF('10 - Mit. Risk Register'!A16=\"\",\"\",'10 - Mit. Risk Register'!A16)","v":"PD-14"},{"$f":"IF('10 - Mit. Risk Register'!B16=\"\",\"\",'10 - Mit. Risk Register'!B16)","v":"Delays completing environmental documentation."},{"$f":"IF('10 - Mit. Risk Register'!C16=\"\",\"\",'10 - Mit. Risk Register'!C16)","v":"Threat"},{"$f":"IF('10 - Mit. Risk Register'!H16=\"\", \"\", '10 - Mit. Risk Register'!H16)","v":0.18441227221618048},{"$f":"IF('10 - Mit. Risk Register'!H16=\"\",\"\",'10 - Mit. Risk Register'!H16)","v":0.18441227221618048},0,{"$f":"IF('10 - Mit. Risk Register'!I16=\"\",\"\",'10 - Mit. Risk Register'!I16)","v":3.0248320220297737E-2},{"$f":"IF('10 - Mit. Risk Register'!J16=\"\",\"\",'10 - Mit. Risk Register'!J16)","v":12}]
[null,null,null,null,null,null,null,null,null,null,null,null,null,null,null,null,null,null,null,null,null,null,null,null,null,null,null,null,null,null,null,null,null,null,null,null,null,null,null,null,null,null,null,null,null,{"$f":"IF('10 - Mit. Risk Register'!A17=\"\",\"\",'10 - Mit. Risk Register'!A17)","v":"PD-4"},{"$f":"IF('10 - Mit. Risk Register'!B17=\"\",\"\",'10 - Mit. Risk Register'!B17)","v":"Ground improvement required in interchange area. "},{"$f":"IF('10 - Mit. Risk Register'!C17=\"\",\"\",'10 - Mit. Risk Register'!C17)","v":"Threat"},{"$f":"IF('10 - Mit. Risk Register'!H17=\"\", \"\", '10 - Mit. Risk Register'!H17)","v":0.16933020146133226},{"$f":"IF('10 - Mit. Risk Register'!H17=\"\",\"\",'10 - Mit. Risk Register'!H17)","v":0.16933020146133226},0,{"$f":"IF('10 - Mit. Risk Register'!I17=\"\",\"\",'10 - Mit. Risk Register'!I17)","v":2.7774475609549494E-2},{"$f":"IF('10 - Mit. Risk Register'!J17=\"\",\"\",'10 - Mit. Risk Register'!J17)","v":13}]
[null,null,null,null,null,null,null,null,null,null,null,null,null,null,null,null,null,null,null,null,null,null,null,null,null,null,null,null,null,null,null,null,null,null,null,null,null,null,null,null,null,null,null,null,null,{"$f":"IF('10 - Mit. Risk Register'!A18=\"\",\"\",'10 - Mit. Risk Register'!A18)","v":"CR-3"},{"$f":"IF('10 - Mit. Risk Register'!B18=\"\",\"\",'10 - Mit. Risk Register'!B18)","v":"Problems with planned accelerated bridge construction (ABC) technique"},{"$f":"IF('10 - Mit. Risk Register'!C18=\"\",\"\",'10 - Mit. Risk Register'!C18)","v":"Threat"},{"$f":"IF('10 - Mit. Risk Register'!H18=\"\", \"\", '10 - Mit. Risk Register'!H18)","v":0.16679964583043327},{"$f":"IF('10 - Mit. Risk Register'!H18=\"\",\"\",'10 - Mit. Risk Register'!H18)","v":0.16679964583043327},0,{"$f":"IF('10 - Mit. Risk Register'!I18=\"\",\"\",'10 - Mit. Risk Register'!I18)","v":2.7359399887425216E-2},{"$f":"IF('10 - Mit. Risk Register'!J18=\"\",\"\",'10 - Mit. Risk Register'!J18)","v":14}]
[null,null,null,null,null,null,null,null,null,null,null,null,null,null,null,null,null,null,null,null,null,null,null,null,null,null,null,null,null,null,null,null,null,null,null,null,null,null,null,null,null,null,null,null,null,{"$f":"IF('10 - Mit. Risk Register'!A19=\"\",\"\",'10 - Mit. Risk Register'!A19)","v":"CR-2"},{"$f":"IF('10 - Mit. Risk Register'!B19=\"\",\"\",'10 - Mit. Risk Register'!B19)","v":"Additional Maintenance of Traffic required"},{"$f":"IF('10 - Mit. Risk Register'!C19=\"\",\"\",'10 - Mit. Risk Register'!C19)","v":"Threat"},{"$f":"IF('10 - Mit. Risk Register'!H19=\"\", \"\", '10 - Mit. Risk Register'!H19)","v":0.16102039832721377},{"$f":"IF('10 - Mit. Risk Register'!H19=\"\",\"\",'10 - Mit. Risk Register'!H19)","v":0.16102039832721377},0,{"$f":"IF('10 - Mit. Risk Register'!I19=\"\",\"\",'10 - Mit. Risk Register'!I19)","v":2.6411455767389576E-2},{"$f":"IF('10 - Mit. Risk Register'!J19=\"\",\"\",'10 - Mit. Risk Register'!J19)","v":15}]
[null,null,null,null,null,null,null,null,null,null,null,null,null,null,null,null,null,null,null,null,null,null,null,null,null,null,null,null,null,null,null,null,null,null,null,null,null,null,null,null,null,null,null,null,null,{"$f":"IF('10 - Mit. Risk Register'!A20=\"\",\"\",'10 - Mit. Risk Register'!A20)","v":"SC-3"},{"$f":"IF('10 - Mit. Risk Register'!B20=\"\",\"\",'10 - Mit. Risk Register'!B20)","v":"Additional local improvements required. "},{"$f":"IF('10 - Mit. Risk Register'!C20=\"\",\"\",'10 - Mit. Risk Register'!C20)","v":"Threat"},{"$f":"IF('10 - Mit. Risk Register'!H20=\"\", \"\", '10 - Mit. Risk Register'!H20)","v":0.15828216097404291},{"$f":"IF('10 - Mit. Risk Register'!H20=\"\",\"\",'10 - Mit. Risk Register'!H20)","v":0.15828216097404291},0,{"$f":"IF('10 - Mit. Risk Register'!I20=\"\",\"\",'10 - Mit. Risk Register'!I20)","v":2.5962314941225917E-2},{"$f":"IF('10 - Mit. Risk Register'!J20=\"\",\"\",'10 - Mit. Risk Register'!J20)","v":16}]
[null,null,null,null,null,null,null,null,null,null,null,null,null,null,null,null,null,null,null,null,null,null,null,null,null,null,null,null,null,null,null,null,null,null,null,null,null,null,null,null,null,null,null,null,null,{"$f":"IF('10 - Mit. Risk Register'!A21=\"\",\"\",'10 - Mit. Risk Register'!A21)","v":"SC-5"},{"$f":"IF('10 - Mit. Risk Register'!B21=\"\",\"\",'10 - Mit. Risk Register'!B21)","v":"Replace culvert over Wandering Creek. "},{"$f":"IF('10 - Mit. Risk Register'!C21=\"\",\"\",'10 - Mit. Risk Register'!C21)","v":"Threat"},{"$f":"IF('10 - Mit. Risk Register'!H21=\"\", \"\", '10 - Mit. Risk Register'!H21)","v":0.11221152610445796},{"$f":"IF('10 - Mit. Risk Register'!H21=\"\",\"\",'10 - Mit. Risk Register'!H21)","v":0.11221152610445796},0,{"$f":"IF('10 - Mit. Risk Register'!I21=\"\",\"\",'10 - Mit. Risk Register'!I21)","v":1.8405554756339759E-2},{"$f":"IF('10 - Mit. Risk Register'!J21=\"\",\"\",'10 - Mit. Risk Register'!J21)","v":17}]
[null,null,null,null,null,null,null,null,null,null,null,null,null,null,null,null,null,null,null,null,null,null,null,null,null,null,null,null,null,null,null,null,null,null,null,null,null,null,null,null,null,null,null,null,null,{"$f":"IF('10 - Mit. Risk Register'!A22=\"\",\"\",'10 - Mit. Risk Register'!A22)","v":"PD-16"},{"$f":"IF('10 - Mit. Risk Register'!B22=\"\",\"\",'10 - Mit. Risk Register'!B22)","v":"Additional wetland mitigation required for planned alignment."},{"$f":"IF('10 - Mit. Risk Register'!C22=\"\",\"\",'10 - Mit. Risk Register'!C22)","v":"Threat"},{"$f":"IF('10 - Mit. Risk Register'!H22=\"\", \"\", '10 - Mit. Risk Register'!H22)","v":0.11221152610445796},{"$f":"IF('10 - Mit. Risk Register'!H22=\"\",\"\",'10 - Mit. Risk Register'!H22)","v":0.11221152610445796},0,{"$f":"IF('10 - Mit. Risk Register'!I22=\"\",\"\",'10 - Mit. Risk Register'!I22)","v":1.8405554756339759E-2},{"$f":"IF('10 - Mit. Risk Register'!J22=\"\",\"\",'10 - Mit. Risk Register'!J22)","v":18}]
[null,null,null,null,null,null,null,null,null,null,null,null,null,null,null,null,null,null,null,null,null,null,null,null,null,null,null,null,null,null,null,null,null,null,null,null,null,null,null,null,null,null,null,null,null,{"$f":"IF('10 - Mit. Risk Register'!A23=\"\",\"\",'10 - Mit. Risk Register'!A23)","v":"RR-7"},{"$f":"IF('10 - Mit. Risk Register'!B23=\"\",\"\",'10 - Mit. Risk Register'!B23)","v":"Telecom utility wants a cost-sharing agreement"},{"$f":"IF('10 - Mit. Risk Register'!C23=\"\",\"\",'10 - Mit. Risk Register'!C23)","v":"Threat"},{"$f":"IF('10 - Mit. Risk Register'!H23=\"\", \"\", '10 - Mit. Risk Register'!H23)","v":0.10975426666261862},{"$f":"IF('10 - Mit. Risk Register'!H23=\"\",\"\",'10 - Mit. Risk Register'!H23)","v":0.10975426666261862},0,{"$f":"IF('10 - Mit. Risk Register'!I23=\"\",\"\",'10 - Mit. Risk Register'!I23)","v":1.8002501480286776E-2},{"$f":"IF('10 - Mit. Risk Register'!J23=\"\",\"\",'10 - Mit. Risk Register'!J23)","v":19}]
[null,null,null,null,null,null,null,null,null,null,null,null,null,null,null,null,null,null,null,null,null,null,null,null,null,null,null,null,null,null,null,null,null,null,null,null,null,null,null,null,null,null,null,null,null,{"$f":"IF('10 - Mit. Risk Register'!A24=\"\",\"\",'10 - Mit. Risk Register'!A24)","v":"PD-5"},{"$f":"IF('10 - Mit. Risk Register'!B24=\"\",\"\",'10 - Mit. Risk Register'!B24)","v":"Shoulders required on US-555. "},{"$f":"IF('10 - Mit. Risk Register'!C24=\"\",\"\",'10 - Mit. Risk Register'!C24)","v":"Threat"},{"$f":"IF('10 - Mit. Risk Register'!H24=\"\", \"\", '10 - Mit. Risk Register'!H24)","v":9.8049624709276778E-2},{"$f":"IF('10 - Mit. Risk Register'!H24=\"\",\"\",'10 - Mit. Risk Register'!H24)","v":9.8049624709276778E-2},0,{"$f":"IF('10 - Mit. Risk Register'!I24=\"\",\"\",'10 - Mit. Risk Register'!I24)","v":1.6082641410163138E-2},{"$f":"IF('10 - Mit. Risk Register'!J24=\"\",\"\",'10 - Mit. Risk Register'!J24)","v":20}]
[null,null,null,null,null,null,null,null,null,null,null,null,null,null,null,null,null,null,null,null,null,null,null,null,null,null,null,null,null,null,null,null,null,null,null,null,null,null,null,null,null,null,null,null,null,{"$f":"IF('10 - Mit. Risk Register'!A25=\"\",\"\",'10 - Mit. Risk Register'!A25)","v":"PD-6"},{"$f":"IF('10 - Mit. Risk Register'!B25=\"\",\"\",'10 - Mit. Risk Register'!B25)","v":"Shoulders required on SH-111."},{"$f":"IF('10 - Mit. Risk Register'!C25=\"\",\"\",'10 - Mit. Risk Register'!C25)","v":"Threat"},{"$f":"IF('10 - Mit. Risk Register'!H25=\"\", \"\", '10 - Mit. Risk Register'!H25)","v":9.8049624709276778E-2},{"$f":"IF('10 - Mit. Risk Register'!H25=\"\",\"\",'10 - Mit. Risk Register'!H25)","v":9.8049624709276778E-2},0,{"$f":"IF('10 - Mit. Risk Register'!I25=\"\",\"\",'10 - Mit. Risk Register'!I25)","v":1.6082641410163138E-2},{"$f":"IF('10 - Mit. Risk Register'!J25=\"\",\"\",'10 - Mit. Risk Register'!J25)","v":21}]
[null,null,null,null,null,null,null,null,null,null,null,null,null,null,null,null,null,null,null,null,null,null,null,null,null,null,null,null,null,null,null,null,null,null,null,null,null,null,null,null,null,null,null,null,null,{"$f":"IF('10 - Mit. Risk Register'!A26=\"\",\"\",'10 - Mit. Risk Register'!A26)","v":"CR-5"},{"$f":"IF('10 - Mit. Risk Register'!B26=\"\",\"\",'10 - Mit. Risk Register'!B26)","v":"Difficult foundation installation"},{"$f":"IF('10 - Mit. Risk Register'!C26=\"\",\"\",'10 - Mit. Risk Register'!C26)","v":"Threat"},{"$f":"IF('10 - Mit. Risk Register'!H26=\"\", \"\", '10 - Mit. Risk Register'!H26)","v":7.5802599643183061E-2},{"$f":"IF('10 - Mit. Risk Register'!H26=\"\",\"\",'10 - Mit. Risk Register'!H26)","v":7.5802599643183061E-2},0,{"$f":"IF('10 - Mit. Risk Register'!I26=\"\",\"\",'10 - Mit. Risk Register'!I26)","v":1.2433561389288318E-2},{"$f":"IF('10 - Mit. Risk Register'!J26=\"\",\"\",'10 - Mit. Risk Register'!J26)","v":22}]
[null,null,null,null,null,null,null,null,null,null,null,null,null,null,null,null,null,null,null,null,null,null,null,null,null,null,null,null,null,null,null,null,null,null,null,null,null,null,null,null,null,null,null,null,null,{"$f":"IF('10 - Mit. Risk Register'!A27=\"\",\"\",'10 - Mit. Risk Register'!A27)","v":"EP-2"},{"$f":"IF('10 - Mit. Risk Register'!B27=\"\",\"\",'10 - Mit. Risk Register'!B27)","v":"Delay obtaining the 404 permit"},{"$f":"IF('10 - Mit. Risk Register'!C27=\"\",\"\",'10 - Mit. Risk Register'!C27)","v":"Threat"},{"$f":"IF('10 - Mit. Risk Register'!H27=\"\", \"\", '10 - Mit. Risk Register'!H27)","v":7.3451630977436261E-2},{"$f":"IF('10 - Mit. Risk Register'!H27=\"\",\"\",'10 - Mit. Risk Register'!H27)","v":7.3451630977436261E-2},0,{"$f":"IF('10 - Mit. Risk Register'!I27=\"\",\"\",'10 - Mit. Risk Register'!I27)","v":1.204794251384801E-2},{"$f":"IF('10 - Mit. Risk Register'!J27=\"\",\"\",'10 - Mit. Risk Register'!J27)","v":23}]
[null,null,null,null,null,null,null,null,null,null,null,null,null,null,null,null,null,null,null,null,null,null,null,null,null,null,null,null,null,null,null,null,null,null,null,null,null,null,null,null,null,null,null,null,null,{"$f":"IF('10 - Mit. Risk Register'!A28=\"\",\"\",'10 - Mit. Risk Register'!A28)","v":"RR-6"},{"$f":"IF('10 - Mit. Risk Register'!B28=\"\",\"\",'10 - Mit. Risk Register'!B28)","v":"Other delays to ROW planning"},{"$f":"IF('10 - Mit. Risk Register'!C28=\"\",\"\",'10 - Mit. Risk Register'!C28)","v":"Threat"},{"$f":"IF('10 - Mit. Risk Register'!H28=\"\", \"\", '10 - Mit. Risk Register'!H28)","v":4.551272400547713E-2},{"$f":"IF('10 - Mit. Risk Register'!H28=\"\",\"\",'10 - Mit. Risk Register'!H28)","v":4.551272400547713E-2},0,{"$f":"IF('10 - Mit. Risk Register'!I28=\"\",\"\",'10 - Mit. Risk Register'!I28)","v":7.4652485611253856E-3},{"$f":"IF('10 - Mit. Risk Register'!J28=\"\",\"\",'10 - Mit. Risk Register'!J28)","v":24}]
[null,null,null,null,null,null,null,null,null,null,null,null,null,null,null,null,null,null,null,null,null,null,null,null,null,null,null,null,null,null,null,null,null,null,null,null,null,null,null,null,null,null,null,null,null,{"$f":"IF('10 - Mit. Risk Register'!A29=\"\",\"\",'10 - Mit. Risk Register'!A29)","v":"PD-1"},{"$f":"IF('10 - Mit. Risk Register'!B29=\"\",\"\",'10 - Mit. Risk Register'!B29)","v":"Shift alignment of US 555 at east end of project"},{"$f":"IF('10 - Mit. Risk Register'!C29=\"\",\"\",'10 - Mit. Risk Register'!C29)","v":"Threat"},{"$f":"IF('10 - Mit. Risk Register'!H29=\"\", \"\", '10 - Mit. Risk Register'!H29)","v":4.2611327308908681E-2},{"$f":"IF('10 - Mit. Risk Register'!H29=\"\",\"\",'10 - Mit. Risk Register'!H29)","v":4.2611327308908681E-2},0,{"$f":"IF('10 - Mit. Risk Register'!I29=\"\",\"\",'10 - Mit. Risk Register'!I29)","v":6.9893454376009616E-3},{"$f":"IF('10 - Mit. Risk Register'!J29=\"\",\"\",'10 - Mit. Risk Register'!J29)","v":25}]
[null,null,null,null,null,null,null,null,null,null,null,null,null,null,null,null,null,null,null,null,null,null,null,null,null,null,null,null,null,null,null,null,null,null,null,null,null,null,null,null,null,null,null,null,null,{"$f":"IF('10 - Mit. Risk Register'!A30=\"\",\"\",'10 - Mit. Risk Register'!A30)","v":"PD-15"},{"$f":"IF('10 - Mit. Risk Register'!B30=\"\",\"\",'10 - Mit. Risk Register'!B30)","v":"Encounter unanticipated contamination in interchange area."},{"$f":"IF('10 - Mit. Risk Register'!C30=\"\",\"\",'10 - Mit. Risk Register'!C30)","v":"Threat"},{"$f":"IF('10 - Mit. Risk Register'!H30=\"\", \"\", '10 - Mit. Risk Register'!H30)","v":3.2060436029845138E-2},{"$f":"IF('10 - Mit. Risk Register'!H30=\"\",\"\",'10 - Mit. Risk Register'!H30)","v":3.2060436029845138E-2},0,{"$f":"IF('10 - Mit. Risk Register'!I30=\"\",\"\",'10 - Mit. Risk Register'!I30)","v":5.2587299303827901E-3},{"$f":"IF('10 - Mit. Risk Register'!J30=\"\",\"\",'10 - Mit. Risk Register'!J30)","v":26}]
[null,null,null,null,null,null,null,null,null,null,null,null,null,null,null,null,null,null,null,null,null,null,null,null,null,null,null,null,null,null,null,null,null,null,null,null,null,null,null,null,null,null,null,null,null,{"$f":"IF('10 - Mit. Risk Register'!A31=\"\",\"\",'10 - Mit. Risk Register'!A31)","v":"CR-9"},{"$f":"IF('10 - Mit. Risk Register'!B31=\"\",\"\",'10 - Mit. Risk Register'!B31)","v":"Limited construction staging area in vicinity of interchange"},{"$f":"IF('10 - Mit. Risk Register'!C31=\"\",\"\",'10 - Mit. Risk Register'!C31)","v":"Threat"},{"$f":"IF('10 - Mit. Risk Register'!H31=\"\", \"\", '10 - Mit. Risk Register'!H31)","v":3.2060436029845138E-2},{"$f":"IF('10 - Mit. Risk Register'!H31=\"\",\"\",'10 - Mit. Risk Register'!H31)","v":3.2060436029845138E-2},0,{"$f":"IF('10 - Mit. Risk Register'!I31=\"\",\"\",'10 - Mit. Risk Register'!I31)","v":5.2587299303827901E-3},{"$f":"IF('10 - Mit. Risk Register'!J31=\"\",\"\",'10 - Mit. Risk Register'!J31)","v":27}]
[null,null,null,null,null,null,null,null,null,null,null,null,null,null,null,null,null,null,null,null,null,null,null,null,null,null,null,null,null,null,null,null,null,null,null,null,null,null,null,null,null,null,null,null,null,{"$f":"IF('10 - Mit. Risk Register'!A32=\"\",\"\",'10 - Mit. Risk Register'!A32)","v":"PR-8"},{"$f":"IF('10 - Mit. Risk Register'!B32=\"\",\"\",'10 - Mit. Risk Register'!B32)","v":"Other problems with D/B contract procurement"},{"$f":"IF('10 - Mit. Risk Register'!C32=\"\",\"\",'10 - Mit. Risk Register'!C32)","v":"Threat"},{"$f":"IF('10 - Mit. Risk Register'!H32=\"\", \"\", '10 - Mit. Risk Register'!H32)","v":1.8357521922402198E-2},{"$f":"IF('10 - Mit. Risk Register'!H32=\"\",\"\",'10 - Mit. Risk Register'!H32)","v":1.8357521922402198E-2},0,{"$f":"IF('10 - Mit. Risk Register'!I32=\"\",\"\",'10 - Mit. Risk Register'!I32)","v":3.0111022161747234E-3},{"$f":"IF('10 - Mit. Risk Register'!J32=\"\",\"\",'10 - Mit. Risk Register'!J32)","v":28}]
[null,null,null,null,null,null,null,null,null,null,null,null,null,null,null,null,null,null,null,null,null,null,null,null,null,null,null,null,null,null,null,null,null,null,null,null,null,null,null,null,null,null,null,null,null,{"$f":"IF('10 - Mit. Risk Register'!A33=\"\",\"\",'10 - Mit. Risk Register'!A33)","v":"PL-2"},{"$f":"IF('10 - Mit. Risk Register'!B33=\"\",\"\",'10 - Mit. Risk Register'!B33)","v":"Opposition to removing access to US-555 fro 12th St."},{"$f":"IF('10 - Mit. Risk Register'!C33=\"\",\"\",'10 - Mit. Risk Register'!C33)","v":"Threat"},{"$f":"IF('10 - Mit. Risk Register'!H33=\"\", \"\", '10 - Mit. Risk Register'!H33)","v":1.3358515012435471E-2},{"$f":"IF('10 - Mit. Risk Register'!H33=\"\",\"\",'10 - Mit. Risk Register'!H33)","v":1.3358515012435471E-2},0,{"$f":"IF('10 - Mit. Risk Register'!I33=\"\",\"\",'10 - Mit. Risk Register'!I33)","v":2.1911374709928286E-3},{"$f":"IF('10 - Mit. Risk Register'!J33=\"\",\"\",'10 - Mit. Risk Register'!J33)","v":29}]
[null,null,null,null,null,null,null,null,null,null,null,null,null,null,null,null,null,null,null,null,null,null,null,null,null,null,null,null,null,null,null,null,null,null,null,null,null,null,null,null,null,null,null,null,null,{"$f":"IF('10 - Mit. Risk Register'!A34=\"\",\"\",'10 - Mit. Risk Register'!A34)","v":"CR-7"},{"$f":"IF('10 - Mit. Risk Register'!B34=\"\",\"\",'10 - Mit. Risk Register'!B34)","v":"Colder-than-usual winter "},{"$f":"IF('10 - Mit. Risk Register'!C34=\"\",\"\",'10 - Mit. Risk Register'!C34)","v":"Threat"},{"$f":"IF('10 - Mit. Risk Register'!H34=\"\", \"\", '10 - Mit. Risk Register'!H34)","v":5.8071437477329509E-3},{"$f":"IF('10 - Mit. Risk Register'!H34=\"\",\"\",'10 - Mit. Risk Register'!H34)","v":5.8071437477329509E-3},0,{"$f":"IF('10 - Mit. Risk Register'!I34=\"\",\"\",'10 - Mit. Risk Register'!I34)","v":9.5251981625610045E-4},{"$f":"IF('10 - Mit. Risk Register'!J34=\"\",\"\",'10 - Mit. Risk Register'!J34)","v":30}]
[null,null,null,null,null,null,null,null,null,null,null,null,null,null,null,null,null,null,null,null,null,null,null,null,null,null,null,null,null,null,null,null,null,null,null,null,null,null,null,null,null,null,null,null,null,{"$f":"IF('10 - Mit. Risk Register'!A35=\"\",\"\",'10 - Mit. Risk Register'!A35)","v":"CR-1"},{"$f":"IF('10 - Mit. Risk Register'!B35=\"\",\"\",'10 - Mit. Risk Register'!B35)","v":"D/B construction phasing significantly different than assumed"},{"$f":"IF('10 - Mit. Risk Register'!C35=\"\",\"\",'10 - Mit. Risk Register'!C35)","v":"Opportunity"},{"$f":"IF('10 - Mit. Risk Register'!H35=\"\", \"\", '10 - Mit. Risk Register'!H35)","v":-0.43566608956405839},{"$f":"IF('10 - Mit. Risk Register'!H35=\"\",\"\",'10 - Mit. Risk Register'!H35)","v":-0.43566608956405839},0,{"$f":"IF('10 - Mit. Risk Register'!I35=\"\",\"\",'10 - Mit. Risk Register'!I35)","v":0.56411460935470881},{"$f":"IF('10 - Mit. Risk Register'!J35=\"\",\"\",'10 - Mit. Risk Register'!J35)","v":1}]
[null,null,null,null,null,null,null,null,null,null,null,null,null,null,null,null,null,null,null,null,null,null,null,null,null,null,null,null,null,null,null,null,null,null,null,null,null,null,null,null,null,null,null,null,null,{"$f":"IF('10 - Mit. Risk Register'!A36=\"\",\"\",'10 - Mit. Risk Register'!A36)","v":"PD-8"},{"$f":"IF('10 - Mit. Risk Register'!B36=\"\",\"\",'10 - Mit. Risk Register'!B36)","v":"Change in pavement section and/or type."},{"$f":"IF('10 - Mit. Risk Register'!C36=\"\",\"\",'10 - Mit. Risk Register'!C36)","v":"Opportunity"},{"$f":"IF('10 - Mit. Risk Register'!H36=\"\", \"\", '10 - Mit. Risk Register'!H36)","v":-0.3366345783133739},{"$f":"IF('10 - Mit. Risk Register'!H36=\"\",\"\",'10 - Mit. Risk Register'!H36)","v":-0.3366345783133739},0,{"$f":"IF('10 - Mit. Risk Register'!I36=\"\",\"\",'10 - Mit. Risk Register'!I36)","v":0.43588539064529125},{"$f":"IF('10 - Mit. Risk Register'!J36=\"\",\"\",'10 - Mit. Risk Register'!J36)","v":2}]
[null,null,null,null,null,null,null,null,null,null,null,null,null,null,null,null,null,null,null,null,null,null,null,null,null,null,null,null,null,null,null,null,null,null,null,null,null,null,null,null,null,null,null,null,null,{"$f":"IF('10 - Mit. Risk Register'!A37=\"\",\"\",'10 - Mit. Risk Register'!A37)","v":"PL-1"},{"$f":"IF('10 - Mit. Risk Register'!B37=\"\",\"\",'10 - Mit. Risk Register'!B37)","v":"Project funding delayed or reduced."},{"$f":"IF('10 - Mit. Risk Register'!C37=\"\",\"\",'10 - Mit. Risk Register'!C37)","v":"No Impact"},{"$f":"IF('10 - Mit. Risk Register'!H37=\"\", \"\", '10 - Mit. Risk Register'!H37)","v":0},{"$f":"IF('10 - Mit. Risk Register'!H37=\"\",\"\",'10 - Mit. Risk Register'!H37)","v":0},0,{"$f":"IF('10 - Mit. Risk Register'!I37=\"\",\"\",'10 - Mit. Risk Register'!I37)","v":0},{"$f":"IF('10 - Mit. Risk Register'!J37=\"\",\"\",'10 - Mit. Risk Register'!J37)","v":""}]
[null,null,null,null,null,null,null,null,null,null,null,null,null,null,null,null,null,null,null,null,null,null,null,null,null,null,null,null,null,null,null,null,null,null,null,null,null,null,null,null,null,null,null,null,null,{"$f":"IF('10 - Mit. Risk Register'!A38=\"\",\"\",'10 - Mit. Risk Register'!A38)","v":"PL-3"},{"$f":"IF('10 - Mit. Risk Register'!B38=\"\",\"\",'10 - Mit. Risk Register'!B38)","v":"Opposition to \"splitting\" alignment of SH-111 in the interchange area."},{"$f":"IF('10 - Mit. Risk Register'!C38=\"\",\"\",'10 - Mit. Risk Register'!C38)","v":"No Impact"},{"$f":"IF('10 - Mit. Risk Register'!H38=\"\", \"\", '10 - Mit. Risk Register'!H38)","v":0},{"$f":"IF('10 - Mit. Risk Register'!H38=\"\",\"\",'10 - Mit. Risk Register'!H38)","v":0},0,{"$f":"IF('10 - Mit. Risk Register'!I38=\"\",\"\",'10 - Mit. Risk Register'!I38)","v":0},{"$f":"IF('10 - Mit. Risk Register'!J38=\"\",\"\",'10 - Mit. Risk Register'!J38)","v":""}]
[null,null,null,null,null,null,null,null,null,null,null,null,null,null,null,null,null,null,null,null,null,null,null,null,null,null,null,null,null,null,null,null,null,null,null,null,null,null,null,null,null,null,null,null,null,{"$f":"IF('10 - Mit. Risk Register'!A39=\"\",\"\",'10 - Mit. Risk Register'!A39)","v":"PL-4"},{"$f":"IF('10 - Mit. Risk Register'!B39=\"\",\"\",'10 - Mit. Risk Register'!B39)","v":"Other stakeholder issues not captured separately."},{"$f":"IF('10 - Mit. Risk Register'!C39=\"\",\"\",'10 - Mit. Risk Register'!C39)","v":"No Impact"},{"$f":"IF('10 - Mit. Risk Register'!H39=\"\", \"\", '10 - Mit. Risk Register'!H39)","v":0},{"$f":"IF('10 - Mit. Risk Register'!H39=\"\",\"\",'10 - Mit. Risk Register'!H39)","v":0},0,{"$f":"IF('10 - Mit. Risk Register'!I39=\"\",\"\",'10 - Mit. Risk Register'!I39)","v":0},{"$f":"IF('10 - Mit. Risk Register'!J39=\"\",\"\",'10 - Mit. Risk Register'!J39)","v":""}]
[null,null,null,null,null,null,null,null,null,null,null,null,null,null,null,null,null,null,null,null,null,null,null,null,null,null,null,null,null,null,null,null,null,null,null,null,null,null,null,null,null,null,null,null,null,{"$f":"IF('10 - Mit. Risk Register'!A40=\"\",\"\",'10 - Mit. Risk Register'!A40)","v":"SC-1"},{"$f":"IF('10 - Mit. Risk Register'!B40=\"\",\"\",'10 - Mit. Risk Register'!B40)","v":"Change in East-West project limits. "},{"$f":"IF('10 - Mit. Risk Register'!C40=\"\",\"\",'10 - Mit. Risk Register'!C40)","v":"No Impact"},{"$f":"IF('10 - Mit. Risk Register'!H40=\"\", \"\", '10 - Mit. Risk Register'!H40)","v":0},{"$f":"IF('10 - Mit. Risk Register'!H40=\"\",\"\",'10 - Mit. Risk Register'!H40)","v":0},0,{"$f":"IF('10 - Mit. Risk Register'!I40=\"\",\"\",'10 - Mit. Risk Register'!I40)","v":0},{"$f":"IF('10 - Mit. Risk Register'!J40=\"\",\"\",'10 - Mit. Risk Register'!J40)","v":""}]
[null,null,null,null,null,null,null,null,null,null,null,null,null,null,null,null,null,null,null,null,null,null,null,null,null,null,null,null,null,null,null,null,null,null,null,null,null,null,null,null,null,null,null,null,null,{"$f":"IF('10 - Mit. Risk Register'!A41=\"\",\"\",'10 - Mit. Risk Register'!A41)","v":"SC-2"},{"$f":"IF('10 - Mit. Risk Register'!B41=\"\",\"\",'10 - Mit. Risk Register'!B41)","v":"Change in North-South project limits. "},{"$f":"IF('10 - Mit. Risk Register'!C41=\"\",\"\",'10 - Mit. Risk Register'!C41)","v":"No Impact"},{"$f":"IF('10 - Mit. Risk Register'!H41=\"\", \"\", '10 - Mit. Risk Register'!H41)","v":0},{"$f":"IF('10 - Mit. Risk Register'!H41=\"\",\"\",'10 - Mit. Risk Register'!H41)","v":0},0,{"$f":"IF('10 - Mit. Risk Register'!I41=\"\",\"\",'10 - Mit. Risk Register'!I41)","v":0},{"$f":"IF('10 - Mit. Risk Register'!J41=\"\",\"\",'10 - Mit. Risk Register'!J41)","v":""}]
[null,null,null,null,null,null,null,null,null,null,null,null,null,null,null,null,null,null,null,null,null,null,null,null,null,null,null,null,null,null,null,null,null,null,null,null,null,null,null,null,null,null,null,null,null,{"$f":"IF('10 - Mit. Risk Register'!A42=\"\",\"\",'10 - Mit. Risk Register'!A42)","v":"SC-4"},{"$f":"IF('10 - Mit. Risk Register'!B42=\"\",\"\",'10 - Mit. Risk Register'!B42)","v":"Increased aestethetics for US-555/SH-111 interchange. "},{"$f":"IF('10 - Mit. Risk Register'!C42=\"\",\"\",'10 - Mit. Risk Register'!C42)","v":"No Impact"},{"$f":"IF('10 - Mit. Risk Register'!H42=\"\", \"\", '10 - Mit. Risk Register'!H42)","v":0},{"$f":"IF('10 - Mit. Risk Register'!H42=\"\",\"\",'10 - Mit. Risk Register'!H42)","v":0},0,{"$f":"IF('10 - Mit. Risk Register'!I42=\"\",\"\",'10 - Mit. Risk Register'!I42)","v":0},{"$f":"IF('10 - Mit. Risk Register'!J42=\"\",\"\",'10 - Mit. Risk Register'!J42)","v":""}]
[null,null,null,null,null,null,null,null,null,null,null,null,null,null,null,null,null,null,null,null,null,null,null,null,null,null,null,null,null,null,null,null,null,null,null,null,null,null,null,null,null,null,null,null,null,{"$f":"IF('10 - Mit. Risk Register'!A43=\"\",\"\",'10 - Mit. Risk Register'!A43)","v":"SC-7"},{"$f":"IF('10 - Mit. Risk Register'!B43=\"\",\"\",'10 - Mit. Risk Register'!B43)","v":"ITS added to this project. "},{"$f":"IF('10 - Mit. Risk Register'!C43=\"\",\"\",'10 - Mit. Risk Register'!C43)","v":"No Impact"},{"$f":"IF('10 - Mit. Risk Register'!H43=\"\", \"\", '10 - Mit. Risk Register'!H43)","v":0},{"$f":"IF('10 - Mit. Risk Register'!H43=\"\",\"\",'10 - Mit. Risk Register'!H43)","v":0},0,{"$f":"IF('10 - Mit. Risk Register'!I43=\"\",\"\",'10 - Mit. Risk Register'!I43)","v":0},{"$f":"IF('10 - Mit. Risk Register'!J43=\"\",\"\",'10 - Mit. Risk Register'!J43)","v":""}]
[null,null,null,null,null,null,null,null,null,null,null,null,null,null,null,null,null,null,null,null,null,null,null,null,null,null,null,null,null,null,null,null,null,null,null,null,null,null,null,null,null,null,null,null,null,{"$f":"IF('10 - Mit. Risk Register'!A44=\"\",\"\",'10 - Mit. Risk Register'!A44)","v":"PD-2"},{"$f":"IF('10 - Mit. Risk Register'!B44=\"\",\"\",'10 - Mit. Risk Register'!B44)","v":"Split alignment of SH-111 at US-555 interchange. "},{"$f":"IF('10 - Mit. Risk Register'!C44=\"\",\"\",'10 - Mit. Risk Register'!C44)","v":"No Impact"},{"$f":"IF('10 - Mit. Risk Register'!H44=\"\", \"\", '10 - Mit. Risk Register'!H44)","v":0},{"$f":"IF('10 - Mit. Risk Register'!H44=\"\",\"\",'10 - Mit. Risk Register'!H44)","v":0},0,{"$f":"IF('10 - Mit. Risk Register'!I44=\"\",\"\",'10 - Mit. Risk Register'!I44)","v":0},{"$f":"IF('10 - Mit. Risk Register'!J44=\"\",\"\",'10 - Mit. Risk Register'!J44)","v":""}]
[null,null,null,null,null,null,null,null,null,null,null,null,null,null,null,null,null,null,null,null,null,null,null,null,null,null,null,null,null,null,null,null,null,null,null,null,null,null,null,null,null,null,null,null,null,{"$f":"IF('10 - Mit. Risk Register'!A45=\"\",\"\",'10 - Mit. Risk Register'!A45)","v":"PD-3"},{"$f":"IF('10 - Mit. Risk Register'!B45=\"\",\"\",'10 - Mit. Risk Register'!B45)","v":"Change in configuration of SH 111 / US 555 interchange."},{"$f":"IF('10 - Mit. Risk Register'!C45=\"\",\"\",'10 - Mit. Risk Register'!C45)","v":"No Impact"},{"$f":"IF('10 - Mit. Risk Register'!H45=\"\", \"\", '10 - Mit. Risk Register'!H45)","v":0},{"$f":"IF('10 - Mit. Risk Register'!H45=\"\",\"\",'10 - Mit. Risk Register'!H45)","v":0},0,{"$f":"IF('10 - Mit. Risk Register'!I45=\"\",\"\",'10 - Mit. Risk Register'!I45)","v":0},{"$f":"IF('10 - Mit. Risk Register'!J45=\"\",\"\",'10 - Mit. Risk Register'!J45)","v":""}]
[null,null,null,null,null,null,null,null,null,null,null,null,null,null,null,null,null,null,null,null,null,null,null,null,null,null,null,null,null,null,null,null,null,null,null,null,null,null,null,null,null,null,null,null,null,{"$f":"IF('10 - Mit. Risk Register'!A46=\"\",\"\",'10 - Mit. Risk Register'!A46)","v":"PD-7"},{"$f":"IF('10 - Mit. Risk Register'!B46=\"\",\"\",'10 - Mit. Risk Register'!B46)","v":"Additional cost for signalized intersections."},{"$f":"IF('10 - Mit. Risk Register'!C46=\"\",\"\",'10 - Mit. Risk Register'!C46)","v":"No Impact"},{"$f":"IF('10 - Mit. Risk Register'!H46=\"\", \"\", '10 - Mit. Risk Register'!H46)","v":0},{"$f":"IF('10 - Mit. Risk Register'!H46=\"\",\"\",'10 - Mit. Risk Register'!H46)","v":0},0,{"$f":"IF('10 - Mit. Risk Register'!I46=\"\",\"\",'10 - Mit. Risk Register'!I46)","v":0},{"$f":"IF('10 - Mit. Risk Register'!J46=\"\",\"\",'10 - Mit. Risk Register'!J46)","v":""}]
[null,null,null,null,null,null,null,null,null,null,null,null,null,null,null,null,null,null,null,null,null,null,null,null,null,null,null,null,null,null,null,null,null,null,null,null,null,null,null,null,null,null,null,null,null,{"$f":"IF('10 - Mit. Risk Register'!A47=\"\",\"\",'10 - Mit. Risk Register'!A47)","v":"PD-9"},{"$f":"IF('10 - Mit. Risk Register'!B47=\"\",\"\",'10 - Mit. Risk Register'!B47)","v":"Rehabilitate instead of reconstruct existing roadway (e.g., overlay instead)."},{"$f":"IF('10 - Mit. Risk Register'!C47=\"\",\"\",'10 - Mit. Risk Register'!C47)","v":"No Impact"},{"$f":"IF('10 - Mit. Risk Register'!H47=\"\", \"\", '10 - Mit. Risk Register'!H47)","v":0},{"$f":"IF('10 - Mit. Risk Register'!H47=\"\",\"\",'10 - Mit. Risk Register'!H47)","v":0},0,{"$f":"IF('10 - Mit. Risk Register'!I47=\"\",\"\",'10 - Mit. Risk Register'!I47)","v":0},{"$f":"IF('10 - Mit. Risk Register'!J47=\"\",\"\",'10 - Mit. Risk Register'!J47)","v":""}]
[null,null,null,null,null,null,null,null,null,null,null,null,null,null,null,null,null,null,null,null,null,null,null,null,null,null,null,null,null,null,null,null,null,null,null,null,null,null,null,null,null,null,null,null,null,{"$f":"IF('10 - Mit. Risk Register'!A48=\"\",\"\",'10 - Mit. Risk Register'!A48)","v":"PD-10"},{"$f":"IF('10 - Mit. Risk Register'!B48=\"\",\"\",'10 - Mit. Risk Register'!B48)","v":"Change in stormwater design standards."},{"$f":"IF('10 - Mit. Risk Register'!C48=\"\",\"\",'10 - Mit. Risk Register'!C48)","v":"No Impact"},{"$f":"IF('10 - Mit. Risk Register'!H48=\"\", \"\", '10 - Mit. Risk Register'!H48)","v":0},{"$f":"IF('10 - Mit. Risk Register'!H48=\"\",\"\",'10 - Mit. Risk Register'!H48)","v":0},0,{"$f":"IF('10 - Mit. Risk Register'!I48=\"\",\"\",'10 - Mit. Risk Register'!I48)","v":0},{"$f":"IF('10 - Mit. Risk Register'!J48=\"\",\"\",'10 - Mit. Risk Register'!J48)","v":""}]
[null,null,null,null,null,null,null,null,null,null,null,null,null,null,null,null,null,null,null,null,null,null,null,null,null,null,null,null,null,null,null,null,null,null,null,null,null,null,null,null,null,null,null,null,null,{"$f":"IF('10 - Mit. Risk Register'!A49=\"\",\"\",'10 - Mit. Risk Register'!A49)","v":"EP-1"},{"$f":"IF('10 - Mit. Risk Register'!B49=\"\",\"\",'10 - Mit. Risk Register'!B49)","v":"Challenge to environmental determination or permits"},{"$f":"IF('10 - Mit. Risk Register'!C49=\"\",\"\",'10 - Mit. Risk Register'!C49)","v":"No Impact"},{"$f":"IF('10 - Mit. Risk Register'!H49=\"\", \"\", '10 - Mit. Risk Register'!H49)","v":0},{"$f":"IF('10 - Mit. Risk Register'!H49=\"\",\"\",'10 - Mit. Risk Register'!H49)","v":0},0,{"$f":"IF('10 - Mit. Risk Register'!I49=\"\",\"\",'10 - Mit. Risk Register'!I49)","v":0},{"$f":"IF('10 - Mit. Risk Register'!J49=\"\",\"\",'10 - Mit. Risk Register'!J49)","v":""}]
[null,null,null,null,null,null,null,null,null,null,null,null,null,null,null,null,null,null,null,null,null,null,null,null,null,null,null,null,null,null,null,null,null,null,null,null,null,null,null,null,null,null,null,null,null,{"$f":"IF('10 - Mit. Risk Register'!A50=\"\",\"\",'10 - Mit. Risk Register'!A50)","v":"RR-4"},{"$f":"IF('10 - Mit. Risk Register'!B50=\"\",\"\",'10 - Mit. Risk Register'!B50)","v":"Additional relocation or demolition required"},{"$f":"IF('10 - Mit. Risk Register'!C50=\"\",\"\",'10 - Mit. Risk Register'!C50)","v":"No Impact"},{"$f":"IF('10 - Mit. Risk Register'!H50=\"\", \"\", '10 - Mit. Risk Register'!H50)","v":0},{"$f":"IF('10 - Mit. Risk Register'!H50=\"\",\"\",'10 - Mit. Risk Register'!H50)","v":0},0,{"$f":"IF('10 - Mit. Risk Register'!I50=\"\",\"\",'10 - Mit. Risk Register'!I50)","v":0},{"$f":"IF('10 - Mit. Risk Register'!J50=\"\",\"\",'10 - Mit. Risk Register'!J50)","v":""}]
[null,null,null,null,null,null,null,null,null,null,null,null,null,null,null,null,null,null,null,null,null,null,null,null,null,null,null,null,null,null,null,null,null,null,null,null,null,null,null,null,null,null,null,null,null,{"$f":"IF('10 - Mit. Risk Register'!A51=\"\",\"\",'10 - Mit. Risk Register'!A51)","v":"RR-5"},{"$f":"IF('10 - Mit. Risk Register'!B51=\"\",\"\",'10 - Mit. Risk Register'!B51)","v":"Additional ROW required for planned project"},{"$f":"IF('10 - Mit. Risk Register'!C51=\"\",\"\",'10 - Mit. Risk Register'!C51)","v":"No Impact"},{"$f":"IF('10 - Mit. Risk Register'!H51=\"\", \"\", '10 - Mit. Risk Register'!H51)","v":0},{"$f":"IF('10 - Mit. Risk Register'!H51=\"\",\"\",'10 - Mit. Risk Register'!H51)","v":0},0,{"$f":"IF('10 - Mit. Risk Register'!I51=\"\",\"\",'10 - Mit. Risk Register'!I51)","v":0},{"$f":"IF('10 - Mit. Risk Register'!J51=\"\",\"\",'10 - Mit. Risk Register'!J51)","v":""}]
[null,null,null,null,null,null,null,null,null,null,null,null,null,null,null,null,null,null,null,null,null,null,null,null,null,null,null,null,null,null,null,null,null,null,null,null,null,null,null,null,null,null,null,null,null,{"$f":"IF('10 - Mit. Risk Register'!A52=\"\",\"\",'10 - Mit. Risk Register'!A52)","v":"RR-9"},{"$f":"IF('10 - Mit. Risk Register'!B52=\"\",\"\",'10 - Mit. Risk Register'!B52)","v":"Other utility relocations not completed on time"},{"$f":"IF('10 - Mit. Risk Register'!C52=\"\",\"\",'10 - Mit. Risk Register'!C52)","v":"No Impact"},{"$f":"IF('10 - Mit. Risk Register'!H52=\"\", \"\", '10 - Mit. Risk Register'!H52)","v":0},{"$f":"IF('10 - Mit. Risk Register'!H52=\"\",\"\",'10 - Mit. Risk Register'!H52)","v":0},0,{"$f":"IF('10 - Mit. Risk Register'!I52=\"\",\"\",'10 - Mit. Risk Register'!I52)","v":0},{"$f":"IF('10 - Mit. Risk Register'!J52=\"\",\"\",'10 - Mit. Risk Register'!J52)","v":""}]
[null,null,null,null,null,null,null,null,null,null,null,null,null,null,null,null,null,null,null,null,null,null,null,null,null,null,null,null,null,null,null,null,null,null,null,null,null,null,null,null,null,null,null,null,null,{"$f":"IF('10 - Mit. Risk Register'!A53=\"\",\"\",'10 - Mit. Risk Register'!A53)","v":"RR-10"},{"$f":"IF('10 - Mit. Risk Register'!B53=\"\",\"\",'10 - Mit. Risk Register'!B53)","v":"Damage existing utility or encounter unanticipated utility during construction"},{"$f":"IF('10 - Mit. Risk Register'!C53=\"\",\"\",'10 - Mit. Risk Register'!C53)","v":"No Impact"},{"$f":"IF('10 - Mit. Risk Register'!H53=\"\", \"\", '10 - Mit. Risk Register'!H53)","v":0},{"$f":"IF('10 - Mit. Risk Register'!H53=\"\",\"\",'10 - Mit. Risk Register'!H53)","v":0},0,{"$f":"IF('10 - Mit. Risk Register'!I53=\"\",\"\",'10 - Mit. Risk Register'!I53)","v":0},{"$f":"IF('10 - Mit. Risk Register'!J53=\"\",\"\",'10 - Mit. Risk Register'!J53)","v":""}]
[null,null,null,null,null,null,null,null,null,null,null,null,null,null,null,null,null,null,null,null,null,null,null,null,null,null,null,null,null,null,null,null,null,null,null,null,null,null,null,null,null,null,null,null,null,{"$f":"IF('10 - Mit. Risk Register'!A54=\"\",\"\",'10 - Mit. Risk Register'!A54)","v":"PR-3"},{"$f":"IF('10 - Mit. Risk Register'!B54=\"\",\"\",'10 - Mit. Risk Register'!B54)","v":"Material-supply issues"},{"$f":"IF('10 - Mit. Risk Register'!C54=\"\",\"\",'10 - Mit. Risk Register'!C54)","v":"No Impact"},{"$f":"IF('10 - Mit. Risk Register'!H54=\"\", \"\", '10 - Mit. Risk Register'!H54)","v":0},{"$f":"IF('10 - Mit. Risk Register'!H54=\"\",\"\",'10 - Mit. Risk Register'!H54)","v":0},0,{"$f":"IF('10 - Mit. Risk Register'!I54=\"\",\"\",'10 - Mit. Risk Register'!I54)","v":0},{"$f":"IF('10 - Mit. Risk Register'!J54=\"\",\"\",'10 - Mit. Risk Register'!J54)","v":""}]
[null,null,null,null,null,null,null,null,null,null,null,null,null,null,null,null,null,null,null,null,null,null,null,null,null,null,null,null,null,null,null,null,null,null,null,null,null,null,null,null,null,null,null,null,null,{"$f":"IF('10 - Mit. Risk Register'!A55=\"\",\"\",'10 - Mit. Risk Register'!A55)","v":"PR-4"},{"$f":"IF('10 - Mit. Risk Register'!B55=\"\",\"\",'10 - Mit. Risk Register'!B55)","v":"Change in project delivery method"},{"$f":"IF('10 - Mit. Risk Register'!C55=\"\",\"\",'10 - Mit. Risk Register'!C55)","v":"No Impact"},{"$f":"IF('10 - Mit. Risk Register'!H55=\"\", \"\", '10 - Mit. Risk Register'!H55)","v":0},{"$f":"IF('10 - Mit. Risk Register'!H55=\"\",\"\",'10 - Mit. Risk Register'!H55)","v":0},0,{"$f":"IF('10 - Mit. Risk Register'!I55=\"\",\"\",'10 - Mit. Risk Register'!I55)","v":0},{"$f":"IF('10 - Mit. Risk Register'!J55=\"\",\"\",'10 - Mit. Risk Register'!J55)","v":""}]
[null,null,null,null,null,null,null,null,null,null,null,null,null,null,null,null,null,null,null,null,null,null,null,null,null,null,null,null,null,null,null,null,null,null,null,null,null,null,null,null,null,null,null,null,null,{"$f":"IF('10 - Mit. Risk Register'!A56=\"\",\"\",'10 - Mit. Risk Register'!A56)","v":"PR-5"},{"$f":"IF('10 - Mit. Risk Register'!B56=\"\",\"\",'10 - Mit. Risk Register'!B56)","v":"Accelerate pre-construction activities to reach NTP sooner"},{"$f":"IF('10 - Mit. Risk Register'!C56=\"\",\"\",'10 - Mit. Risk Register'!C56)","v":"No Impact"},{"$f":"IF('10 - Mit. Risk Register'!H56=\"\", \"\", '10 - Mit. Risk Register'!H56)","v":0},{"$f":"IF('10 - Mit. Risk Register'!H56=\"\",\"\",'10 - Mit. Risk Register'!H56)","v":0},0,{"$f":"IF('10 - Mit. Risk Register'!I56=\"\",\"\",'10 - Mit. Risk Register'!I56)","v":0},{"$f":"IF('10 - Mit. Risk Register'!J56=\"\",\"\",'10 - Mit. Risk Register'!J56)","v":""}]
[null,null,null,null,null,null,null,null,null,null,null,null,null,null,null,null,null,null,null,null,null,null,null,null,null,null,null,null,null,null,null,null,null,null,null,null,null,null,null,null,null,null,null,null,null,{"$f":"IF('10 - Mit. Risk Register'!A57=\"\",\"\",'10 - Mit. Risk Register'!A57)","v":"PR-6"},{"$f":"IF('10 - Mit. Risk Register'!B57=\"\",\"\",'10 - Mit. Risk Register'!B57)","v":"Use incentives to accelerate D/B construction"},{"$f":"IF('10 - Mit. Risk Register'!C57=\"\",\"\",'10 - Mit. Risk Register'!C57)","v":"No Impact"},{"$f":"IF('10 - Mit. Risk Register'!H57=\"\", \"\", '10 - Mit. Risk Register'!H57)","v":0},{"$f":"IF('10 - Mit. Risk Register'!H57=\"\",\"\",'10 - Mit. Risk Register'!H57)","v":0},0,{"$f":"IF('10 - Mit. Risk Register'!I57=\"\",\"\",'10 - Mit. Risk Register'!I57)","v":0},{"$f":"IF('10 - Mit. Risk Register'!J57=\"\",\"\",'10 - Mit. Risk Register'!J57)","v":""}]
[null,null,null,null,null,null,null,null,null,null,null,null,null,null,null,null,null,null,null,null,null,null,null,null,null,null,null,null,null,null,null,null,null,null,null,null,null,null,null,null,null,null,null,null,null,{"$f":"IF('10 - Mit. Risk Register'!A58=\"\",\"\",'10 - Mit. Risk Register'!A58)","v":"PR-7"},{"$f":"IF('10 - Mit. Risk Register'!B58=\"\",\"\",'10 - Mit. Risk Register'!B58)","v":"Issues with D/B design or submittals"},{"$f":"IF('10 - Mit. Risk Register'!C58=\"\",\"\",'10 - Mit. Risk Register'!C58)","v":"No Impact"},{"$f":"IF('10 - Mit. Risk Register'!H58=\"\", \"\", '10 - Mit. Risk Register'!H58)","v":0},{"$f":"IF('10 - Mit. Risk Register'!H58=\"\",\"\",'10 - Mit. Risk Register'!H58)","v":0},0,{"$f":"IF('10 - Mit. Risk Register'!I58=\"\",\"\",'10 - Mit. Risk Register'!I58)","v":0},{"$f":"IF('10 - Mit. Risk Register'!J58=\"\",\"\",'10 - Mit. Risk Register'!J58)","v":""}]
[null,null,null,null,null,null,null,null,null,null,null,null,null,null,null,null,null,null,null,null,null,null,null,null,null,null,null,null,null,null,null,null,null,null,null,null,null,null,null,null,null,null,null,null,null,{"$f":"IF('10 - Mit. Risk Register'!A59=\"\",\"\",'10 - Mit. Risk Register'!A59)","v":"CR-6"},{"$f":"IF('10 - Mit. Risk Register'!B59=\"\",\"\",'10 - Mit. Risk Register'!B59)","v":"Severe weather event significantly impacts construction"},{"$f":"IF('10 - Mit. Risk Register'!C59=\"\",\"\",'10 - Mit. Risk Register'!C59)","v":"No Impact"},{"$f":"IF('10 - Mit. Risk Register'!H59=\"\", \"\", '10 - Mit. Risk Register'!H59)","v":0},{"$f":"IF('10 - Mit. Risk Register'!H59=\"\",\"\",'10 - Mit. Risk Register'!H59)","v":0},0,{"$f":"IF('10 - Mit. Risk Register'!I59=\"\",\"\",'10 - Mit. Risk Register'!I59)","v":0},{"$f":"IF('10 - Mit. Risk Register'!J59=\"\",\"\",'10 - Mit. Risk Register'!J59)","v":""}]
[null,null,null,null,null,null,null,null,null,null,null,null,null,null,null,null,null,null,null,null,null,null,null,null,null,null,null,null,null,null,null,null,null,null,null,null,null,null,null,null,null,null,null,null,null,{"$f":"IF('10 - Mit. Risk Register'!A60=\"\",\"\",'10 - Mit. Risk Register'!A60)","v":"CR-8"},{"$f":"IF('10 - Mit. Risk Register'!B60=\"\",\"\",'10 - Mit. Risk Register'!B60)","v":"Significant accident during construction"},{"$f":"IF('10 - Mit. Risk Register'!C60=\"\",\"\",'10 - Mit. Risk Register'!C60)","v":"No Impact"},{"$f":"IF('10 - Mit. Risk Register'!H60=\"\", \"\", '10 - Mit. Risk Register'!H60)","v":0},{"$f":"IF('10 - Mit. Risk Register'!H60=\"\",\"\",'10 - Mit. Risk Register'!H60)","v":0},0,{"$f":"IF('10 - Mit. Risk Register'!I60=\"\",\"\",'10 - Mit. Risk Register'!I60)","v":0},{"$f":"IF('10 - Mit. Risk Register'!J60=\"\",\"\",'10 - Mit. Risk Register'!J60)","v":""}]
[null,null,null,null,null,null,null,null,null,null,null,null,null,null,null,null,null,null,null,null,null,null,null,null,null,null,null,null,null,null,null,null,null,null,null,null,null,null,null,null,null,null,null,null,null,{"$f":"IF('10 - Mit. Risk Register'!A61=\"\",\"\",'10 - Mit. Risk Register'!A61)","v":"CR-10"},{"$f":"IF('10 - Mit. Risk Register'!B61=\"\",\"\",'10 - Mit. Risk Register'!B61)","v":"Fish window in Wandering Creek"},{"$f":"IF('10 - Mit. Risk Register'!C61=\"\",\"\",'10 - Mit. Risk Register'!C61)","v":"No Impact"},{"$f":"IF('10 - Mit. Risk Register'!H61=\"\", \"\", '10 - Mit. Risk Register'!H61)","v":0},{"$f":"IF('10 - Mit. Risk Register'!H61=\"\",\"\",'10 - Mit. Risk Register'!H61)","v":0},0,{"$f":"IF('10 - Mit. Risk Register'!I61=\"\",\"\",'10 - Mit. Risk Register'!I61)","v":0},{"$f":"IF('10 - Mit. Risk Register'!J61=\"\",\"\",'10 - Mit. Risk Register'!J61)","v":""}]
[null,null,null,null,null,null,null,null,null,null,null,null,null,null,null,null,null,null,null,null,null,null,null,null,null,null,null,null,null,null,null,null,null,null,null,null,null,null,null,null,null,null,null,null,null,{"$f":"IF('10 - Mit. Risk Register'!A62=\"\",\"\",'10 - Mit. Risk Register'!A62)","v":"CR-11"},{"$f":"IF('10 - Mit. Risk Register'!B62=\"\",\"\",'10 - Mit. Risk Register'!B62)","v":"Non-compliance with permits during construction"},{"$f":"IF('10 - Mit. Risk Register'!C62=\"\",\"\",'10 - Mit. Risk Register'!C62)","v":"No Impact"},{"$f":"IF('10 - Mit. Risk Register'!H62=\"\", \"\", '10 - Mit. Risk Register'!H62)","v":0},{"$f":"IF('10 - Mit. Risk Register'!H62=\"\",\"\",'10 - Mit. Risk Register'!H62)","v":0},0,{"$f":"IF('10 - Mit. Risk Register'!I62=\"\",\"\",'10 - Mit. Risk Register'!I62)","v":0},{"$f":"IF('10 - Mit. Risk Register'!J62=\"\",\"\",'10 - Mit. Risk Register'!J62)","v":""}]
[null,null,null,null,null,null,null,null,null,null,null,null,null,null,null,null,null,null,null,null,null,null,null,null,null,null,null,null,null,null,null,null,null,null,null,null,null,null,null,null,null,null,null,null,null,{"$f":"IF('10 - Mit. Risk Register'!A63=\"\",\"\",'10 - Mit. Risk Register'!A63)","v":"CR-12"},{"$f":"IF('10 - Mit. Risk Register'!B63=\"\",\"\",'10 - Mit. Risk Register'!B63)","v":"Extended overheads as a function of project delays"},{"$f":"IF('10 - Mit. Risk Register'!C63=\"\",\"\",'10 - Mit. Risk Register'!C63)","v":"No Impact"},{"$f":"IF('10 - Mit. Risk Register'!H63=\"\", \"\", '10 - Mit. Risk Register'!H63)","v":0},{"$f":"IF('10 - Mit. Risk Register'!H63=\"\",\"\",'10 - Mit. Risk Register'!H63)","v":0},0,{"$f":"IF('10 - Mit. Risk Register'!I63=\"\",\"\",'10 - Mit. Risk Register'!I63)","v":0},{"$f":"IF('10 - Mit. Risk Register'!J63=\"\",\"\",'10 - Mit. Risk Register'!J63)","v":""}]
[null,null,null,null,null,null,null,null,null,null,null,null,null,null,null,null,null,null,null,null,null,null,null,null,null,null,null,null,null,null,null,null,null,null,null,null,null,null,null,null,null,null,null,null,null,{"$f":"IF('10 - Mit. Risk Register'!A64=\"\",\"\",'10 - Mit. Risk Register'!A64)","v":""},{"$f":"IF('10 - Mit. Risk Register'!B64=\"\",\"\",'10 - Mit. Risk Register'!B64)","v":""},{"$f":"IF('10 - Mit. Risk Register'!C64=\"\",\"\",'10 - Mit. Risk Register'!C64)","v":""},{"$f":"IF('10 - Mit. Risk Register'!H64=\"\", \"\", '10 - Mit. Risk Register'!H64)","v":""},{"$f":"IF('10 - Mit. Risk Register'!H64=\"\",\"\",'10 - Mit. Risk Register'!H64)","v":""},"",{"$f":"IF('10 - Mit. Risk Register'!I64=\"\",\"\",'10 - Mit. Risk Register'!I64)","v":""},{"$f":"IF('10 - Mit. Risk Register'!J64=\"\",\"\",'10 - Mit. Risk Register'!J64)","v":""}]
[null,null,null,null,null,null,null,null,null,null,null,null,null,null,null,null,null,null,null,null,null,null,null,null,null,null,null,null,null,null,null,null,null,null,null,null,null,null,null,null,null,null,null,null,null,{"$f":"IF('10 - Mit. Risk Register'!A65=\"\",\"\",'10 - Mit. Risk Register'!A65)","v":""},{"$f":"IF('10 - Mit. Risk Register'!B65=\"\",\"\",'10 - Mit. Risk Register'!B65)","v":""},{"$f":"IF('10 - Mit. Risk Register'!C65=\"\",\"\",'10 - Mit. Risk Register'!C65)","v":""},{"$f":"IF('10 - Mit. Risk Register'!H65=\"\", \"\", '10 - Mit. Risk Register'!H65)","v":""},{"$f":"IF('10 - Mit. Risk Register'!H65=\"\",\"\",'10 - Mit. Risk Register'!H65)","v":""},"",{"$f":"IF('10 - Mit. Risk Register'!I65=\"\",\"\",'10 - Mit. Risk Register'!I65)","v":""},{"$f":"IF('10 - Mit. Risk Register'!J65=\"\",\"\",'10 - Mit. Risk Register'!J65)","v":""}]
[null,null,null,null,null,null,null,null,null,null,null,null,null,null,null,null,null,null,null,null,null,null,null,null,null,null,null,null,null,null,null,null,null,null,null,null,null,null,null,null,null,null,null,null,null,{"$f":"IF('10 - Mit. Risk Register'!A66=\"\",\"\",'10 - Mit. Risk Register'!A66)","v":""},{"$f":"IF('10 - Mit. Risk Register'!B66=\"\",\"\",'10 - Mit. Risk Register'!B66)","v":""},{"$f":"IF('10 - Mit. Risk Register'!C66=\"\",\"\",'10 - Mit. Risk Register'!C66)","v":""},{"$f":"IF('10 - Mit. Risk Register'!H66=\"\", \"\", '10 - Mit. Risk Register'!H66)","v":""},{"$f":"IF('10 - Mit. Risk Register'!H66=\"\",\"\",'10 - Mit. Risk Register'!H66)","v":""},"",{"$f":"IF('10 - Mit. Risk Register'!I66=\"\",\"\",'10 - Mit. Risk Register'!I66)","v":""},{"$f":"IF('10 - Mit. Risk Register'!J66=\"\",\"\",'10 - Mit. Risk Register'!J66)","v":""}]
[null,null,null,null,null,null,null,null,null,null,null,null,null,null,null,null,null,null,null,null,null,null,null,null,null,null,null,null,null,null,null,null,null,null,null,null,null,null,null,null,null,null,null,null,null,{"$f":"IF('10 - Mit. Risk Register'!A67=\"\",\"\",'10 - Mit. Risk Register'!A67)","v":""},{"$f":"IF('10 - Mit. Risk Register'!B67=\"\",\"\",'10 - Mit. Risk Register'!B67)","v":""},{"$f":"IF('10 - Mit. Risk Register'!C67=\"\",\"\",'10 - Mit. Risk Register'!C67)","v":""},{"$f":"IF('10 - Mit. Risk Register'!H67=\"\", \"\", '10 - Mit. Risk Register'!H67)","v":""},{"$f":"IF('10 - Mit. Risk Register'!H67=\"\",\"\",'10 - Mit. Risk Register'!H67)","v":""},"",{"$f":"IF('10 - Mit. Risk Register'!I67=\"\",\"\",'10 - Mit. Risk Register'!I67)","v":""},{"$f":"IF('10 - Mit. Risk Register'!J67=\"\",\"\",'10 - Mit. Risk Register'!J67)","v":""}]
[null,null,null,null,null,null,null,null,null,null,null,null,null,null,null,null,null,null,null,null,null,null,null,null,null,null,null,null,null,null,null,null,null,null,null,null,null,null,null,null,null,null,null,null,null,{"$f":"IF('10 - Mit. Risk Register'!A68=\"\",\"\",'10 - Mit. Risk Register'!A68)","v":""},{"$f":"IF('10 - Mit. Risk Register'!B68=\"\",\"\",'10 - Mit. Risk Register'!B68)","v":""},{"$f":"IF('10 - Mit. Risk Register'!C68=\"\",\"\",'10 - Mit. Risk Register'!C68)","v":""},{"$f":"IF('10 - Mit. Risk Register'!H68=\"\", \"\", '10 - Mit. Risk Register'!H68)","v":""},{"$f":"IF('10 - Mit. Risk Register'!H68=\"\",\"\",'10 - Mit. Risk Register'!H68)","v":""},"",{"$f":"IF('10 - Mit. Risk Register'!I68=\"\",\"\",'10 - Mit. Risk Register'!I68)","v":""},{"$f":"IF('10 - Mit. Risk Register'!J68=\"\",\"\",'10 - Mit. Risk Register'!J68)","v":""}]
[null,null,null,null,null,null,null,null,null,null,null,null,null,null,null,null,null,null,null,null,null,null,null,null,null,null,null,null,null,null,null,null,null,null,null,null,null,null,null,null,null,null,null,null,null,{"$f":"IF('10 - Mit. Risk Register'!A69=\"\",\"\",'10 - Mit. Risk Register'!A69)","v":""},{"$f":"IF('10 - Mit. Risk Register'!B69=\"\",\"\",'10 - Mit. Risk Register'!B69)","v":""},{"$f":"IF('10 - Mit. Risk Register'!C69=\"\",\"\",'10 - Mit. Risk Register'!C69)","v":""},{"$f":"IF('10 - Mit. Risk Register'!H69=\"\", \"\", '10 - Mit. Risk Register'!H69)","v":""},{"$f":"IF('10 - Mit. Risk Register'!H69=\"\",\"\",'10 - Mit. Risk Register'!H69)","v":""},"",{"$f":"IF('10 - Mit. Risk Register'!I69=\"\",\"\",'10 - Mit. Risk Register'!I69)","v":""},{"$f":"IF('10 - Mit. Risk Register'!J69=\"\",\"\",'10 - Mit. Risk Register'!J69)","v":""}]
[null,null,null,null,null,null,null,null,null,null,null,null,null,null,null,null,null,null,null,null,null,null,null,null,null,null,null,null,null,null,null,null,null,null,null,null,null,null,null,null,null,null,null,null,null,{"$f":"IF('10 - Mit. Risk Register'!A70=\"\",\"\",'10 - Mit. Risk Register'!A70)","v":""},{"$f":"IF('10 - Mit. Risk Register'!B70=\"\",\"\",'10 - Mit. Risk Register'!B70)","v":""},{"$f":"IF('10 - Mit. Risk Register'!C70=\"\",\"\",'10 - Mit. Risk Register'!C70)","v":""},{"$f":"IF('10 - Mit. Risk Register'!H70=\"\", \"\", '10 - Mit. Risk Register'!H70)","v":""},{"$f":"IF('10 - Mit. Risk Register'!H70=\"\",\"\",'10 - Mit. Risk Register'!H70)","v":""},{"$f":"IFERROR(IF(AX220=\"\",\"\",(AX220-AW220)/ABS(AW220)),0)","v":""},{"$f":"IF('10 - Mit. Risk Register'!I70=\"\",\"\",'10 - Mit. Risk Register'!I70)","v":""},{"$f":"IF('10 - Mit. Risk Register'!J70=\"\",\"\",'10 - Mit. Risk Register'!J70)","v":""}]
[null,null,null,null,null,null,null,null,null,null,null,null,null,null,null,null,null,null,null,null,null,null,null,null,null,null,null,null,null,null,null,null,null,null,null,null,null,null,null,null,null,null,null,null,null,{"$f":"IF('10 - Mit. Risk Register'!A71=\"\",\"\",'10 - Mit. Risk Register'!A71)","v":""},{"$f":"IF('10 - Mit. Risk Register'!B71=\"\",\"\",'10 - Mit. Risk Register'!B71)","v":""},{"$f":"IF('10 - Mit. Risk Register'!C71=\"\",\"\",'10 - Mit. Risk Register'!C71)","v":""},{"$f":"IF('10 - Mit. Risk Register'!H71=\"\", \"\", '10 - Mit. Risk Register'!H71)","v":""},{"$f":"IF('10 - Mit. Risk Register'!H71=\"\",\"\",'10 - Mit. Risk Register'!H71)","v":""},"",{"$f":"IF('10 - Mit. Risk Register'!I71=\"\",\"\",'10 - Mit. Risk Register'!I71)","v":""},{"$f":"IF('10 - Mit. Risk Register'!J71=\"\",\"\",'10 - Mit. Risk Register'!J71)","v":""}]
[null,null,null,null,null,null,null,null,null,null,null,null,null,null,null,null,null,null,null,null,null,null,null,null,null,null,null,null,null,null,null,null,null,null,null,null,null,null,null,null,null,null,null,null,null,{"$f":"IF('10 - Mit. Risk Register'!A72=\"\",\"\",'10 - Mit. Risk Register'!A72)","v":""},{"$f":"IF('10 - Mit. Risk Register'!B72=\"\",\"\",'10 - Mit. Risk Register'!B72)","v":""},{"$f":"IF('10 - Mit. Risk Register'!C72=\"\",\"\",'10 - Mit. Risk Register'!C72)","v":""},{"$f":"IF('10 - Mit. Risk Register'!H72=\"\", \"\", '10 - Mit. Risk Register'!H72)","v":""},{"$f":"IF('10 - Mit. Risk Register'!H72=\"\",\"\",'10 - Mit. Risk Register'!H72)","v":""},"",{"$f":"IF('10 - Mit. Risk Register'!I72=\"\",\"\",'10 - Mit. Risk Register'!I72)","v":""},{"$f":"IF('10 - Mit. Risk Register'!J72=\"\",\"\",'10 - Mit. Risk Register'!J72)","v":""}]
[null,null,null,null,null,null,null,null,null,null,null,null,null,null,null,null,null,null,null,null,null,null,null,null,null,null,null,null,null,null,null,null,null,null,null,null,null,null,null,null,null,null,null,null,null,{"$f":"IF('10 - Mit. Risk Register'!A73=\"\",\"\",'10 - Mit. Risk Register'!A73)","v":""},{"$f":"IF('10 - Mit. Risk Register'!B73=\"\",\"\",'10 - Mit. Risk Register'!B73)","v":""},{"$f":"IF('10 - Mit. Risk Register'!C73=\"\",\"\",'10 - Mit. Risk Register'!C73)","v":""},{"$f":"IF('10 - Mit. Risk Register'!H73=\"\", \"\", '10 - Mit. Risk Register'!H73)","v":""},{"$f":"IF('10 - Mit. Risk Register'!H73=\"\",\"\",'10 - Mit. Risk Register'!H73)","v":""},"",{"$f":"IF('10 - Mit. Risk Register'!I73=\"\",\"\",'10 - Mit. Risk Register'!I73)","v":""},{"$f":"IF('10 - Mit. Risk Register'!J73=\"\",\"\",'10 - Mit. Risk Register'!J73)","v":""}]
[null,null,null,null,null,null,null,null,null,null,null,null,null,null,null,null,null,null,null,null,null,null,null,null,null,null,null,null,null,null,null,null,null,null,null,null,null,null,null,null,null,null,null,null,null,{"$f":"IF('10 - Mit. Risk Register'!A74=\"\",\"\",'10 - Mit. Risk Register'!A74)","v":""},{"$f":"IF('10 - Mit. Risk Register'!B74=\"\",\"\",'10 - Mit. Risk Register'!B74)","v":""},{"$f":"IF('10 - Mit. Risk Register'!C74=\"\",\"\",'10 - Mit. Risk Register'!C74)","v":""},{"$f":"IF('10 - Mit. Risk Register'!H74=\"\", \"\", '10 - Mit. Risk Register'!H74)","v":""},{"$f":"IF('10 - Mit. Risk Register'!H74=\"\",\"\",'10 - Mit. Risk Register'!H74)","v":""},"",{"$f":"IF('10 - Mit. Risk Register'!I74=\"\",\"\",'10 - Mit. Risk Register'!I74)","v":""},{"$f":"IF('10 - Mit. Risk Register'!J74=\"\",\"\",'10 - Mit. Risk Register'!J74)","v":""}]
[null,null,null,null,null,null,null,null,null,null,null,null,null,null,null,null,null,null,null,null,null,null,null,null,null,null,null,null,null,null,null,null,null,null,null,null,null,null,null,null,null,null,null,null,null,{"$f":"IF('10 - Mit. Risk Register'!A75=\"\",\"\",'10 - Mit. Risk Register'!A75)","v":""},{"$f":"IF('10 - Mit. Risk Register'!B75=\"\",\"\",'10 - Mit. Risk Register'!B75)","v":""},{"$f":"IF('10 - Mit. Risk Register'!C75=\"\",\"\",'10 - Mit. Risk Register'!C75)","v":""},{"$f":"IF('10 - Mit. Risk Register'!H75=\"\", \"\", '10 - Mit. Risk Register'!H75)","v":""},{"$f":"IF('10 - Mit. Risk Register'!H75=\"\",\"\",'10 - Mit. Risk Register'!H75)","v":""},"",{"$f":"IF('10 - Mit. Risk Register'!I75=\"\",\"\",'10 - Mit. Risk Register'!I75)","v":""},{"$f":"IF('10 - Mit. Risk Register'!J75=\"\",\"\",'10 - Mit. Risk Register'!J75)","v":""}]
[null,null,null,null,null,null,null,null,null,null,null,null,null,null,null,null,null,null,null,null,null,null,null,null,null,null,null,null,null,null,null,null,null,null,null,null,null,null,null,null,null,null,null,null,null,{"$f":"IF('10 - Mit. Risk Register'!A76=\"\",\"\",'10 - Mit. Risk Register'!A76)","v":""},{"$f":"IF('10 - Mit. Risk Register'!B76=\"\",\"\",'10 - Mit. Risk Register'!B76)","v":""},{"$f":"IF('10 - Mit. Risk Register'!C76=\"\",\"\",'10 - Mit. Risk Register'!C76)","v":""},{"$f":"IF('10 - Mit. Risk Register'!H76=\"\", \"\", '10 - Mit. Risk Register'!H76)","v":""},{"$f":"IF('10 - Mit. Risk Register'!H76=\"\",\"\",'10 - Mit. Risk Register'!H76)","v":""},"",{"$f":"IF('10 - Mit. Risk Register'!I76=\"\",\"\",'10 - Mit. Risk Register'!I76)","v":""},{"$f":"IF('10 - Mit. Risk Register'!J76=\"\",\"\",'10 - Mit. Risk Register'!J76)","v":""}]
[null,null,null,null,null,null,null,null,null,null,null,null,null,null,null,null,null,null,null,null,null,null,null,null,null,null,null,null,null,null,null,null,null,null,null,null,null,null,null,null,null,null,null,null,null,{"$f":"IF('10 - Mit. Risk Register'!A77=\"\",\"\",'10 - Mit. Risk Register'!A77)","v":""},{"$f":"IF('10 - Mit. Risk Register'!B77=\"\",\"\",'10 - Mit. Risk Register'!B77)","v":""},{"$f":"IF('10 - Mit. Risk Register'!C77=\"\",\"\",'10 - Mit. Risk Register'!C77)","v":""},{"$f":"IF('10 - Mit. Risk Register'!H77=\"\", \"\", '10 - Mit. Risk Register'!H77)","v":""},{"$f":"IF('10 - Mit. Risk Register'!H77=\"\",\"\",'10 - Mit. Risk Register'!H77)","v":""},"",{"$f":"IF('10 - Mit. Risk Register'!I77=\"\",\"\",'10 - Mit. Risk Register'!I77)","v":""},{"$f":"IF('10 - Mit. Risk Register'!J77=\"\",\"\",'10 - Mit. Risk Register'!J77)","v":""}]
[null,null,null,null,null,null,null,null,null,null,null,null,null,null,null,null,null,null,null,null,null,null,null,null,null,null,null,null,null,null,null,null,null,null,null,null,null,null,null,null,null,null,null,null,null,{"$f":"IF('10 - Mit. Risk Register'!A78=\"\",\"\",'10 - Mit. Risk Register'!A78)","v":""},{"$f":"IF('10 - Mit. Risk Register'!B78=\"\",\"\",'10 - Mit. Risk Register'!B78)","v":""},{"$f":"IF('10 - Mit. Risk Register'!C78=\"\",\"\",'10 - Mit. Risk Register'!C78)","v":""},{"$f":"IF('10 - Mit. Risk Register'!H78=\"\", \"\", '10 - Mit. Risk Register'!H78)","v":""},{"$f":"IF('10 - Mit. Risk Register'!H78=\"\",\"\",'10 - Mit. Risk Register'!H78)","v":""},"",{"$f":"IF('10 - Mit. Risk Register'!I78=\"\",\"\",'10 - Mit. Risk Register'!I78)","v":""},{"$f":"IF('10 - Mit. Risk Register'!J78=\"\",\"\",'10 - Mit. Risk Register'!J78)","v":""}]
[null,null,null,null,null,null,null,null,null,null,null,null,null,null,null,null,null,null,null,null,null,null,null,null,null,null,null,null,null,null,null,null,null,null,null,null,null,null,null,null,null,null,null,null,null,{"$f":"IF('10 - Mit. Risk Register'!A79=\"\",\"\",'10 - Mit. Risk Register'!A79)","v":""},{"$f":"IF('10 - Mit. Risk Register'!B79=\"\",\"\",'10 - Mit. Risk Register'!B79)","v":""},{"$f":"IF('10 - Mit. Risk Register'!C79=\"\",\"\",'10 - Mit. Risk Register'!C79)","v":""},{"$f":"IF('10 - Mit. Risk Register'!H79=\"\", \"\", '10 - Mit. Risk Register'!H79)","v":""},{"$f":"IF('10 - Mit. Risk Register'!H79=\"\",\"\",'10 - Mit. Risk Register'!H79)","v":""},"",{"$f":"IF('10 - Mit. Risk Register'!I79=\"\",\"\",'10 - Mit. Risk Register'!I79)","v":""},{"$f":"IF('10 - Mit. Risk Register'!J79=\"\",\"\",'10 - Mit. Risk Register'!J79)","v":""}]
[null,null,null,null,null,null,null,null,null,null,null,null,null,null,null,null,null,null,null,null,null,null,null,null,null,null,null,null,null,null,null,null,null,null,null,null,null,null,null,null,null,null,null,null,null,{"$f":"IF('10 - Mit. Risk Register'!A80=\"\",\"\",'10 - Mit. Risk Register'!A80)","v":""},{"$f":"IF('10 - Mit. Risk Register'!B80=\"\",\"\",'10 - Mit. Risk Register'!B80)","v":""},{"$f":"IF('10 - Mit. Risk Register'!C80=\"\",\"\",'10 - Mit. Risk Register'!C80)","v":""},{"$f":"IF('10 - Mit. Risk Register'!H80=\"\", \"\", '10 - Mit. Risk Register'!H80)","v":""},{"$f":"IF('10 - Mit. Risk Register'!H80=\"\",\"\",'10 - Mit. Risk Register'!H80)","v":""},"",{"$f":"IF('10 - Mit. Risk Register'!I80=\"\",\"\",'10 - Mit. Risk Register'!I80)","v":""},{"$f":"IF('10 - Mit. Risk Register'!J80=\"\",\"\",'10 - Mit. Risk Register'!J80)","v":""}]
[null,null,null,null,null,null,null,null,null,null,null,null,null,null,null,null,null,null,null,null,null,null,null,null,null,null,null,null,null,null,null,null,null,null,null,null,null,null,null,null,null,null,null,null,null,{"$f":"IF('10 - Mit. Risk Register'!A81=\"\",\"\",'10 - Mit. Risk Register'!A81)","v":""},{"$f":"IF('10 - Mit. Risk Register'!B81=\"\",\"\",'10 - Mit. Risk Register'!B81)","v":""},{"$f":"IF('10 - Mit. Risk Register'!C81=\"\",\"\",'10 - Mit. Risk Register'!C81)","v":""},{"$f":"IF('10 - Mit. Risk Register'!H81=\"\", \"\", '10 - Mit. Risk Register'!H81)","v":""},{"$f":"IF('10 - Mit. Risk Register'!H81=\"\",\"\",'10 - Mit. Risk Register'!H81)","v":""},"",{"$f":"IF('10 - Mit. Risk Register'!I81=\"\",\"\",'10 - Mit. Risk Register'!I81)","v":""},{"$f":"IF('10 - Mit. Risk Register'!J81=\"\",\"\",'10 - Mit. Risk Register'!J81)","v":""}]
[null,null,null,null,null,null,null,null,null,null,null,null,null,null,null,null,null,null,null,null,null,null,null,null,null,null,null,null,null,null,null,null,null,null,null,null,null,null,null,null,null,null,null,null,null,{"$f":"IF('10 - Mit. Risk Register'!A82=\"\",\"\",'10 - Mit. Risk Register'!A82)","v":""},{"$f":"IF('10 - Mit. Risk Register'!B82=\"\",\"\",'10 - Mit. Risk Register'!B82)","v":""},{"$f":"IF('10 - Mit. Risk Register'!C82=\"\",\"\",'10 - Mit. Risk Register'!C82)","v":""},{"$f":"IF('10 - Mit. Risk Register'!H82=\"\", \"\", '10 - Mit. Risk Register'!H82)","v":""},{"$f":"IF('10 - Mit. Risk Register'!H82=\"\",\"\",'10 - Mit. Risk Register'!H82)","v":""},"",{"$f":"IF('10 - Mit. Risk Register'!I82=\"\",\"\",'10 - Mit. Risk Register'!I82)","v":""},{"$f":"IF('10 - Mit. Risk Register'!J82=\"\",\"\",'10 - Mit. Risk Register'!J82)","v":""}]
[null,null,null,null,null,null,null,null,null,null,null,null,null,null,null,null,null,null,null,null,null,null,null,null,null,null,null,null,null,null,null,null,null,null,null,null,null,null,null,null,null,null,null,null,null,{"$f":"IF('10 - Mit. Risk Register'!A83=\"\",\"\",'10 - Mit. Risk Register'!A83)","v":""},{"$f":"IF('10 - Mit. Risk Register'!B83=\"\",\"\",'10 - Mit. Risk Register'!B83)","v":""},{"$f":"IF('10 - Mit. Risk Register'!C83=\"\",\"\",'10 - Mit. Risk Register'!C83)","v":""},{"$f":"IF('10 - Mit. Risk Register'!H83=\"\", \"\", '10 - Mit. Risk Register'!H83)","v":""},{"$f":"IF('10 - Mit. Risk Register'!H83=\"\",\"\",'10 - Mit. Risk Register'!H83)","v":""},"",{"$f":"IF('10 - Mit. Risk Register'!I83=\"\",\"\",'10 - Mit. Risk Register'!I83)","v":""},{"$f":"IF('10 - Mit. Risk Register'!J83=\"\",\"\",'10 - Mit. Risk Register'!J83)","v":""}]
[null,null,null,null,null,null,null,null,null,null,null,null,null,null,null,null,null,null,null,null,null,null,null,null,null,null,null,null,null,null,null,null,null,null,null,null,null,null,null,null,null,null,null,null,null,{"$f":"IF('10 - Mit. Risk Register'!A84=\"\",\"\",'10 - Mit. Risk Register'!A84)","v":""},{"$f":"IF('10 - Mit. Risk Register'!B84=\"\",\"\",'10 - Mit. Risk Register'!B84)","v":""},{"$f":"IF('10 - Mit. Risk Register'!C84=\"\",\"\",'10 - Mit. Risk Register'!C84)","v":""},{"$f":"IF('10 - Mit. Risk Register'!H84=\"\", \"\", '10 - Mit. Risk Register'!H84)","v":""},{"$f":"IF('10 - Mit. Risk Register'!H84=\"\",\"\",'10 - Mit. Risk Register'!H84)","v":""},"",{"$f":"IF('10 - Mit. Risk Register'!I84=\"\",\"\",'10 - Mit. Risk Register'!I84)","v":""},{"$f":"IF('10 - Mit. Risk Register'!J84=\"\",\"\",'10 - Mit. Risk Register'!J84)","v":""}]
[null,null,null,null,null,null,null,null,null,null,null,null,null,null,null,null,null,null,null,null,null,null,null,null,null,null,null,null,null,null,null,null,null,null,null,null,null,null,null,null,null,null,null,null,null,{"$f":"IF('10 - Mit. Risk Register'!A85=\"\",\"\",'10 - Mit. Risk Register'!A85)","v":""},{"$f":"IF('10 - Mit. Risk Register'!B85=\"\",\"\",'10 - Mit. Risk Register'!B85)","v":""},{"$f":"IF('10 - Mit. Risk Register'!C85=\"\",\"\",'10 - Mit. Risk Register'!C85)","v":""},{"$f":"IF('10 - Mit. Risk Register'!H85=\"\", \"\", '10 - Mit. Risk Register'!H85)","v":""},{"$f":"IF('10 - Mit. Risk Register'!H85=\"\",\"\",'10 - Mit. Risk Register'!H85)","v":""},"",{"$f":"IF('10 - Mit. Risk Register'!I85=\"\",\"\",'10 - Mit. Risk Register'!I85)","v":""},{"$f":"IF('10 - Mit. Risk Register'!J85=\"\",\"\",'10 - Mit. Risk Register'!J85)","v":""}]
[null,null,null,null,null,null,null,null,null,null,null,null,null,null,null,null,null,null,null,null,null,null,null,null,null,null,null,null,null,null,null,null,null,null,null,null,null,null,null,null,null,null,null,null,null,{"$f":"IF('10 - Mit. Risk Register'!A86=\"\",\"\",'10 - Mit. Risk Register'!A86)","v":""},{"$f":"IF('10 - Mit. Risk Register'!B86=\"\",\"\",'10 - Mit. Risk Register'!B86)","v":""},{"$f":"IF('10 - Mit. Risk Register'!C86=\"\",\"\",'10 - Mit. Risk Register'!C86)","v":""},{"$f":"IF('10 - Mit. Risk Register'!H86=\"\", \"\", '10 - Mit. Risk Register'!H86)","v":""},{"$f":"IF('10 - Mit. Risk Register'!H86=\"\",\"\",'10 - Mit. Risk Register'!H86)","v":""},"",{"$f":"IF('10 - Mit. Risk Register'!I86=\"\",\"\",'10 - Mit. Risk Register'!I86)","v":""},{"$f":"IF('10 - Mit. Risk Register'!J86=\"\",\"\",'10 - Mit. Risk Register'!J86)","v":""}]
[null,null,null,null,null,null,null,null,null,null,null,null,null,null,null,null,null,null,null,null,null,null,null,null,null,null,null,null,null,null,null,null,null,null,null,null,null,null,null,null,null,null,null,null,null,{"$f":"IF('10 - Mit. Risk Register'!A87=\"\",\"\",'10 - Mit. Risk Register'!A87)","v":""},{"$f":"IF('10 - Mit. Risk Register'!B87=\"\",\"\",'10 - Mit. Risk Register'!B87)","v":""},{"$f":"IF('10 - Mit. Risk Register'!C87=\"\",\"\",'10 - Mit. Risk Register'!C87)","v":""},{"$f":"IF('10 - Mit. Risk Register'!H87=\"\", \"\", '10 - Mit. Risk Register'!H87)","v":""},{"$f":"IF('10 - Mit. Risk Register'!H87=\"\",\"\",'10 - Mit. Risk Register'!H87)","v":""},"",{"$f":"IF('10 - Mit. Risk Register'!I87=\"\",\"\",'10 - Mit. Risk Register'!I87)","v":""},{"$f":"IF('10 - Mit. Risk Register'!J87=\"\",\"\",'10 - Mit. Risk Register'!J87)","v":""}]
[null,null,null,null,null,null,null,null,null,null,null,null,null,null,null,null,null,null,null,null,null,null,null,null,null,null,null,null,null,null,null,null,null,null,null,null,null,null,null,null,null,null,null,null,null,{"$f":"IF('10 - Mit. Risk Register'!A88=\"\",\"\",'10 - Mit. Risk Register'!A88)","v":""},{"$f":"IF('10 - Mit. Risk Register'!B88=\"\",\"\",'10 - Mit. Risk Register'!B88)","v":""},{"$f":"IF('10 - Mit. Risk Register'!C88=\"\",\"\",'10 - Mit. Risk Register'!C88)","v":""},{"$f":"IF('10 - Mit. Risk Register'!H88=\"\", \"\", '10 - Mit. Risk Register'!H88)","v":""},{"$f":"IF('10 - Mit. Risk Register'!H88=\"\",\"\",'10 - Mit. Risk Register'!H88)","v":""},"",{"$f":"IF('10 - Mit. Risk Register'!I88=\"\",\"\",'10 - Mit. Risk Register'!I88)","v":""},{"$f":"IF('10 - Mit. Risk Register'!J88=\"\",\"\",'10 - Mit. Risk Register'!J88)","v":""}]
[null,null,null,null,null,null,null,null,null,null,null,null,null,null,null,null,null,null,null,null,null,null,null,null,null,null,null,null,null,null,null,null,null,null,null,null,null,null,null,null,null,null,null,null,null,{"$f":"IF('10 - Mit. Risk Register'!A89=\"\",\"\",'10 - Mit. Risk Register'!A89)","v":""},{"$f":"IF('10 - Mit. Risk Register'!B89=\"\",\"\",'10 - Mit. Risk Register'!B89)","v":""},{"$f":"IF('10 - Mit. Risk Register'!C89=\"\",\"\",'10 - Mit. Risk Register'!C89)","v":""},{"$f":"IF('10 - Mit. Risk Register'!H89=\"\", \"\", '10 - Mit. Risk Register'!H89)","v":""},{"$f":"IF('10 - Mit. Risk Register'!H89=\"\",\"\",'10 - Mit. Risk Register'!H89)","v":""},"",{"$f":"IF('10 - Mit. Risk Register'!I89=\"\",\"\",'10 - Mit. Risk Register'!I89)","v":""},{"$f":"IF('10 - Mit. Risk Register'!J89=\"\",\"\",'10 - Mit. Risk Register'!J89)","v":""}]
[null,null,null,null,null,null,null,null,null,null,null,null,null,null,null,null,null,null,null,null,null,null,null,null,null,null,null,null,null,null,null,null,null,null,null,null,null,null,null,null,null,null,null,null,null,{"$f":"IF('10 - Mit. Risk Register'!A90=\"\",\"\",'10 - Mit. Risk Register'!A90)","v":""},{"$f":"IF('10 - Mit. Risk Register'!B90=\"\",\"\",'10 - Mit. Risk Register'!B90)","v":""},{"$f":"IF('10 - Mit. Risk Register'!C90=\"\",\"\",'10 - Mit. Risk Register'!C90)","v":""},{"$f":"IF('10 - Mit. Risk Register'!H90=\"\", \"\", '10 - Mit. Risk Register'!H90)","v":""},{"$f":"IF('10 - Mit. Risk Register'!H90=\"\",\"\",'10 - Mit. Risk Register'!H90)","v":""},"",{"$f":"IF('10 - Mit. Risk Register'!I90=\"\",\"\",'10 - Mit. Risk Register'!I90)","v":""},{"$f":"IF('10 - Mit. Risk Register'!J90=\"\",\"\",'10 - Mit. Risk Register'!J90)","v":""}]
[null,null,null,null,null,null,null,null,null,null,null,null,null,null,null,null,null,null,null,null,null,null,null,null,null,null,null,null,null,null,null,null,null,null,null,null,null,null,null,null,null,null,null,null,null,{"$f":"IF('10 - Mit. Risk Register'!A91=\"\",\"\",'10 - Mit. Risk Register'!A91)","v":""},{"$f":"IF('10 - Mit. Risk Register'!B91=\"\",\"\",'10 - Mit. Risk Register'!B91)","v":""},{"$f":"IF('10 - Mit. Risk Register'!C91=\"\",\"\",'10 - Mit. Risk Register'!C91)","v":""},{"$f":"IF('10 - Mit. Risk Register'!H91=\"\", \"\", '10 - Mit. Risk Register'!H91)","v":""},{"$f":"IF('10 - Mit. Risk Register'!H91=\"\",\"\",'10 - Mit. Risk Register'!H91)","v":""},"",{"$f":"IF('10 - Mit. Risk Register'!I91=\"\",\"\",'10 - Mit. Risk Register'!I91)","v":""},{"$f":"IF('10 - Mit. Risk Register'!J91=\"\",\"\",'10 - Mit. Risk Register'!J91)","v":""}]
[null,null,null,null,null,null,null,null,null,null,null,null,null,null,null,null,null,null,null,null,null,null,null,null,null,null,null,null,null,null,null,null,null,null,null,null,null,null,null,null,null,null,null,null,null,{"$f":"IF('10 - Mit. Risk Register'!A92=\"\",\"\",'10 - Mit. Risk Register'!A92)","v":""},{"$f":"IF('10 - Mit. Risk Register'!B92=\"\",\"\",'10 - Mit. Risk Register'!B92)","v":""},{"$f":"IF('10 - Mit. Risk Register'!C92=\"\",\"\",'10 - Mit. Risk Register'!C92)","v":""},{"$f":"IF('10 - Mit. Risk Register'!H92=\"\", \"\", '10 - Mit. Risk Register'!H92)","v":""},{"$f":"IF('10 - Mit. Risk Register'!H92=\"\",\"\",'10 - Mit. Risk Register'!H92)","v":""},"",{"$f":"IF('10 - Mit. Risk Register'!I92=\"\",\"\",'10 - Mit. Risk Register'!I92)","v":""},{"$f":"IF('10 - Mit. Risk Register'!J92=\"\",\"\",'10 - Mit. Risk Register'!J92)","v":""}]
[null,null,null,null,null,null,null,null,null,null,null,null,null,null,null,null,null,null,null,null,null,null,null,null,null,null,null,null,null,null,null,null,null,null,null,null,null,null,null,null,null,null,null,null,null,{"$f":"IF('10 - Mit. Risk Register'!A93=\"\",\"\",'10 - Mit. Risk Register'!A93)","v":""},{"$f":"IF('10 - Mit. Risk Register'!B93=\"\",\"\",'10 - Mit. Risk Register'!B93)","v":""},{"$f":"IF('10 - Mit. Risk Register'!C93=\"\",\"\",'10 - Mit. Risk Register'!C93)","v":""},{"$f":"IF('10 - Mit. Risk Register'!H93=\"\", \"\", '10 - Mit. Risk Register'!H93)","v":""},{"$f":"IF('10 - Mit. Risk Register'!H93=\"\",\"\",'10 - Mit. Risk Register'!H93)","v":""},"",{"$f":"IF('10 - Mit. Risk Register'!I93=\"\",\"\",'10 - Mit. Risk Register'!I93)","v":""},{"$f":"IF('10 - Mit. Risk Register'!J93=\"\",\"\",'10 - Mit. Risk Register'!J93)","v":""}]
[null,null,null,null,null,null,null,null,null,null,null,null,null,null,null,null,null,null,null,null,null,null,null,null,null,null,null,null,null,null,null,null,null,null,null,null,null,null,null,null,null,null,null,null,null,{"$f":"IF('10 - Mit. Risk Register'!A94=\"\",\"\",'10 - Mit. Risk Register'!A94)","v":""},{"$f":"IF('10 - Mit. Risk Register'!B94=\"\",\"\",'10 - Mit. Risk Register'!B94)","v":""},{"$f":"IF('10 - Mit. Risk Register'!C94=\"\",\"\",'10 - Mit. Risk Register'!C94)","v":""},{"$f":"IF('10 - Mit. Risk Register'!H94=\"\", \"\", '10 - Mit. Risk Register'!H94)","v":""},{"$f":"IF('10 - Mit. Risk Register'!H94=\"\",\"\",'10 - Mit. Risk Register'!H94)","v":""},"",{"$f":"IF('10 - Mit. Risk Register'!I94=\"\",\"\",'10 - Mit. Risk Register'!I94)","v":""},{"$f":"IF('10 - Mit. Risk Register'!J94=\"\",\"\",'10 - Mit. Risk Register'!J94)","v":""}]
[null,null,null,null,null,null,null,null,null,null,null,null,null,null,null,null,null,null,null,null,null,null,null,null,null,null,null,null,null,null,null,null,null,null,null,null,null,null,null,null,null,null,null,null,null,{"$f":"IF('10 - Mit. Risk Register'!A95=\"\",\"\",'10 - Mit. Risk Register'!A95)","v":""},{"$f":"IF('10 - Mit. Risk Register'!B95=\"\",\"\",'10 - Mit. Risk Register'!B95)","v":""},{"$f":"IF('10 - Mit. Risk Register'!C95=\"\",\"\",'10 - Mit. Risk Register'!C95)","v":""},{"$f":"IF('10 - Mit. Risk Register'!H95=\"\", \"\", '10 - Mit. Risk Register'!H95)","v":""},{"$f":"IF('10 - Mit. Risk Register'!H95=\"\",\"\",'10 - Mit. Risk Register'!H95)","v":""},"",{"$f":"IF('10 - Mit. Risk Register'!I95=\"\",\"\",'10 - Mit. Risk Register'!I95)","v":""},{"$f":"IF('10 - Mit. Risk Register'!J95=\"\",\"\",'10 - Mit. Risk Register'!J95)","v":""}]
[null,null,null,null,null,null,null,null,null,null,null,null,null,null,null,null,null,null,null,null,null,null,null,null,null,null,null,null,null,null,null,null,null,null,null,null,null,null,null,null,null,null,null,null,null,{"$f":"IF('10 - Mit. Risk Register'!A96=\"\",\"\",'10 - Mit. Risk Register'!A96)","v":""},{"$f":"IF('10 - Mit. Risk Register'!B96=\"\",\"\",'10 - Mit. Risk Register'!B96)","v":""},{"$f":"IF('10 - Mit. Risk Register'!C96=\"\",\"\",'10 - Mit. Risk Register'!C96)","v":""},{"$f":"IF('10 - Mit. Risk Register'!H96=\"\", \"\", '10 - Mit. Risk Register'!H96)","v":""},{"$f":"IF('10 - Mit. Risk Register'!H96=\"\",\"\",'10 - Mit. Risk Register'!H96)","v":""},"",{"$f":"IF('10 - Mit. Risk Register'!I96=\"\",\"\",'10 - Mit. Risk Register'!I96)","v":""},{"$f":"IF('10 - Mit. Risk Register'!J96=\"\",\"\",'10 - Mit. Risk Register'!J96)","v":""}]
[null,null,null,null,null,null,null,null,null,null,null,null,null,null,null,null,null,null,null,null,null,null,null,null,null,null,null,null,null,null,null,null,null,null,null,null,null,null,null,null,null,null,null,null,null,{"$f":"IF('10 - Mit. Risk Register'!A97=\"\",\"\",'10 - Mit. Risk Register'!A97)","v":""},{"$f":"IF('10 - Mit. Risk Register'!B97=\"\",\"\",'10 - Mit. Risk Register'!B97)","v":""},{"$f":"IF('10 - Mit. Risk Register'!C97=\"\",\"\",'10 - Mit. Risk Register'!C97)","v":""},{"$f":"IF('10 - Mit. Risk Register'!H97=\"\", \"\", '10 - Mit. Risk Register'!H97)","v":""},{"$f":"IF('10 - Mit. Risk Register'!H97=\"\",\"\",'10 - Mit. Risk Register'!H97)","v":""},"",{"$f":"IF('10 - Mit. Risk Register'!I97=\"\",\"\",'10 - Mit. Risk Register'!I97)","v":""},{"$f":"IF('10 - Mit. Risk Register'!J97=\"\",\"\",'10 - Mit. Risk Register'!J97)","v":""}]
[null,null,null,null,null,null,null,null,null,null,null,null,null,null,null,null,null,null,null,null,null,null,null,null,null,null,null,null,null,null,null,null,null,null,null,null,null,null,null,null,null,null,null,null,null,{"$f":"IF('10 - Mit. Risk Register'!A98=\"\",\"\",'10 - Mit. Risk Register'!A98)","v":""},{"$f":"IF('10 - Mit. Risk Register'!B98=\"\",\"\",'10 - Mit. Risk Register'!B98)","v":""},{"$f":"IF('10 - Mit. Risk Register'!C98=\"\",\"\",'10 - Mit. Risk Register'!C98)","v":""},{"$f":"IF('10 - Mit. Risk Register'!H98=\"\", \"\", '10 - Mit. Risk Register'!H98)","v":""},{"$f":"IF('10 - Mit. Risk Register'!H98=\"\",\"\",'10 - Mit. Risk Register'!H98)","v":""},"",{"$f":"IF('10 - Mit. Risk Register'!I98=\"\",\"\",'10 - Mit. Risk Register'!I98)","v":""},{"$f":"IF('10 - Mit. Risk Register'!J98=\"\",\"\",'10 - Mit. Risk Register'!J98)","v":""}]
[null,null,null,null,null,null,null,null,null,null,null,null,null,null,null,null,null,null,null,null,null,null,null,null,null,null,null,null,null,null,null,null,null,null,null,null,null,null,null,null,null,null,null,null,null,{"$f":"IF('10 - Mit. Risk Register'!A99=\"\",\"\",'10 - Mit. Risk Register'!A99)","v":""},{"$f":"IF('10 - Mit. Risk Register'!B99=\"\",\"\",'10 - Mit. Risk Register'!B99)","v":""},{"$f":"IF('10 - Mit. Risk Register'!C99=\"\",\"\",'10 - Mit. Risk Register'!C99)","v":""},{"$f":"IF('10 - Mit. Risk Register'!H99=\"\", \"\", '10 - Mit. Risk Register'!H99)","v":""},{"$f":"IF('10 - Mit. Risk Register'!H99=\"\",\"\",'10 - Mit. Risk Register'!H99)","v":""},"",{"$f":"IF('10 - Mit. Risk Register'!I99=\"\",\"\",'10 - Mit. Risk Register'!I99)","v":""},{"$f":"IF('10 - Mit. Risk Register'!J99=\"\",\"\",'10 - Mit. Risk Register'!J99)","v":""}]
[null,null,null,null,null,null,null,null,null,null,null,null,null,null,null,null,null,null,null,null,null,null,null,null,null,null,null,null,null,null,null,null,null,null,null,null,null,null,null,null,null,null,null,null,null,{"$f":"IF('10 - Mit. Risk Register'!A100=\"\",\"\",'10 - Mit. Risk Register'!A100)","v":""},{"$f":"IF('10 - Mit. Risk Register'!B100=\"\",\"\",'10 - Mit. Risk Register'!B100)","v":""},{"$f":"IF('10 - Mit. Risk Register'!C100=\"\",\"\",'10 - Mit. Risk Register'!C100)","v":""},{"$f":"IF('10 - Mit. Risk Register'!H100=\"\", \"\", '10 - Mit. Risk Register'!H100)","v":""},{"$f":"IF('10 - Mit. Risk Register'!H100=\"\",\"\",'10 - Mit. Risk Register'!H100)","v":""},"",{"$f":"IF('10 - Mit. Risk Register'!I100=\"\",\"\",'10 - Mit. Risk Register'!I100)","v":""},{"$f":"IF('10 - Mit. Risk Register'!J100=\"\",\"\",'10 - Mit. Risk Register'!J100)","v":""}]
[null,null,null,null,null,null,null,null,null,null,null,null,null,null,null,null,null,null,null,null,null,null,null,null,null,null,null,null,null,null,null,null,null,null,null,null,null,null,null,null,null,null,null,null,null,{"$f":"IF('10 - Mit. Risk Register'!A101=\"\",\"\",'10 - Mit. Risk Register'!A101)","v":""},{"$f":"IF('10 - Mit. Risk Register'!B101=\"\",\"\",'10 - Mit. Risk Register'!B101)","v":""},{"$f":"IF('10 - Mit. Risk Register'!C101=\"\",\"\",'10 - Mit. Risk Register'!C101)","v":""},{"$f":"IF('10 - Mit. Risk Register'!H101=\"\", \"\", '10 - Mit. Risk Register'!H101)","v":""},{"$f":"IF('10 - Mit. Risk Register'!H101=\"\",\"\",'10 - Mit. Risk Register'!H101)","v":""},"",{"$f":"IF('10 - Mit. Risk Register'!I101=\"\",\"\",'10 - Mit. Risk Register'!I101)","v":""},{"$f":"IF('10 - Mit. Risk Register'!J101=\"\",\"\",'10 - Mit. Risk Register'!J101)","v":""}]
[null,null,null,null,null,null,null,null,null,null,null,null,null,null,null,null,null,null,null,null,null,null,null,null,null,null,null,null,null,null,null,null,null,null,null,null,null,null,null,null,null,null,null,null,null,{"$f":"IF('10 - Mit. Risk Register'!A102=\"\",\"\",'10 - Mit. Risk Register'!A102)","v":""},{"$f":"IF('10 - Mit. Risk Register'!B102=\"\",\"\",'10 - Mit. Risk Register'!B102)","v":""},{"$f":"IF('10 - Mit. Risk Register'!C102=\"\",\"\",'10 - Mit. Risk Register'!C102)","v":""},{"$f":"IF('10 - Mit. Risk Register'!H102=\"\", \"\", '10 - Mit. Risk Register'!H102)","v":""},{"$f":"IF('10 - Mit. Risk Register'!H102=\"\",\"\",'10 - Mit. Risk Register'!H102)","v":""},"",{"$f":"IF('10 - Mit. Risk Register'!I102=\"\",\"\",'10 - Mit. Risk Register'!I102)","v":""},{"$f":"IF('10 - Mit. Risk Register'!J102=\"\",\"\",'10 - Mit. Risk Register'!J102)","v":""}]
[null,null,null,null,null,null,null,null,null,null,null,null,null,null,null,null,null,null,null,null,null,null,null,null,null,null,null,null,null,null,null,null,null,null,null,null,null,null,null,null,null,null,null,null,null,{"$f":"IF('10 - Mit. Risk Register'!A103=\"\",\"\",'10 - Mit. Risk Register'!A103)","v":""},{"$f":"IF('10 - Mit. Risk Register'!B103=\"\",\"\",'10 - Mit. Risk Register'!B103)","v":""},{"$f":"IF('10 - Mit. Risk Register'!C103=\"\",\"\",'10 - Mit. Risk Register'!C103)","v":""},{"$f":"IF('10 - Mit. Risk Register'!H103=\"\", \"\", '10 - Mit. Risk Register'!H103)","v":""},{"$f":"IF('10 - Mit. Risk Register'!H103=\"\",\"\",'10 - Mit. Risk Register'!H103)","v":""},"",{"$f":"IF('10 - Mit. Risk Register'!I103=\"\",\"\",'10 - Mit. Risk Register'!I103)","v":""},{"$f":"IF('10 - Mit. Risk Register'!J103=\"\",\"\",'10 - Mit. Risk Register'!J103)","v":""}]
[null,null,null,null,null,null,null,null,null,null,null,null,null,null,null,null,null,null,null,null,null,null,null,null,null,null,null,null,null,null,null,null,null,null,null,null,null,null,null,null,null,null,null,null,null,{"$f":"IF('10 - Mit. Risk Register'!A104=\"\",\"\",'10 - Mit. Risk Register'!A104)","v":""},{"$f":"IF('10 - Mit. Risk Register'!B104=\"\",\"\",'10 - Mit. Risk Register'!B104)","v":""},{"$f":"IF('10 - Mit. Risk Register'!C104=\"\",\"\",'10 - Mit. Risk Register'!C104)","v":""},{"$f":"IF('10 - Mit. Risk Register'!H104=\"\", \"\", '10 - Mit. Risk Register'!H104)","v":""},{"$f":"IF('10 - Mit. Risk Register'!H104=\"\",\"\",'10 - Mit. Risk Register'!H104)","v":""},"",{"$f":"IF('10 - Mit. Risk Register'!I104=\"\",\"\",'10 - Mit. Risk Register'!I104)","v":""},{"$f":"IF('10 - Mit. Risk Register'!J104=\"\",\"\",'10 - Mit. Risk Register'!J104)","v":""}]
[]
[]
[null,null,null,null,null,null,null,null,null,null,null,null,null,null,null,null,null,null,null,null,null,null,null,null,null,null,null,null,null,null,null,null,null,null,null,null,null,null,null,null,null,null,null,null,null,null,null,null,null,null,null,null,null,null,null,null,null,null,null,null,null,null,null,null,null,null,null,null,null,null,null,null,null,null,null,null,null,null,null,null,null,null,null,null,null,null,null,null,null,null,null,null,null,"STRATEGY REGISTER"]
[null,null,null,null,null,null,null,null,null,null,null,null,null,null,null,null,null,null,null,null,null,null,null,null,null,null,null,null,null,null,null,null,null,null,null,null,null,null,null,null,null,null,null,null,null,null,null,null,null,null,null,null,null,null,null,null,null,null,null,null,null,null,null,null,null,null,null,null,null,null,null,null,null,null,null,null,null,null,null,null,null,null,null,null,null,null,null,null,null,null,null,null,null,"Risk Label","Risk Description","Selected Strategy","Mitigated Severity","Benefit/ Cost Analysis","Responsibility","Schedule /Milestone","Comments"]
[]
[]
[null,null,null,null,null,null,null,null,null,null,null,null,null,null,null,null,null,null,null,null,null,null,null,null,null,null,null,null,null,null,null,null,null,null,null,null,null,null,null,null,null,null,null,null,null,null,null,null,null,null,null,null,null,null,null,null,null,null,null,null,null,null,null,null,null,null,null,null,null,null,null,null,null,null,null,null,null,null,null,null,null,null,null,null,null,null,null,null,null,null,null,null,null,{"$f":"IF('9 - Mit. Strategies Register'!A9=\"\",\"\",'9 - Mit. Strategies Register'!A9)","v":"SC-6"},{"$f":"IF('9 - Mit. Strategies Register'!B9=\"\",\"\",'9 - Mit. Strategies Register'!B9)","v":"Provide new lighting throughout project."},{"$f":"IF('9 - Mit. Strategies Register'!D9=\"\",\"\",'9 - Mit. Strategies Register'!D9)","v":"Negotiate cost sharing agreement with the city"},{"$f":"IF('9 - Mit. Strategies Register'!O9=\"\",\"\",'9 - Mit. Strategies Register'!O9)","v":50.000000000000007},{"$f":"IF('9 - Mit. Strategies Register'!P9=\"\",\"\",'9 - Mit. Strategies Register'!P9)","v":"No Cost"},{"$f":"IF('9 - Mit. Strategies Register'!Q9=\"\",\"\",'9 - Mit. Strategies Register'!Q9)","v":"Project Director"},{"$f":"IF('9 - Mit. Strategies Register'!R9=\"\",\"\",'9 - Mit. Strategies Register'!R9)","v":"Midway thru prelim design"},{"$f":"IF('9 - Mit. Strategies Register'!S9=\"\",\"\",'9 - Mit. Strategies Register'!S9)","v":""}]
[null,null,null,null,null,null,null,null,null,null,null,null,null,null,null,null,null,null,null,null,null,null,null,null,null,null,null,null,null,null,null,null,null,null,null,null,null,null,null,null,null,null,null,null,null,null,null,null,null,null,null,null,null,null,null,null,null,null,null,null,null,null,null,null,null,null,null,null,null,null,null,null,null,null,null,null,null,null,null,null,null,null,null,null,null,null,null,null,null,null,null,null,null,{"$f":"IF('9 - Mit. Strategies Register'!A10=\"\",\"\",'9 - Mit. Strategies Register'!A10)","v":"RR-3"},{"$f":"IF('9 - Mit. Strategies Register'!B10=\"\",\"\",'9 - Mit. Strategies Register'!B10)","v":"Unwilling sellers"},{"$f":"IF('9 - Mit. Strategies Register'!D10=\"\",\"\",'9 - Mit. Strategies Register'!D10)","v":"Make reasonable early offer"},{"$f":"IF('9 - Mit. Strategies Register'!O10=\"\",\"\",'9 - Mit. Strategies Register'!O10)","v":49.999999999999964},{"$f":"IF('9 - Mit. Strategies Register'!P10=\"\",\"\",'9 - Mit. Strategies Register'!P10)","v":5.7749999999999924},{"$f":"IF('9 - Mit. Strategies Register'!Q10=\"\",\"\",'9 - Mit. Strategies Register'!Q10)","v":"Project Engineer"},{"$f":"IF('9 - Mit. Strategies Register'!R10=\"\",\"\",'9 - Mit. Strategies Register'!R10)","v":"Midway thru ROW/Util/RR"},{"$f":"IF('9 - Mit. Strategies Register'!S10=\"\",\"\",'9 - Mit. Strategies Register'!S10)","v":""}]
[null,null,null,null,null,null,null,null,null,null,null,null,null,null,null,null,null,null,null,null,null,null,null,null,null,null,null,null,null,null,null,null,null,null,null,null,null,null,null,null,null,null,null,null,null,null,null,null,null,null,null,null,null,null,null,null,null,null,null,null,null,null,null,null,null,null,null,null,null,null,null,null,null,null,null,null,null,null,null,null,null,null,null,null,null,null,null,null,null,null,null,null,null,{"$f":"IF('9 - Mit. Strategies Register'!A11=\"\",\"\",'9 - Mit. Strategies Register'!A11)","v":"CR-2"},{"$f":"IF('9 - Mit. Strategies Register'!B11=\"\",\"\",'9 - Mit. Strategies Register'!B11)","v":"Additional Maintenance of Traffic required"},{"$f":"IF('9 - Mit. Strategies Register'!D11=\"\",\"\",'9 - Mit. Strategies Register'!D11)","v":"Reduce traffic demand during closures"},{"$f":"IF('9 - Mit. Strategies Register'!O11=\"\",\"\",'9 - Mit. Strategies Register'!O11)","v":68.197252483819398},{"$f":"IF('9 - Mit. Strategies Register'!P11=\"\",\"\",'9 - Mit. Strategies Register'!P11)","v":6.558064198481226},{"$f":"IF('9 - Mit. Strategies Register'!Q11=\"\",\"\",'9 - Mit. Strategies Register'!Q11)","v":"Project Engineer"},{"$f":"IF('9 - Mit. Strategies Register'!R11=\"\",\"\",'9 - Mit. Strategies Register'!R11)","v":"Midway thru final design"},{"$f":"IF('9 - Mit. Strategies Register'!S11=\"\",\"\",'9 - Mit. Strategies Register'!S11)","v":""}]
[null,null,null,null,null,null,null,null,null,null,null,null,null,null,null,null,null,null,null,null,null,null,null,null,null,null,null,null,null,null,null,null,null,null,null,null,null,null,null,null,null,null,null,null,null,null,null,null,null,null,null,null,null,null,null,null,null,null,null,null,null,null,null,null,null,null,null,null,null,null,null,null,null,null,null,null,null,null,null,null,null,null,null,null,null,null,null,null,null,null,null,null,null,{"$f":"IF('9 - Mit. Strategies Register'!A12=\"\",\"\",'9 - Mit. Strategies Register'!A12)","v":"RR-2"},{"$f":"IF('9 - Mit. Strategies Register'!B12=\"\",\"\",'9 - Mit. Strategies Register'!B12)","v":"Accelerating pace of development in interchange area"},{"$f":"IF('9 - Mit. Strategies Register'!D12=\"\",\"\",'9 - Mit. Strategies Register'!D12)","v":"Coordinate with City - stop issuing permits for new develoipments"},{"$f":"IF('9 - Mit. Strategies Register'!O12=\"\",\"\",'9 - Mit. Strategies Register'!O12)","v":50.038086249136185},{"$f":"IF('9 - Mit. Strategies Register'!P12=\"\",\"\",'9 - Mit. Strategies Register'!P12)","v":"No Cost"},{"$f":"IF('9 - Mit. Strategies Register'!Q12=\"\",\"\",'9 - Mit. Strategies Register'!Q12)","v":"Project Engineer"},{"$f":"IF('9 - Mit. Strategies Register'!R12=\"\",\"\",'9 - Mit. Strategies Register'!R12)","v":"Midway thru prelim design"},{"$f":"IF('9 - Mit. Strategies Register'!S12=\"\",\"\",'9 - Mit. Strategies Register'!S12)","v":""}]
[null,null,null,null,null,null,null,null,null,null,null,null,null,null,null,null,null,null,null,null,null,null,null,null,null,null,null,null,null,null,null,null,null,null,null,null,null,null,null,null,null,null,null,null,null,null,null,null,null,null,null,null,null,null,null,null,null,null,null,null,null,null,null,null,null,null,null,null,null,null,null,null,null,null,null,null,null,null,null,null,null,null,null,null,null,null,null,null,null,null,null,null,null,{"$f":"IF('9 - Mit. Strategies Register'!A13=\"\",\"\",'9 - Mit. Strategies Register'!A13)","v":"PD-11"},{"$f":"IF('9 - Mit. Strategies Register'!B13=\"\",\"\",'9 - Mit. Strategies Register'!B13)","v":"Cannot use City sewer system for project runoff (or City charges for use)."},{"$f":"IF('9 - Mit. Strategies Register'!D13=\"\",\"\",'9 - Mit. Strategies Register'!D13)","v":"Same action as RR8 (affects RR8 and PD11)"},{"$f":"IF('9 - Mit. Strategies Register'!O13=\"\",\"\",'9 - Mit. Strategies Register'!O13)","v":50.010855345384769},{"$f":"IF('9 - Mit. Strategies Register'!P13=\"\",\"\",'9 - Mit. Strategies Register'!P13)","v":"No Cost"},{"$f":"IF('9 - Mit. Strategies Register'!Q13=\"\",\"\",'9 - Mit. Strategies Register'!Q13)","v":"Project Engineer"},{"$f":"IF('9 - Mit. Strategies Register'!R13=\"\",\"\",'9 - Mit. Strategies Register'!R13)","v":"Midway thru prelim design"},{"$f":"IF('9 - Mit. Strategies Register'!S13=\"\",\"\",'9 - Mit. Strategies Register'!S13)","v":""}]
[null,null,null,null,null,null,null,null,null,null,null,null,null,null,null,null,null,null,null,null,null,null,null,null,null,null,null,null,null,null,null,null,null,null,null,null,null,null,null,null,null,null,null,null,null,null,null,null,null,null,null,null,null,null,null,null,null,null,null,null,null,null,null,null,null,null,null,null,null,null,null,null,null,null,null,null,null,null,null,null,null,null,null,null,null,null,null,null,null,null,null,null,null,{"$f":"IF('9 - Mit. Strategies Register'!A14=\"\",\"\",'9 - Mit. Strategies Register'!A14)","v":"RR-8"},{"$f":"IF('9 - Mit. Strategies Register'!B14=\"\",\"\",'9 - Mit. Strategies Register'!B14)","v":"QDOT helps City pay for water and sewer-line relocation"},{"$f":"IF('9 - Mit. Strategies Register'!D14=\"\",\"\",'9 - Mit. Strategies Register'!D14)","v":"Decide to help City pay for water and sewer line relocation"},{"$f":"IF('9 - Mit. Strategies Register'!O14=\"\",\"\",'9 - Mit. Strategies Register'!O14)","v":-57.272727272727359},{"$f":"IF('9 - Mit. Strategies Register'!P14=\"\",\"\",'9 - Mit. Strategies Register'!P14)","v":"No Cost"},{"$f":"IF('9 - Mit. Strategies Register'!Q14=\"\",\"\",'9 - Mit. Strategies Register'!Q14)","v":""},{"$f":"IF('9 - Mit. Strategies Register'!R14=\"\",\"\",'9 - Mit. Strategies Register'!R14)","v":""},{"$f":"IF('9 - Mit. Strategies Register'!S14=\"\",\"\",'9 - Mit. Strategies Register'!S14)","v":""}]
[null,null,null,null,null,null,null,null,null,null,null,null,null,null,null,null,null,null,null,null,null,null,null,null,null,null,null,null,null,null,null,null,null,null,null,null,null,null,null,null,null,null,null,null,null,null,null,null,null,null,null,null,null,null,null,null,null,null,null,null,null,null,null,null,null,null,null,null,null,null,null,null,null,null,null,null,null,null,null,null,null,null,null,null,null,null,null,null,null,null,null,null,null,{"$f":"IF('9 - Mit. Strategies Register'!A15=\"\",\"\",'9 - Mit. Strategies Register'!A15)","v":"CR-4"},{"$f":"IF('9 - Mit. Strategies Register'!B15=\"\",\"\",'9 - Mit. Strategies Register'!B15)","v":"Unable to construct interchange embankments as rapidly as assumed"},{"$f":"IF('9 - Mit. Strategies Register'!D15=\"\",\"\",'9 - Mit. Strategies Register'!D15)","v":"Conduct additional investigations and analysis to ddevelop alt techniques"},{"$f":"IF('9 - Mit. Strategies Register'!O15=\"\",\"\",'9 - Mit. Strategies Register'!O15)","v":50.035940820774108},{"$f":"IF('9 - Mit. Strategies Register'!P15=\"\",\"\",'9 - Mit. Strategies Register'!P15)","v":1.8603174012330477},{"$f":"IF('9 - Mit. Strategies Register'!Q15=\"\",\"\",'9 - Mit. Strategies Register'!Q15)","v":"Project Engineer"},{"$f":"IF('9 - Mit. Strategies Register'!R15=\"\",\"\",'9 - Mit. Strategies Register'!R15)","v":"Midway thru final design"},{"$f":"IF('9 - Mit. Strategies Register'!S15=\"\",\"\",'9 - Mit. Strategies Register'!S15)","v":""}]
[null,null,null,null,null,null,null,null,null,null,null,null,null,null,null,null,null,null,null,null,null,null,null,null,null,null,null,null,null,null,null,null,null,null,null,null,null,null,null,null,null,null,null,null,null,null,null,null,null,null,null,null,null,null,null,null,null,null,null,null,null,null,null,null,null,null,null,null,null,null,null,null,null,null,null,null,null,null,null,null,null,null,null,null,null,null,null,null,null,null,null,null,null,{"$f":"IF('9 - Mit. Strategies Register'!A16=\"\",\"\",'9 - Mit. Strategies Register'!A16)","v":"CR-3"},{"$f":"IF('9 - Mit. Strategies Register'!B16=\"\",\"\",'9 - Mit. Strategies Register'!B16)","v":"Problems with planned accelerated bridge construction (ABC) technique"},{"$f":"IF('9 - Mit. Strategies Register'!D16=\"\",\"\",'9 - Mit. Strategies Register'!D16)","v":"Pre-qualify contractors + require development of ABC technique"},{"$f":"IF('9 - Mit. Strategies Register'!O16=\"\",\"\",'9 - Mit. Strategies Register'!O16)","v":50.01864387141525},{"$f":"IF('9 - Mit. Strategies Register'!P16=\"\",\"\",'9 - Mit. Strategies Register'!P16)","v":3.1703815474601611},{"$f":"IF('9 - Mit. Strategies Register'!Q16=\"\",\"\",'9 - Mit. Strategies Register'!Q16)","v":"Project Engineer"},{"$f":"IF('9 - Mit. Strategies Register'!R16=\"\",\"\",'9 - Mit. Strategies Register'!R16)","v":"Midway thru final design"},{"$f":"IF('9 - Mit. Strategies Register'!S16=\"\",\"\",'9 - Mit. Strategies Register'!S16)","v":""}]
[null,null,null,null,null,null,null,null,null,null,null,null,null,null,null,null,null,null,null,null,null,null,null,null,null,null,null,null,null,null,null,null,null,null,null,null,null,null,null,null,null,null,null,null,null,null,null,null,null,null,null,null,null,null,null,null,null,null,null,null,null,null,null,null,null,null,null,null,null,null,null,null,null,null,null,null,null,null,null,null,null,null,null,null,null,null,null,null,null,null,null,null,null,{"$f":"IF('9 - Mit. Strategies Register'!A17=\"\",\"\",'9 - Mit. Strategies Register'!A17)","v":""},{"$f":"IF('9 - Mit. Strategies Register'!B17=\"\",\"\",'9 - Mit. Strategies Register'!B17)","v":""},{"$f":"IF('9 - Mit. Strategies Register'!D17=\"\",\"\",'9 - Mit. Strategies Register'!D17)","v":""},{"$f":"IF('9 - Mit. Strategies Register'!O17=\"\",\"\",'9 - Mit. Strategies Register'!O17)","v":""},{"$f":"IF('9 - Mit. Strategies Register'!P17=\"\",\"\",'9 - Mit. Strategies Register'!P17)","v":""},{"$f":"IF('9 - Mit. Strategies Register'!Q17=\"\",\"\",'9 - Mit. Strategies Register'!Q17)","v":""},{"$f":"IF('9 - Mit. Strategies Register'!R17=\"\",\"\",'9 - Mit. Strategies Register'!R17)","v":""},{"$f":"IF('9 - Mit. Strategies Register'!S17=\"\",\"\",'9 - Mit. Strategies Register'!S17)","v":""}]
[null,null,null,null,null,null,null,null,null,null,null,null,null,null,null,null,null,null,null,null,null,null,null,null,null,null,null,null,null,null,null,null,null,null,null,null,null,null,null,null,null,null,null,null,null,null,null,null,null,null,null,null,null,null,null,null,null,null,null,null,null,null,null,null,null,null,null,null,null,null,null,null,null,null,null,null,null,null,null,null,null,null,null,null,null,null,null,null,null,null,null,null,null,{"$f":"IF('9 - Mit. Strategies Register'!A18=\"\",\"\",'9 - Mit. Strategies Register'!A18)","v":""},{"$f":"IF('9 - Mit. Strategies Register'!B18=\"\",\"\",'9 - Mit. Strategies Register'!B18)","v":""},{"$f":"IF('9 - Mit. Strategies Register'!D18=\"\",\"\",'9 - Mit. Strategies Register'!D18)","v":""},{"$f":"IF('9 - Mit. Strategies Register'!O18=\"\",\"\",'9 - Mit. Strategies Register'!O18)","v":""},{"$f":"IF('9 - Mit. Strategies Register'!P18=\"\",\"\",'9 - Mit. Strategies Register'!P18)","v":""},{"$f":"IF('9 - Mit. Strategies Register'!Q18=\"\",\"\",'9 - Mit. Strategies Register'!Q18)","v":""},{"$f":"IF('9 - Mit. Strategies Register'!R18=\"\",\"\",'9 - Mit. Strategies Register'!R18)","v":""},{"$f":"IF('9 - Mit. Strategies Register'!S18=\"\",\"\",'9 - Mit. Strategies Register'!S18)","v":""}]
[null,null,null,null,null,null,null,null,null,null,null,null,null,null,null,null,null,null,null,null,null,null,null,null,null,null,null,null,null,null,null,null,null,null,null,null,null,null,null,null,null,null,null,null,null,null,null,null,null,null,null,null,null,null,null,null,null,null,null,null,null,null,null,null,null,null,null,null,null,null,null,null,null,null,null,null,null,null,null,null,null,null,null,null,null,null,null,null,null,null,null,null,null,{"$f":"IF('9 - Mit. Strategies Register'!A19=\"\",\"\",'9 - Mit. Strategies Register'!A19)","v":""},{"$f":"IF('9 - Mit. Strategies Register'!B19=\"\",\"\",'9 - Mit. Strategies Register'!B19)","v":""},{"$f":"IF('9 - Mit. Strategies Register'!D19=\"\",\"\",'9 - Mit. Strategies Register'!D19)","v":""},{"$f":"IF('9 - Mit. Strategies Register'!O19=\"\",\"\",'9 - Mit. Strategies Register'!O19)","v":""},{"$f":"IF('9 - Mit. Strategies Register'!P19=\"\",\"\",'9 - Mit. Strategies Register'!P19)","v":""},{"$f":"IF('9 - Mit. Strategies Register'!Q19=\"\",\"\",'9 - Mit. Strategies Register'!Q19)","v":""},{"$f":"IF('9 - Mit. Strategies Register'!R19=\"\",\"\",'9 - Mit. Strategies Register'!R19)","v":""},{"$f":"IF('9 - Mit. Strategies Register'!S19=\"\",\"\",'9 - Mit. Strategies Register'!S19)","v":""}]
[null,null,null,null,null,null,null,null,null,null,null,null,null,null,null,null,null,null,null,null,null,null,null,null,null,null,null,null,null,null,null,null,null,null,null,null,null,null,null,null,null,null,null,null,null,null,null,null,null,null,null,null,null,null,null,null,null,null,null,null,null,null,null,null,null,null,null,null,null,null,null,null,null,null,null,null,null,null,null,null,null,null,null,null,null,null,null,null,null,null,null,null,null,{"$f":"IF('9 - Mit. Strategies Register'!A20=\"\",\"\",'9 - Mit. Strategies Register'!A20)","v":""},{"$f":"IF('9 - Mit. Strategies Register'!B20=\"\",\"\",'9 - Mit. Strategies Register'!B20)","v":""},{"$f":"IF('9 - Mit. Strategies Register'!D20=\"\",\"\",'9 - Mit. Strategies Register'!D20)","v":""},{"$f":"IF('9 - Mit. Strategies Register'!O20=\"\",\"\",'9 - Mit. Strategies Register'!O20)","v":""},{"$f":"IF('9 - Mit. Strategies Register'!P20=\"\",\"\",'9 - Mit. Strategies Register'!P20)","v":""},{"$f":"IF('9 - Mit. Strategies Register'!Q20=\"\",\"\",'9 - Mit. Strategies Register'!Q20)","v":""},{"$f":"IF('9 - Mit. Strategies Register'!R20=\"\",\"\",'9 - Mit. Strategies Register'!R20)","v":""},{"$f":"IF('9 - Mit. Strategies Register'!S20=\"\",\"\",'9 - Mit. Strategies Register'!S20)","v":""}]
[null,null,null,null,null,null,null,null,null,null,null,null,null,null,null,null,null,null,null,null,null,null,null,null,null,null,null,null,null,null,null,null,null,null,null,null,null,null,null,null,null,null,null,null,null,null,null,null,null,null,null,null,null,null,null,null,null,null,null,null,null,null,null,null,null,null,null,null,null,null,null,null,null,null,null,null,null,null,null,null,null,null,null,null,null,null,null,null,null,null,null,null,null,{"$f":"IF('9 - Mit. Strategies Register'!A21=\"\",\"\",'9 - Mit. Strategies Register'!A21)","v":""},{"$f":"IF('9 - Mit. Strategies Register'!B21=\"\",\"\",'9 - Mit. Strategies Register'!B21)","v":""},{"$f":"IF('9 - Mit. Strategies Register'!D21=\"\",\"\",'9 - Mit. Strategies Register'!D21)","v":""},{"$f":"IF('9 - Mit. Strategies Register'!O21=\"\",\"\",'9 - Mit. Strategies Register'!O21)","v":""},{"$f":"IF('9 - Mit. Strategies Register'!P21=\"\",\"\",'9 - Mit. Strategies Register'!P21)","v":""},{"$f":"IF('9 - Mit. Strategies Register'!Q21=\"\",\"\",'9 - Mit. Strategies Register'!Q21)","v":""},{"$f":"IF('9 - Mit. Strategies Register'!R21=\"\",\"\",'9 - Mit. Strategies Register'!R21)","v":""},{"$f":"IF('9 - Mit. Strategies Register'!S21=\"\",\"\",'9 - Mit. Strategies Register'!S21)","v":""}]
[null,null,null,null,null,null,null,null,null,null,null,null,null,null,null,null,null,null,null,null,null,null,null,null,null,null,null,null,null,null,null,null,null,null,null,null,null,null,null,null,null,null,null,null,null,null,null,null,null,null,null,null,null,null,null,null,null,null,null,null,null,null,null,null,null,null,null,null,null,null,null,null,null,null,null,null,null,null,null,null,null,null,null,null,null,null,null,null,null,null,null,null,null,{"$f":"IF('9 - Mit. Strategies Register'!A22=\"\",\"\",'9 - Mit. Strategies Register'!A22)","v":""},{"$f":"IF('9 - Mit. Strategies Register'!B22=\"\",\"\",'9 - Mit. Strategies Register'!B22)","v":""},{"$f":"IF('9 - Mit. Strategies Register'!D22=\"\",\"\",'9 - Mit. Strategies Register'!D22)","v":""},{"$f":"IF('9 - Mit. Strategies Register'!O22=\"\",\"\",'9 - Mit. Strategies Register'!O22)","v":""},{"$f":"IF('9 - Mit. Strategies Register'!P22=\"\",\"\",'9 - Mit. Strategies Register'!P22)","v":""},{"$f":"IF('9 - Mit. Strategies Register'!Q22=\"\",\"\",'9 - Mit. Strategies Register'!Q22)","v":""},{"$f":"IF('9 - Mit. Strategies Register'!R22=\"\",\"\",'9 - Mit. Strategies Register'!R22)","v":""},{"$f":"IF('9 - Mit. Strategies Register'!S22=\"\",\"\",'9 - Mit. Strategies Register'!S22)","v":""}]
[null,null,null,null,null,null,null,null,null,null,null,null,null,null,null,null,null,null,null,null,null,null,null,null,null,null,null,null,null,null,null,null,null,null,null,null,null,null,null,null,null,null,null,null,null,null,null,null,null,null,null,null,null,null,null,null,null,null,null,null,null,null,null,null,null,null,null,null,null,null,null,null,null,null,null,null,null,null,null,null,null,null,null,null,null,null,null,null,null,null,null,null,null,{"$f":"IF('9 - Mit. Strategies Register'!A23=\"\",\"\",'9 - Mit. Strategies Register'!A23)","v":""},{"$f":"IF('9 - Mit. Strategies Register'!B23=\"\",\"\",'9 - Mit. Strategies Register'!B23)","v":""},{"$f":"IF('9 - Mit. Strategies Register'!D23=\"\",\"\",'9 - Mit. Strategies Register'!D23)","v":""},{"$f":"IF('9 - Mit. Strategies Register'!O23=\"\",\"\",'9 - Mit. Strategies Register'!O23)","v":""},{"$f":"IF('9 - Mit. Strategies Register'!P23=\"\",\"\",'9 - Mit. Strategies Register'!P23)","v":""},{"$f":"IF('9 - Mit. Strategies Register'!Q23=\"\",\"\",'9 - Mit. Strategies Register'!Q23)","v":""},{"$f":"IF('9 - Mit. Strategies Register'!R23=\"\",\"\",'9 - Mit. Strategies Register'!R23)","v":""},{"$f":"IF('9 - Mit. Strategies Register'!S23=\"\",\"\",'9 - Mit. Strategies Register'!S23)","v":""}]
[null,null,null,null,null,null,null,null,null,null,null,null,null,null,null,null,null,null,null,null,null,null,null,null,null,null,null,null,null,null,null,null,null,null,null,null,null,null,null,null,null,null,null,null,null,null,null,null,null,null,null,null,null,null,null,null,null,null,null,null,null,null,null,null,null,null,null,null,null,null,null,null,null,null,null,null,null,null,null,null,null,null,null,null,null,null,null,null,null,null,null,null,null,{"$f":"IF('9 - Mit. Strategies Register'!A24=\"\",\"\",'9 - Mit. Strategies Register'!A24)","v":""},{"$f":"IF('9 - Mit. Strategies Register'!B24=\"\",\"\",'9 - Mit. Strategies Register'!B24)","v":""},{"$f":"IF('9 - Mit. Strategies Register'!D24=\"\",\"\",'9 - Mit. Strategies Register'!D24)","v":""},{"$f":"IF('9 - Mit. Strategies Register'!O24=\"\",\"\",'9 - Mit. Strategies Register'!O24)","v":""},{"$f":"IF('9 - Mit. Strategies Register'!P24=\"\",\"\",'9 - Mit. Strategies Register'!P24)","v":""},{"$f":"IF('9 - Mit. Strategies Register'!Q24=\"\",\"\",'9 - Mit. Strategies Register'!Q24)","v":""},{"$f":"IF('9 - Mit. Strategies Register'!R24=\"\",\"\",'9 - Mit. Strategies Register'!R24)","v":""},{"$f":"IF('9 - Mit. Strategies Register'!S24=\"\",\"\",'9 - Mit. Strategies Register'!S24)","v":""}]
[null,null,null,null,null,null,null,null,null,null,null,null,null,null,null,null,null,null,null,null,null,null,null,null,null,null,null,null,null,null,null,null,null,null,null,null,null,null,null,null,null,null,null,null,null,null,null,null,null,null,null,null,null,null,null,null,null,null,null,null,null,null,null,null,null,null,null,null,null,null,null,null,null,null,null,null,null,null,null,null,null,null,null,null,null,null,null,null,null,null,null,null,null,{"$f":"IF('9 - Mit. Strategies Register'!A25=\"\",\"\",'9 - Mit. Strategies Register'!A25)","v":""},{"$f":"IF('9 - Mit. Strategies Register'!B25=\"\",\"\",'9 - Mit. Strategies Register'!B25)","v":""},{"$f":"IF('9 - Mit. Strategies Register'!D25=\"\",\"\",'9 - Mit. Strategies Register'!D25)","v":""},{"$f":"IF('9 - Mit. Strategies Register'!O25=\"\",\"\",'9 - Mit. Strategies Register'!O25)","v":""},{"$f":"IF('9 - Mit. Strategies Register'!P25=\"\",\"\",'9 - Mit. Strategies Register'!P25)","v":""},{"$f":"IF('9 - Mit. Strategies Register'!Q25=\"\",\"\",'9 - Mit. Strategies Register'!Q25)","v":""},{"$f":"IF('9 - Mit. Strategies Register'!R25=\"\",\"\",'9 - Mit. Strategies Register'!R25)","v":""},{"$f":"IF('9 - Mit. Strategies Register'!S25=\"\",\"\",'9 - Mit. Strategies Register'!S25)","v":""}]
[null,null,null,null,null,null,null,null,null,null,null,null,null,null,null,null,null,null,null,null,null,null,null,null,null,null,null,null,null,null,null,null,null,null,null,null,null,null,null,null,null,null,null,null,null,null,null,null,null,null,null,null,null,null,null,null,null,null,null,null,null,null,null,null,null,null,null,null,null,null,null,null,null,null,null,null,null,null,null,null,null,null,null,null,null,null,null,null,null,null,null,null,null,{"$f":"IF('9 - Mit. Strategies Register'!A26=\"\",\"\",'9 - Mit. Strategies Register'!A26)","v":""},{"$f":"IF('9 - Mit. Strategies Register'!B26=\"\",\"\",'9 - Mit. Strategies Register'!B26)","v":""},{"$f":"IF('9 - Mit. Strategies Register'!D26=\"\",\"\",'9 - Mit. Strategies Register'!D26)","v":""},{"$f":"IF('9 - Mit. Strategies Register'!O26=\"\",\"\",'9 - Mit. Strategies Register'!O26)","v":""},{"$f":"IF('9 - Mit. Strategies Register'!P26=\"\",\"\",'9 - Mit. Strategies Register'!P26)","v":""},{"$f":"IF('9 - Mit. Strategies Register'!Q26=\"\",\"\",'9 - Mit. Strategies Register'!Q26)","v":""},{"$f":"IF('9 - Mit. Strategies Register'!R26=\"\",\"\",'9 - Mit. Strategies Register'!R26)","v":""},{"$f":"IF('9 - Mit. Strategies Register'!S26=\"\",\"\",'9 - Mit. Strategies Register'!S26)","v":""}]
[null,null,null,null,null,null,null,null,null,null,null,null,null,null,null,null,null,null,null,null,null,null,null,null,null,null,null,null,null,null,null,null,null,null,null,null,null,null,null,null,null,null,null,null,null,null,null,null,null,null,null,null,null,null,null,null,null,null,null,null,null,null,null,null,null,null,null,null,null,null,null,null,null,null,null,null,null,null,null,null,null,null,null,null,null,null,null,null,null,null,null,null,null,{"$f":"IF('9 - Mit. Strategies Register'!A27=\"\",\"\",'9 - Mit. Strategies Register'!A27)","v":""},{"$f":"IF('9 - Mit. Strategies Register'!B27=\"\",\"\",'9 - Mit. Strategies Register'!B27)","v":""},{"$f":"IF('9 - Mit. Strategies Register'!D27=\"\",\"\",'9 - Mit. Strategies Register'!D27)","v":""},{"$f":"IF('9 - Mit. Strategies Register'!O27=\"\",\"\",'9 - Mit. Strategies Register'!O27)","v":""},{"$f":"IF('9 - Mit. Strategies Register'!P27=\"\",\"\",'9 - Mit. Strategies Register'!P27)","v":""},{"$f":"IF('9 - Mit. Strategies Register'!Q27=\"\",\"\",'9 - Mit. Strategies Register'!Q27)","v":""},{"$f":"IF('9 - Mit. Strategies Register'!R27=\"\",\"\",'9 - Mit. Strategies Register'!R27)","v":""},{"$f":"IF('9 - Mit. Strategies Register'!S27=\"\",\"\",'9 - Mit. Strategies Register'!S27)","v":""}]
[null,null,null,null,null,null,null,null,null,null,null,null,null,null,null,null,null,null,null,null,null,null,null,null,null,null,null,null,null,null,null,null,null,null,null,null,null,null,null,null,null,null,null,null,null,null,null,null,null,null,null,null,null,null,null,null,null,null,null,null,null,null,null,null,null,null,null,null,null,null,null,null,null,null,null,null,null,null,null,null,null,null,null,null,null,null,null,null,null,null,null,null,null,{"$f":"IF('9 - Mit. Strategies Register'!A28=\"\",\"\",'9 - Mit. Strategies Register'!A28)","v":""},{"$f":"IF('9 - Mit. Strategies Register'!B28=\"\",\"\",'9 - Mit. Strategies Register'!B28)","v":""},{"$f":"IF('9 - Mit. Strategies Register'!D28=\"\",\"\",'9 - Mit. Strategies Register'!D28)","v":""},{"$f":"IF('9 - Mit. Strategies Register'!O28=\"\",\"\",'9 - Mit. Strategies Register'!O28)","v":""},{"$f":"IF('9 - Mit. Strategies Register'!P28=\"\",\"\",'9 - Mit. Strategies Register'!P28)","v":""},{"$f":"IF('9 - Mit. Strategies Register'!Q28=\"\",\"\",'9 - Mit. Strategies Register'!Q28)","v":""},{"$f":"IF('9 - Mit. Strategies Register'!R28=\"\",\"\",'9 - Mit. Strategies Register'!R28)","v":""},{"$f":"IF('9 - Mit. Strategies Register'!S28=\"\",\"\",'9 - Mit. Strategies Register'!S28)","v":""}]
[null,null,null,null,null,null,null,null,null,null,null,null,null,null,null,null,null,null,null,null,null,null,null,null,null,null,null,null,null,null,null,null,null,null,null,null,null,null,null,null,null,null,null,null,null,null,null,null,null,null,null,null,null,null,null,null,null,null,null,null,null,null,null,null,null,null,null,null,null,null,null,null,null,null,null,null,null,null,null,null,null,null,null,null,null,null,null,null,null,null,null,null,null,{"$f":"IF('9 - Mit. Strategies Register'!A29=\"\",\"\",'9 - Mit. Strategies Register'!A29)","v":""},{"$f":"IF('9 - Mit. Strategies Register'!B29=\"\",\"\",'9 - Mit. Strategies Register'!B29)","v":""},{"$f":"IF('9 - Mit. Strategies Register'!D29=\"\",\"\",'9 - Mit. Strategies Register'!D29)","v":""},{"$f":"IF('9 - Mit. Strategies Register'!O29=\"\",\"\",'9 - Mit. Strategies Register'!O29)","v":""},{"$f":"IF('9 - Mit. Strategies Register'!P29=\"\",\"\",'9 - Mit. Strategies Register'!P29)","v":""},{"$f":"IF('9 - Mit. Strategies Register'!Q29=\"\",\"\",'9 - Mit. Strategies Register'!Q29)","v":""},{"$f":"IF('9 - Mit. Strategies Register'!R29=\"\",\"\",'9 - Mit. Strategies Register'!R29)","v":""},{"$f":"IF('9 - Mit. Strategies Register'!S29=\"\",\"\",'9 - Mit. Strategies Register'!S29)","v":""}]
[null,null,null,null,null,null,null,null,null,null,null,null,null,null,null,null,null,null,null,null,null,null,null,null,null,null,null,null,null,null,null,null,null,null,null,null,null,null,null,null,null,null,null,null,null,null,null,null,null,null,null,null,null,null,null,null,null,null,null,null,null,null,null,null,null,null,null,null,null,null,null,null,null,null,null,null,null,null,null,null,null,null,null,null,null,null,null,null,null,null,null,null,null,{"$f":"IF('9 - Mit. Strategies Register'!A30=\"\",\"\",'9 - Mit. Strategies Register'!A30)","v":""},{"$f":"IF('9 - Mit. Strategies Register'!B30=\"\",\"\",'9 - Mit. Strategies Register'!B30)","v":""},{"$f":"IF('9 - Mit. Strategies Register'!D30=\"\",\"\",'9 - Mit. Strategies Register'!D30)","v":""},{"$f":"IF('9 - Mit. Strategies Register'!O30=\"\",\"\",'9 - Mit. Strategies Register'!O30)","v":""},{"$f":"IF('9 - Mit. Strategies Register'!P30=\"\",\"\",'9 - Mit. Strategies Register'!P30)","v":""},{"$f":"IF('9 - Mit. Strategies Register'!Q30=\"\",\"\",'9 - Mit. Strategies Register'!Q30)","v":""},{"$f":"IF('9 - Mit. Strategies Register'!R30=\"\",\"\",'9 - Mit. Strategies Register'!R30)","v":""},{"$f":"IF('9 - Mit. Strategies Register'!S30=\"\",\"\",'9 - Mit. Strategies Register'!S30)","v":""}]
[null,null,null,null,null,null,null,null,null,null,null,null,null,null,null,null,null,null,null,null,null,null,null,null,null,null,null,null,null,null,null,null,null,null,null,null,null,null,null,null,null,null,null,null,null,null,null,null,null,null,null,null,null,null,null,null,null,null,null,null,null,null,null,null,null,null,null,null,null,null,null,null,null,null,null,null,null,null,null,null,null,null,null,null,null,null,null,null,null,null,null,null,null,{"$f":"IF('9 - Mit. Strategies Register'!A31=\"\",\"\",'9 - Mit. Strategies Register'!A31)","v":""},{"$f":"IF('9 - Mit. Strategies Register'!B31=\"\",\"\",'9 - Mit. Strategies Register'!B31)","v":""},{"$f":"IF('9 - Mit. Strategies Register'!D31=\"\",\"\",'9 - Mit. Strategies Register'!D31)","v":""},{"$f":"IF('9 - Mit. Strategies Register'!O31=\"\",\"\",'9 - Mit. Strategies Register'!O31)","v":""},{"$f":"IF('9 - Mit. Strategies Register'!P31=\"\",\"\",'9 - Mit. Strategies Register'!P31)","v":""},{"$f":"IF('9 - Mit. Strategies Register'!Q31=\"\",\"\",'9 - Mit. Strategies Register'!Q31)","v":""},{"$f":"IF('9 - Mit. Strategies Register'!R31=\"\",\"\",'9 - Mit. Strategies Register'!R31)","v":""},{"$f":"IF('9 - Mit. Strategies Register'!S31=\"\",\"\",'9 - Mit. Strategies Register'!S31)","v":""}]
[null,null,null,null,null,null,null,null,null,null,null,null,null,null,null,null,null,null,null,null,null,null,null,null,null,null,null,null,null,null,null,null,null,null,null,null,null,null,null,null,null,null,null,null,null,null,null,null,null,null,null,null,null,null,null,null,null,null,null,null,null,null,null,null,null,null,null,null,null,null,null,null,null,null,null,null,null,null,null,null,null,null,null,null,null,null,null,null,null,null,null,null,null,{"$f":"IF('9 - Mit. Strategies Register'!A32=\"\",\"\",'9 - Mit. Strategies Register'!A32)","v":""},{"$f":"IF('9 - Mit. Strategies Register'!B32=\"\",\"\",'9 - Mit. Strategies Register'!B32)","v":""},{"$f":"IF('9 - Mit. Strategies Register'!D32=\"\",\"\",'9 - Mit. Strategies Register'!D32)","v":""},{"$f":"IF('9 - Mit. Strategies Register'!O32=\"\",\"\",'9 - Mit. Strategies Register'!O32)","v":""},{"$f":"IF('9 - Mit. Strategies Register'!P32=\"\",\"\",'9 - Mit. Strategies Register'!P32)","v":""},{"$f":"IF('9 - Mit. Strategies Register'!Q32=\"\",\"\",'9 - Mit. Strategies Register'!Q32)","v":""},{"$f":"IF('9 - Mit. Strategies Register'!R32=\"\",\"\",'9 - Mit. Strategies Register'!R32)","v":""},{"$f":"IF('9 - Mit. Strategies Register'!S32=\"\",\"\",'9 - Mit. Strategies Register'!S32)","v":""}]
[null,null,null,null,null,null,null,null,null,null,null,null,null,null,null,null,null,null,null,null,null,null,null,null,null,null,null,null,null,null,null,null,null,null,null,null,null,null,null,null,null,null,null,null,null,null,null,null,null,null,null,null,null,null,null,null,null,null,null,null,null,null,null,null,null,null,null,null,null,null,null,null,null,null,null,null,null,null,null,null,null,null,null,null,null,null,null,null,null,null,null,null,null,{"$f":"IF('9 - Mit. Strategies Register'!A33=\"\",\"\",'9 - Mit. Strategies Register'!A33)","v":""},{"$f":"IF('9 - Mit. Strategies Register'!B33=\"\",\"\",'9 - Mit. Strategies Register'!B33)","v":""},{"$f":"IF('9 - Mit. Strategies Register'!D33=\"\",\"\",'9 - Mit. Strategies Register'!D33)","v":""},{"$f":"IF('9 - Mit. Strategies Register'!O33=\"\",\"\",'9 - Mit. Strategies Register'!O33)","v":""},{"$f":"IF('9 - Mit. Strategies Register'!P33=\"\",\"\",'9 - Mit. Strategies Register'!P33)","v":""},{"$f":"IF('9 - Mit. Strategies Register'!Q33=\"\",\"\",'9 - Mit. Strategies Register'!Q33)","v":""},{"$f":"IF('9 - Mit. Strategies Register'!R33=\"\",\"\",'9 - Mit. Strategies Register'!R33)","v":""},{"$f":"IF('9 - Mit. Strategies Register'!S33=\"\",\"\",'9 - Mit. Strategies Register'!S33)","v":""}]
[null,null,null,null,null,null,null,null,null,null,null,null,null,null,null,null,null,null,null,null,null,null,null,null,null,null,null,null,null,null,null,null,null,null,null,null,null,null,null,null,null,null,null,null,null,null,null,null,null,null,null,null,null,null,null,null,null,null,null,null,null,null,null,null,null,null,null,null,null,null,null,null,null,null,null,null,null,null,null,null,null,null,null,null,null,null,null,null,null,null,null,null,null,{"$f":"IF('9 - Mit. Strategies Register'!A34=\"\",\"\",'9 - Mit. Strategies Register'!A34)","v":""},{"$f":"IF('9 - Mit. Strategies Register'!B34=\"\",\"\",'9 - Mit. Strategies Register'!B34)","v":""},{"$f":"IF('9 - Mit. Strategies Register'!D34=\"\",\"\",'9 - Mit. Strategies Register'!D34)","v":""},{"$f":"IF('9 - Mit. Strategies Register'!O34=\"\",\"\",'9 - Mit. Strategies Register'!O34)","v":""},{"$f":"IF('9 - Mit. Strategies Register'!P34=\"\",\"\",'9 - Mit. Strategies Register'!P34)","v":""},{"$f":"IF('9 - Mit. Strategies Register'!Q34=\"\",\"\",'9 - Mit. Strategies Register'!Q34)","v":""},{"$f":"IF('9 - Mit. Strategies Register'!R34=\"\",\"\",'9 - Mit. Strategies Register'!R34)","v":""},{"$f":"IF('9 - Mit. Strategies Register'!S34=\"\",\"\",'9 - Mit. Strategies Register'!S34)","v":""}]
[null,null,null,null,null,null,null,null,null,null,null,null,null,null,null,null,null,null,null,null,null,null,null,null,null,null,null,null,null,null,null,null,null,null,null,null,null,null,null,null,null,null,null,null,null,null,null,null,null,null,null,null,null,null,null,null,null,null,null,null,null,null,null,null,null,null,null,null,null,null,null,null,null,null,null,null,null,null,null,null,null,null,null,null,null,null,null,null,null,null,null,null,null,{"$f":"IF('9 - Mit. Strategies Register'!A35=\"\",\"\",'9 - Mit. Strategies Register'!A35)","v":""},{"$f":"IF('9 - Mit. Strategies Register'!B35=\"\",\"\",'9 - Mit. Strategies Register'!B35)","v":""},{"$f":"IF('9 - Mit. Strategies Register'!D35=\"\",\"\",'9 - Mit. Strategies Register'!D35)","v":""},{"$f":"IF('9 - Mit. Strategies Register'!O35=\"\",\"\",'9 - Mit. Strategies Register'!O35)","v":""},{"$f":"IF('9 - Mit. Strategies Register'!P35=\"\",\"\",'9 - Mit. Strategies Register'!P35)","v":""},{"$f":"IF('9 - Mit. Strategies Register'!Q35=\"\",\"\",'9 - Mit. Strategies Register'!Q35)","v":""},{"$f":"IF('9 - Mit. Strategies Register'!R35=\"\",\"\",'9 - Mit. Strategies Register'!R35)","v":""},{"$f":"IF('9 - Mit. Strategies Register'!S35=\"\",\"\",'9 - Mit. Strategies Register'!S35)","v":""}]
[null,null,null,null,null,null,null,null,null,null,null,null,null,null,null,null,null,null,null,null,null,null,null,null,null,null,null,null,null,null,null,null,null,null,null,null,null,null,null,null,null,null,null,null,null,null,null,null,null,null,null,null,null,null,null,null,null,null,null,null,null,null,null,null,null,null,null,null,null,null,null,null,null,null,null,null,null,null,null,null,null,null,null,null,null,null,null,null,null,null,null,null,null,{"$f":"IF('9 - Mit. Strategies Register'!A36=\"\",\"\",'9 - Mit. Strategies Register'!A36)","v":""},{"$f":"IF('9 - Mit. Strategies Register'!B36=\"\",\"\",'9 - Mit. Strategies Register'!B36)","v":""},{"$f":"IF('9 - Mit. Strategies Register'!D36=\"\",\"\",'9 - Mit. Strategies Register'!D36)","v":""},{"$f":"IF('9 - Mit. Strategies Register'!O36=\"\",\"\",'9 - Mit. Strategies Register'!O36)","v":""},{"$f":"IF('9 - Mit. Strategies Register'!P36=\"\",\"\",'9 - Mit. Strategies Register'!P36)","v":""},{"$f":"IF('9 - Mit. Strategies Register'!Q36=\"\",\"\",'9 - Mit. Strategies Register'!Q36)","v":""},{"$f":"IF('9 - Mit. Strategies Register'!R36=\"\",\"\",'9 - Mit. Strategies Register'!R36)","v":""},{"$f":"IF('9 - Mit. Strategies Register'!S36=\"\",\"\",'9 - Mit. Strategies Register'!S36)","v":""}]
[null,null,null,null,null,null,null,null,null,null,null,null,null,null,null,null,null,null,null,null,null,null,null,null,null,null,null,null,null,null,null,null,null,null,null,null,null,null,null,null,null,null,null,null,null,null,null,null,null,null,null,null,null,null,null,null,null,null,null,null,null,null,null,null,null,null,null,null,null,null,null,null,null,null,null,null,null,null,null,null,null,null,null,null,null,null,null,null,null,null,null,null,null,{"$f":"IF('9 - Mit. Strategies Register'!A37=\"\",\"\",'9 - Mit. Strategies Register'!A37)","v":""},{"$f":"IF('9 - Mit. Strategies Register'!B37=\"\",\"\",'9 - Mit. Strategies Register'!B37)","v":""},{"$f":"IF('9 - Mit. Strategies Register'!D37=\"\",\"\",'9 - Mit. Strategies Register'!D37)","v":""},{"$f":"IF('9 - Mit. Strategies Register'!O37=\"\",\"\",'9 - Mit. Strategies Register'!O37)","v":""},{"$f":"IF('9 - Mit. Strategies Register'!P37=\"\",\"\",'9 - Mit. Strategies Register'!P37)","v":""},{"$f":"IF('9 - Mit. Strategies Register'!Q37=\"\",\"\",'9 - Mit. Strategies Register'!Q37)","v":""},{"$f":"IF('9 - Mit. Strategies Register'!R37=\"\",\"\",'9 - Mit. Strategies Register'!R37)","v":""},{"$f":"IF('9 - Mit. Strategies Register'!S37=\"\",\"\",'9 - Mit. Strategies Register'!S37)","v":""}]
[null,null,null,null,null,null,null,null,null,null,null,null,null,null,null,null,null,null,null,null,null,null,null,null,null,null,null,null,null,null,null,null,null,null,null,null,null,null,null,null,null,null,null,null,null,null,null,null,null,null,null,null,null,null,null,null,null,null,null,null,null,null,null,null,null,null,null,null,null,null,null,null,null,null,null,null,null,null,null,null,null,null,null,null,null,null,null,null,null,null,null,null,null,{"$f":"IF('9 - Mit. Strategies Register'!A38=\"\",\"\",'9 - Mit. Strategies Register'!A38)","v":""},{"$f":"IF('9 - Mit. Strategies Register'!B38=\"\",\"\",'9 - Mit. Strategies Register'!B38)","v":""},{"$f":"IF('9 - Mit. Strategies Register'!D38=\"\",\"\",'9 - Mit. Strategies Register'!D38)","v":""},{"$f":"IF('9 - Mit. Strategies Register'!O38=\"\",\"\",'9 - Mit. Strategies Register'!O38)","v":""},{"$f":"IF('9 - Mit. Strategies Register'!P38=\"\",\"\",'9 - Mit. Strategies Register'!P38)","v":""},{"$f":"IF('9 - Mit. Strategies Register'!Q38=\"\",\"\",'9 - Mit. Strategies Register'!Q38)","v":""},{"$f":"IF('9 - Mit. Strategies Register'!R38=\"\",\"\",'9 - Mit. Strategies Register'!R38)","v":""},{"$f":"IF('9 - Mit. Strategies Register'!S38=\"\",\"\",'9 - Mit. Strategies Register'!S38)","v":""}]
[null,null,null,null,null,null,null,null,null,null,null,null,null,null,null,null,null,null,null,null,null,null,null,null,null,null,null,null,null,null,null,null,null,null,null,null,null,null,null,null,null,null,null,null,null,null,null,null,null,null,null,null,null,null,null,null,null,null,null,null,null,null,null,null,null,null,null,null,null,null,null,null,null,null,null,null,null,null,null,null,null,null,null,null,null,null,null,null,null,null,null,null,null,{"$f":"IF('9 - Mit. Strategies Register'!A39=\"\",\"\",'9 - Mit. Strategies Register'!A39)","v":""},{"$f":"IF('9 - Mit. Strategies Register'!B39=\"\",\"\",'9 - Mit. Strategies Register'!B39)","v":""},{"$f":"IF('9 - Mit. Strategies Register'!D39=\"\",\"\",'9 - Mit. Strategies Register'!D39)","v":""},{"$f":"IF('9 - Mit. Strategies Register'!O39=\"\",\"\",'9 - Mit. Strategies Register'!O39)","v":""},{"$f":"IF('9 - Mit. Strategies Register'!P39=\"\",\"\",'9 - Mit. Strategies Register'!P39)","v":""},{"$f":"IF('9 - Mit. Strategies Register'!Q39=\"\",\"\",'9 - Mit. Strategies Register'!Q39)","v":""},{"$f":"IF('9 - Mit. Strategies Register'!R39=\"\",\"\",'9 - Mit. Strategies Register'!R39)","v":""},{"$f":"IF('9 - Mit. Strategies Register'!S39=\"\",\"\",'9 - Mit. Strategies Register'!S39)","v":""}]
[null,null,null,null,null,null,null,null,null,null,null,null,null,null,null,null,null,null,null,null,null,null,null,null,null,null,null,null,null,null,null,null,null,null,null,null,null,null,null,null,null,null,null,null,null,null,null,null,null,null,null,null,null,null,null,null,null,null,null,null,null,null,null,null,null,null,null,null,null,null,null,null,null,null,null,null,null,null,null,null,null,null,null,null,null,null,null,null,null,null,null,null,null,{"$f":"IF('9 - Mit. Strategies Register'!A40=\"\",\"\",'9 - Mit. Strategies Register'!A40)","v":""},{"$f":"IF('9 - Mit. Strategies Register'!B40=\"\",\"\",'9 - Mit. Strategies Register'!B40)","v":""},{"$f":"IF('9 - Mit. Strategies Register'!D40=\"\",\"\",'9 - Mit. Strategies Register'!D40)","v":""},{"$f":"IF('9 - Mit. Strategies Register'!O40=\"\",\"\",'9 - Mit. Strategies Register'!O40)","v":""},{"$f":"IF('9 - Mit. Strategies Register'!P40=\"\",\"\",'9 - Mit. Strategies Register'!P40)","v":""},{"$f":"IF('9 - Mit. Strategies Register'!Q40=\"\",\"\",'9 - Mit. Strategies Register'!Q40)","v":""},{"$f":"IF('9 - Mit. Strategies Register'!R40=\"\",\"\",'9 - Mit. Strategies Register'!R40)","v":""},{"$f":"IF('9 - Mit. Strategies Register'!S40=\"\",\"\",'9 - Mit. Strategies Register'!S40)","v":""}]
[null,null,null,null,null,null,null,null,null,null,null,null,null,null,null,null,null,null,null,null,null,null,null,null,null,null,null,null,null,null,null,null,null,null,null,null,null,null,null,null,null,null,null,null,null,null,null,null,null,null,null,null,null,null,null,null,null,null,null,null,null,null,null,null,null,null,null,null,null,null,null,null,null,null,null,null,null,null,null,null,null,null,null,null,null,null,null,null,null,null,null,null,null,{"$f":"IF('9 - Mit. Strategies Register'!A41=\"\",\"\",'9 - Mit. Strategies Register'!A41)","v":""},{"$f":"IF('9 - Mit. Strategies Register'!B41=\"\",\"\",'9 - Mit. Strategies Register'!B41)","v":""},{"$f":"IF('9 - Mit. Strategies Register'!D41=\"\",\"\",'9 - Mit. Strategies Register'!D41)","v":""},{"$f":"IF('9 - Mit. Strategies Register'!O41=\"\",\"\",'9 - Mit. Strategies Register'!O41)","v":""},{"$f":"IF('9 - Mit. Strategies Register'!P41=\"\",\"\",'9 - Mit. Strategies Register'!P41)","v":""},{"$f":"IF('9 - Mit. Strategies Register'!Q41=\"\",\"\",'9 - Mit. Strategies Register'!Q41)","v":""},{"$f":"IF('9 - Mit. Strategies Register'!R41=\"\",\"\",'9 - Mit. Strategies Register'!R41)","v":""},{"$f":"IF('9 - Mit. Strategies Register'!S41=\"\",\"\",'9 - Mit. Strategies Register'!S41)","v":""}]
[null,null,null,null,null,null,null,null,null,null,null,null,null,null,null,null,null,null,null,null,null,null,null,null,null,null,null,null,null,null,null,null,null,null,null,null,null,null,null,null,null,null,null,null,null,null,null,null,null,null,null,null,null,null,null,null,null,null,null,null,null,null,null,null,null,null,null,null,null,null,null,null,null,null,null,null,null,null,null,null,null,null,null,null,null,null,null,null,null,null,null,null,null,{"$f":"IF('9 - Mit. Strategies Register'!A42=\"\",\"\",'9 - Mit. Strategies Register'!A42)","v":""},{"$f":"IF('9 - Mit. Strategies Register'!B42=\"\",\"\",'9 - Mit. Strategies Register'!B42)","v":""},{"$f":"IF('9 - Mit. Strategies Register'!D42=\"\",\"\",'9 - Mit. Strategies Register'!D42)","v":""},{"$f":"IF('9 - Mit. Strategies Register'!O42=\"\",\"\",'9 - Mit. Strategies Register'!O42)","v":""},{"$f":"IF('9 - Mit. Strategies Register'!P42=\"\",\"\",'9 - Mit. Strategies Register'!P42)","v":""},{"$f":"IF('9 - Mit. Strategies Register'!Q42=\"\",\"\",'9 - Mit. Strategies Register'!Q42)","v":""},{"$f":"IF('9 - Mit. Strategies Register'!R42=\"\",\"\",'9 - Mit. Strategies Register'!R42)","v":""},{"$f":"IF('9 - Mit. Strategies Register'!S42=\"\",\"\",'9 - Mit. Strategies Register'!S42)","v":""}]
[null,null,null,null,null,null,null,null,null,null,null,null,null,null,null,null,null,null,null,null,null,null,null,null,null,null,null,null,null,null,null,null,null,null,null,null,null,null,null,null,null,null,null,null,null,null,null,null,null,null,null,null,null,null,null,null,null,null,null,null,null,null,null,null,null,null,null,null,null,null,null,null,null,null,null,null,null,null,null,null,null,null,null,null,null,null,null,null,null,null,null,null,null,{"$f":"IF('9 - Mit. Strategies Register'!A43=\"\",\"\",'9 - Mit. Strategies Register'!A43)","v":""},{"$f":"IF('9 - Mit. Strategies Register'!B43=\"\",\"\",'9 - Mit. Strategies Register'!B43)","v":""},{"$f":"IF('9 - Mit. Strategies Register'!D43=\"\",\"\",'9 - Mit. Strategies Register'!D43)","v":""},{"$f":"IF('9 - Mit. Strategies Register'!O43=\"\",\"\",'9 - Mit. Strategies Register'!O43)","v":""},{"$f":"IF('9 - Mit. Strategies Register'!P43=\"\",\"\",'9 - Mit. Strategies Register'!P43)","v":""},{"$f":"IF('9 - Mit. Strategies Register'!Q43=\"\",\"\",'9 - Mit. Strategies Register'!Q43)","v":""},{"$f":"IF('9 - Mit. Strategies Register'!R43=\"\",\"\",'9 - Mit. Strategies Register'!R43)","v":""},{"$f":"IF('9 - Mit. Strategies Register'!S43=\"\",\"\",'9 - Mit. Strategies Register'!S43)","v":""}]
[null,null,null,null,null,null,null,null,null,null,null,null,null,null,null,null,null,null,null,null,null,null,null,null,null,null,null,null,null,null,null,null,null,null,null,null,null,null,null,null,null,null,null,null,null,null,null,null,null,null,null,null,null,null,null,null,null,null,null,null,null,null,null,null,null,null,null,null,null,null,null,null,null,null,null,null,null,null,null,null,null,null,null,null,null,null,null,null,null,null,null,null,null,{"$f":"IF('9 - Mit. Strategies Register'!A44=\"\",\"\",'9 - Mit. Strategies Register'!A44)","v":""},{"$f":"IF('9 - Mit. Strategies Register'!B44=\"\",\"\",'9 - Mit. Strategies Register'!B44)","v":""},{"$f":"IF('9 - Mit. Strategies Register'!D44=\"\",\"\",'9 - Mit. Strategies Register'!D44)","v":""},{"$f":"IF('9 - Mit. Strategies Register'!O44=\"\",\"\",'9 - Mit. Strategies Register'!O44)","v":""},{"$f":"IF('9 - Mit. Strategies Register'!P44=\"\",\"\",'9 - Mit. Strategies Register'!P44)","v":""},{"$f":"IF('9 - Mit. Strategies Register'!Q44=\"\",\"\",'9 - Mit. Strategies Register'!Q44)","v":""},{"$f":"IF('9 - Mit. Strategies Register'!R44=\"\",\"\",'9 - Mit. Strategies Register'!R44)","v":""},{"$f":"IF('9 - Mit. Strategies Register'!S44=\"\",\"\",'9 - Mit. Strategies Register'!S44)","v":""}]
[null,null,null,null,null,null,null,null,null,null,null,null,null,null,null,null,null,null,null,null,null,null,null,null,null,null,null,null,null,null,null,null,null,null,null,null,null,null,null,null,null,null,null,null,null,null,null,null,null,null,null,null,null,null,null,null,null,null,null,null,null,null,null,null,null,null,null,null,null,null,null,null,null,null,null,null,null,null,null,null,null,null,null,null,null,null,null,null,null,null,null,null,null,{"$f":"IF('9 - Mit. Strategies Register'!A45=\"\",\"\",'9 - Mit. Strategies Register'!A45)","v":""},{"$f":"IF('9 - Mit. Strategies Register'!B45=\"\",\"\",'9 - Mit. Strategies Register'!B45)","v":""},{"$f":"IF('9 - Mit. Strategies Register'!D45=\"\",\"\",'9 - Mit. Strategies Register'!D45)","v":""},{"$f":"IF('9 - Mit. Strategies Register'!O45=\"\",\"\",'9 - Mit. Strategies Register'!O45)","v":""},{"$f":"IF('9 - Mit. Strategies Register'!P45=\"\",\"\",'9 - Mit. Strategies Register'!P45)","v":""},{"$f":"IF('9 - Mit. Strategies Register'!Q45=\"\",\"\",'9 - Mit. Strategies Register'!Q45)","v":""},{"$f":"IF('9 - Mit. Strategies Register'!R45=\"\",\"\",'9 - Mit. Strategies Register'!R45)","v":""},{"$f":"IF('9 - Mit. Strategies Register'!S45=\"\",\"\",'9 - Mit. Strategies Register'!S45)","v":""}]
[null,null,null,null,null,null,null,null,null,null,null,null,null,null,null,null,null,null,null,null,null,null,null,null,null,null,null,null,null,null,null,null,null,null,null,null,null,null,null,null,null,null,null,null,null,null,null,null,null,null,null,null,null,null,null,null,null,null,null,null,null,null,null,null,null,null,null,null,null,null,null,null,null,null,null,null,null,null,null,null,null,null,null,null,null,null,null,null,null,null,null,null,null,{"$f":"IF('9 - Mit. Strategies Register'!A46=\"\",\"\",'9 - Mit. Strategies Register'!A46)","v":""},{"$f":"IF('9 - Mit. Strategies Register'!B46=\"\",\"\",'9 - Mit. Strategies Register'!B46)","v":""},{"$f":"IF('9 - Mit. Strategies Register'!D46=\"\",\"\",'9 - Mit. Strategies Register'!D46)","v":""},{"$f":"IF('9 - Mit. Strategies Register'!O46=\"\",\"\",'9 - Mit. Strategies Register'!O46)","v":""},{"$f":"IF('9 - Mit. Strategies Register'!P46=\"\",\"\",'9 - Mit. Strategies Register'!P46)","v":""},{"$f":"IF('9 - Mit. Strategies Register'!Q46=\"\",\"\",'9 - Mit. Strategies Register'!Q46)","v":""},{"$f":"IF('9 - Mit. Strategies Register'!R46=\"\",\"\",'9 - Mit. Strategies Register'!R46)","v":""},{"$f":"IF('9 - Mit. Strategies Register'!S46=\"\",\"\",'9 - Mit. Strategies Register'!S46)","v":""}]
[null,null,null,null,null,null,null,null,null,null,null,null,null,null,null,null,null,null,null,null,null,null,null,null,null,null,null,null,null,null,null,null,null,null,null,null,null,null,null,null,null,null,null,null,null,null,null,null,null,null,null,null,null,null,null,null,null,null,null,null,null,null,null,null,null,null,null,null,null,null,null,null,null,null,null,null,null,null,null,null,null,null,null,null,null,null,null,null,null,null,null,null,null,{"$f":"IF('9 - Mit. Strategies Register'!A47=\"\",\"\",'9 - Mit. Strategies Register'!A47)","v":""},{"$f":"IF('9 - Mit. Strategies Register'!B47=\"\",\"\",'9 - Mit. Strategies Register'!B47)","v":""},{"$f":"IF('9 - Mit. Strategies Register'!D47=\"\",\"\",'9 - Mit. Strategies Register'!D47)","v":""},{"$f":"IF('9 - Mit. Strategies Register'!O47=\"\",\"\",'9 - Mit. Strategies Register'!O47)","v":""},{"$f":"IF('9 - Mit. Strategies Register'!P47=\"\",\"\",'9 - Mit. Strategies Register'!P47)","v":""},{"$f":"IF('9 - Mit. Strategies Register'!Q47=\"\",\"\",'9 - Mit. Strategies Register'!Q47)","v":""},{"$f":"IF('9 - Mit. Strategies Register'!R47=\"\",\"\",'9 - Mit. Strategies Register'!R47)","v":""},{"$f":"IF('9 - Mit. Strategies Register'!S47=\"\",\"\",'9 - Mit. Strategies Register'!S47)","v":""}]
[null,null,null,null,null,null,null,null,null,null,null,null,null,null,null,null,null,null,null,null,null,null,null,null,null,null,null,null,null,null,null,null,null,null,null,null,null,null,null,null,null,null,null,null,null,null,null,null,null,null,null,null,null,null,null,null,null,null,null,null,null,null,null,null,null,null,null,null,null,null,null,null,null,null,null,null,null,null,null,null,null,null,null,null,null,null,null,null,null,null,null,null,null,{"$f":"IF('9 - Mit. Strategies Register'!A48=\"\",\"\",'9 - Mit. Strategies Register'!A48)","v":""},{"$f":"IF('9 - Mit. Strategies Register'!B48=\"\",\"\",'9 - Mit. Strategies Register'!B48)","v":""},{"$f":"IF('9 - Mit. Strategies Register'!D48=\"\",\"\",'9 - Mit. Strategies Register'!D48)","v":""},{"$f":"IF('9 - Mit. Strategies Register'!O48=\"\",\"\",'9 - Mit. Strategies Register'!O48)","v":""},{"$f":"IF('9 - Mit. Strategies Register'!P48=\"\",\"\",'9 - Mit. Strategies Register'!P48)","v":""},{"$f":"IF('9 - Mit. Strategies Register'!Q48=\"\",\"\",'9 - Mit. Strategies Register'!Q48)","v":""},{"$f":"IF('9 - Mit. Strategies Register'!R48=\"\",\"\",'9 - Mit. Strategies Register'!R48)","v":""},{"$f":"IF('9 - Mit. Strategies Register'!S48=\"\",\"\",'9 - Mit. Strategies Register'!S48)","v":""}]
[null,null,null,null,null,null,null,null,null,null,null,null,null,null,null,null,null,null,null,null,null,null,null,null,null,null,null,null,null,null,null,null,null,null,null,null,null,null,null,null,null,null,null,null,null,null,null,null,null,null,null,null,null,null,null,null,null,null,null,null,null,null,null,null,null,null,null,null,null,null,null,null,null,null,null,null,null,null,null,null,null,null,null,null,null,null,null,null,null,null,null,null,null,{"$f":"IF('9 - Mit. Strategies Register'!A49=\"\",\"\",'9 - Mit. Strategies Register'!A49)","v":""},{"$f":"IF('9 - Mit. Strategies Register'!B49=\"\",\"\",'9 - Mit. Strategies Register'!B49)","v":""},{"$f":"IF('9 - Mit. Strategies Register'!D49=\"\",\"\",'9 - Mit. Strategies Register'!D49)","v":""},{"$f":"IF('9 - Mit. Strategies Register'!O49=\"\",\"\",'9 - Mit. Strategies Register'!O49)","v":""},{"$f":"IF('9 - Mit. Strategies Register'!P49=\"\",\"\",'9 - Mit. Strategies Register'!P49)","v":""},{"$f":"IF('9 - Mit. Strategies Register'!Q49=\"\",\"\",'9 - Mit. Strategies Register'!Q49)","v":""},{"$f":"IF('9 - Mit. Strategies Register'!R49=\"\",\"\",'9 - Mit. Strategies Register'!R49)","v":""},{"$f":"IF('9 - Mit. Strategies Register'!S49=\"\",\"\",'9 - Mit. Strategies Register'!S49)","v":""}]
[null,null,null,null,null,null,null,null,null,null,null,null,null,null,null,null,null,null,null,null,null,null,null,null,null,null,null,null,null,null,null,null,null,null,null,null,null,null,null,null,null,null,null,null,null,null,null,null,null,null,null,null,null,null,null,null,null,null,null,null,null,null,null,null,null,null,null,null,null,null,null,null,null,null,null,null,null,null,null,null,null,null,null,null,null,null,null,null,null,null,null,null,null,{"$f":"IF('9 - Mit. Strategies Register'!A50=\"\",\"\",'9 - Mit. Strategies Register'!A50)","v":""},{"$f":"IF('9 - Mit. Strategies Register'!B50=\"\",\"\",'9 - Mit. Strategies Register'!B50)","v":""},{"$f":"IF('9 - Mit. Strategies Register'!D50=\"\",\"\",'9 - Mit. Strategies Register'!D50)","v":""},{"$f":"IF('9 - Mit. Strategies Register'!O50=\"\",\"\",'9 - Mit. Strategies Register'!O50)","v":""},{"$f":"IF('9 - Mit. Strategies Register'!P50=\"\",\"\",'9 - Mit. Strategies Register'!P50)","v":""},{"$f":"IF('9 - Mit. Strategies Register'!Q50=\"\",\"\",'9 - Mit. Strategies Register'!Q50)","v":""},{"$f":"IF('9 - Mit. Strategies Register'!R50=\"\",\"\",'9 - Mit. Strategies Register'!R50)","v":""},{"$f":"IF('9 - Mit. Strategies Register'!S50=\"\",\"\",'9 - Mit. Strategies Register'!S50)","v":""}]
[null,null,null,null,null,null,null,null,null,null,null,null,null,null,null,null,null,null,null,null,null,null,null,null,null,null,null,null,null,null,null,null,null,null,null,null,null,null,null,null,null,null,null,null,null,null,null,null,null,null,null,null,null,null,null,null,null,null,null,null,null,null,null,null,null,null,null,null,null,null,null,null,null,null,null,null,null,null,null,null,null,null,null,null,null,null,null,null,null,null,null,null,null,{"$f":"IF('9 - Mit. Strategies Register'!A51=\"\",\"\",'9 - Mit. Strategies Register'!A51)","v":""},{"$f":"IF('9 - Mit. Strategies Register'!B51=\"\",\"\",'9 - Mit. Strategies Register'!B51)","v":""},{"$f":"IF('9 - Mit. Strategies Register'!D51=\"\",\"\",'9 - Mit. Strategies Register'!D51)","v":""},{"$f":"IF('9 - Mit. Strategies Register'!O51=\"\",\"\",'9 - Mit. Strategies Register'!O51)","v":""},{"$f":"IF('9 - Mit. Strategies Register'!P51=\"\",\"\",'9 - Mit. Strategies Register'!P51)","v":""},{"$f":"IF('9 - Mit. Strategies Register'!Q51=\"\",\"\",'9 - Mit. Strategies Register'!Q51)","v":""},{"$f":"IF('9 - Mit. Strategies Register'!R51=\"\",\"\",'9 - Mit. Strategies Register'!R51)","v":""},{"$f":"IF('9 - Mit. Strategies Register'!S51=\"\",\"\",'9 - Mit. Strategies Register'!S51)","v":""}]
[null,null,null,null,null,null,null,null,null,null,null,null,null,null,null,null,null,null,null,null,null,null,null,null,null,null,null,null,null,null,null,null,null,null,null,null,null,null,null,null,null,null,null,null,null,null,null,null,null,null,null,null,null,null,null,null,null,null,null,null,null,null,null,null,null,null,null,null,null,null,null,null,null,null,null,null,null,null,null,null,null,null,null,null,null,null,null,null,null,null,null,null,null,{"$f":"IF('9 - Mit. Strategies Register'!A52=\"\",\"\",'9 - Mit. Strategies Register'!A52)","v":""},{"$f":"IF('9 - Mit. Strategies Register'!B52=\"\",\"\",'9 - Mit. Strategies Register'!B52)","v":""},{"$f":"IF('9 - Mit. Strategies Register'!D52=\"\",\"\",'9 - Mit. Strategies Register'!D52)","v":""},{"$f":"IF('9 - Mit. Strategies Register'!O52=\"\",\"\",'9 - Mit. Strategies Register'!O52)","v":""},{"$f":"IF('9 - Mit. Strategies Register'!P52=\"\",\"\",'9 - Mit. Strategies Register'!P52)","v":""},{"$f":"IF('9 - Mit. Strategies Register'!Q52=\"\",\"\",'9 - Mit. Strategies Register'!Q52)","v":""},{"$f":"IF('9 - Mit. Strategies Register'!R52=\"\",\"\",'9 - Mit. Strategies Register'!R52)","v":""},{"$f":"IF('9 - Mit. Strategies Register'!S52=\"\",\"\",'9 - Mit. Strategies Register'!S52)","v":""}]
[null,null,null,null,null,null,null,null,null,null,null,null,null,null,null,null,null,null,null,null,null,null,null,null,null,null,null,null,null,null,null,null,null,null,null,null,null,null,null,null,null,null,null,null,null,null,null,null,null,null,null,null,null,null,null,null,null,null,null,null,null,null,null,null,null,null,null,null,null,null,null,null,null,null,null,null,null,null,null,null,null,null,null,null,null,null,null,null,null,null,null,null,null,{"$f":"IF('9 - Mit. Strategies Register'!A53=\"\",\"\",'9 - Mit. Strategies Register'!A53)","v":""},{"$f":"IF('9 - Mit. Strategies Register'!B53=\"\",\"\",'9 - Mit. Strategies Register'!B53)","v":""},{"$f":"IF('9 - Mit. Strategies Register'!D53=\"\",\"\",'9 - Mit. Strategies Register'!D53)","v":""},{"$f":"IF('9 - Mit. Strategies Register'!O53=\"\",\"\",'9 - Mit. Strategies Register'!O53)","v":""},{"$f":"IF('9 - Mit. Strategies Register'!P53=\"\",\"\",'9 - Mit. Strategies Register'!P53)","v":""},{"$f":"IF('9 - Mit. Strategies Register'!Q53=\"\",\"\",'9 - Mit. Strategies Register'!Q53)","v":""},{"$f":"IF('9 - Mit. Strategies Register'!R53=\"\",\"\",'9 - Mit. Strategies Register'!R53)","v":""},{"$f":"IF('9 - Mit. Strategies Register'!S53=\"\",\"\",'9 - Mit. Strategies Register'!S53)","v":""}]
[null,null,null,null,null,null,null,null,null,null,null,null,null,null,null,null,null,null,null,null,null,null,null,null,null,null,null,null,null,null,null,null,null,null,null,null,null,null,null,null,null,null,null,null,null,null,null,null,null,null,null,null,null,null,null,null,null,null,null,null,null,null,null,null,null,null,null,null,null,null,null,null,null,null,null,null,null,null,null,null,null,null,null,null,null,null,null,null,null,null,null,null,null,{"$f":"IF('9 - Mit. Strategies Register'!A54=\"\",\"\",'9 - Mit. Strategies Register'!A54)","v":""},{"$f":"IF('9 - Mit. Strategies Register'!B54=\"\",\"\",'9 - Mit. Strategies Register'!B54)","v":""},{"$f":"IF('9 - Mit. Strategies Register'!D54=\"\",\"\",'9 - Mit. Strategies Register'!D54)","v":""},{"$f":"IF('9 - Mit. Strategies Register'!O54=\"\",\"\",'9 - Mit. Strategies Register'!O54)","v":""},{"$f":"IF('9 - Mit. Strategies Register'!P54=\"\",\"\",'9 - Mit. Strategies Register'!P54)","v":""},{"$f":"IF('9 - Mit. Strategies Register'!Q54=\"\",\"\",'9 - Mit. Strategies Register'!Q54)","v":""},{"$f":"IF('9 - Mit. Strategies Register'!R54=\"\",\"\",'9 - Mit. Strategies Register'!R54)","v":""},{"$f":"IF('9 - Mit. Strategies Register'!S54=\"\",\"\",'9 - Mit. Strategies Register'!S54)","v":""}]
[null,null,null,null,null,null,null,null,null,null,null,null,null,null,null,null,null,null,null,null,null,null,null,null,null,null,null,null,null,null,null,null,null,null,null,null,null,null,null,null,null,null,null,null,null,null,null,null,null,null,null,null,null,null,null,null,null,null,null,null,null,null,null,null,null,null,null,null,null,null,null,null,null,null,null,null,null,null,null,null,null,null,null,null,null,null,null,null,null,null,null,null,null,{"$f":"IF('9 - Mit. Strategies Register'!A55=\"\",\"\",'9 - Mit. Strategies Register'!A55)","v":""},{"$f":"IF('9 - Mit. Strategies Register'!B55=\"\",\"\",'9 - Mit. Strategies Register'!B55)","v":""},{"$f":"IF('9 - Mit. Strategies Register'!D55=\"\",\"\",'9 - Mit. Strategies Register'!D55)","v":""},{"$f":"IF('9 - Mit. Strategies Register'!O55=\"\",\"\",'9 - Mit. Strategies Register'!O55)","v":""},{"$f":"IF('9 - Mit. Strategies Register'!P55=\"\",\"\",'9 - Mit. Strategies Register'!P55)","v":""},{"$f":"IF('9 - Mit. Strategies Register'!Q55=\"\",\"\",'9 - Mit. Strategies Register'!Q55)","v":""},{"$f":"IF('9 - Mit. Strategies Register'!R55=\"\",\"\",'9 - Mit. Strategies Register'!R55)","v":""},{"$f":"IF('9 - Mit. Strategies Register'!S55=\"\",\"\",'9 - Mit. Strategies Register'!S55)","v":""}]
[null,null,null,null,null,null,null,null,null,null,null,null,null,null,null,null,null,null,null,null,null,null,null,null,null,null,null,null,null,null,null,null,null,null,null,null,null,null,null,null,null,null,null,null,null,null,null,null,null,null,null,null,null,null,null,null,null,null,null,null,null,null,null,null,null,null,null,null,null,null,null,null,null,null,null,null,null,null,null,null,null,null,null,null,null,null,null,null,null,null,null,null,null,{"$f":"IF('9 - Mit. Strategies Register'!A56=\"\",\"\",'9 - Mit. Strategies Register'!A56)","v":""},{"$f":"IF('9 - Mit. Strategies Register'!B56=\"\",\"\",'9 - Mit. Strategies Register'!B56)","v":""},{"$f":"IF('9 - Mit. Strategies Register'!D56=\"\",\"\",'9 - Mit. Strategies Register'!D56)","v":""},{"$f":"IF('9 - Mit. Strategies Register'!O56=\"\",\"\",'9 - Mit. Strategies Register'!O56)","v":""},{"$f":"IF('9 - Mit. Strategies Register'!P56=\"\",\"\",'9 - Mit. Strategies Register'!P56)","v":""},{"$f":"IF('9 - Mit. Strategies Register'!Q56=\"\",\"\",'9 - Mit. Strategies Register'!Q56)","v":""},{"$f":"IF('9 - Mit. Strategies Register'!R56=\"\",\"\",'9 - Mit. Strategies Register'!R56)","v":""},{"$f":"IF('9 - Mit. Strategies Register'!S56=\"\",\"\",'9 - Mit. Strategies Register'!S56)","v":""}]
[null,null,null,null,null,null,null,null,null,null,null,null,null,null,null,null,null,null,null,null,null,null,null,null,null,null,null,null,null,null,null,null,null,null,null,null,null,null,null,null,null,null,null,null,null,null,null,null,null,null,null,null,null,null,null,null,null,null,null,null,null,null,null,null,null,null,null,null,null,null,null,null,null,null,null,null,null,null,null,null,null,null,null,null,null,null,null,null,null,null,null,null,null,{"$f":"IF('9 - Mit. Strategies Register'!A57=\"\",\"\",'9 - Mit. Strategies Register'!A57)","v":""},{"$f":"IF('9 - Mit. Strategies Register'!B57=\"\",\"\",'9 - Mit. Strategies Register'!B57)","v":""},{"$f":"IF('9 - Mit. Strategies Register'!D57=\"\",\"\",'9 - Mit. Strategies Register'!D57)","v":""},{"$f":"IF('9 - Mit. Strategies Register'!O57=\"\",\"\",'9 - Mit. Strategies Register'!O57)","v":""},{"$f":"IF('9 - Mit. Strategies Register'!P57=\"\",\"\",'9 - Mit. Strategies Register'!P57)","v":""},{"$f":"IF('9 - Mit. Strategies Register'!Q57=\"\",\"\",'9 - Mit. Strategies Register'!Q57)","v":""},{"$f":"IF('9 - Mit. Strategies Register'!R57=\"\",\"\",'9 - Mit. Strategies Register'!R57)","v":""},{"$f":"IF('9 - Mit. Strategies Register'!S57=\"\",\"\",'9 - Mit. Strategies Register'!S57)","v":""}]
[null,null,null,null,null,null,null,null,null,null,null,null,null,null,null,null,null,null,null,null,null,null,null,null,null,null,null,null,null,null,null,null,null,null,null,null,null,null,null,null,null,null,null,null,null,null,null,null,null,null,null,null,null,null,null,null,null,null,null,null,null,null,null,null,null,null,null,null,null,null,null,null,null,null,null,null,null,null,null,null,null,null,null,null,null,null,null,null,null,null,null,null,null,{"$f":"IF('9 - Mit. Strategies Register'!A58=\"\",\"\",'9 - Mit. Strategies Register'!A58)","v":""},{"$f":"IF('9 - Mit. Strategies Register'!B58=\"\",\"\",'9 - Mit. Strategies Register'!B58)","v":""},{"$f":"IF('9 - Mit. Strategies Register'!D58=\"\",\"\",'9 - Mit. Strategies Register'!D58)","v":""},{"$f":"IF('9 - Mit. Strategies Register'!O58=\"\",\"\",'9 - Mit. Strategies Register'!O58)","v":""},{"$f":"IF('9 - Mit. Strategies Register'!P58=\"\",\"\",'9 - Mit. Strategies Register'!P58)","v":""},{"$f":"IF('9 - Mit. Strategies Register'!Q58=\"\",\"\",'9 - Mit. Strategies Register'!Q58)","v":""},{"$f":"IF('9 - Mit. Strategies Register'!R58=\"\",\"\",'9 - Mit. Strategies Register'!R58)","v":""},{"$f":"IF('9 - Mit. Strategies Register'!S58=\"\",\"\",'9 - Mit. Strategies Register'!S58)","v":""}]
[null,null,null,null,null,null,null,null,null,null,null,null,null,null,null,null,null,null,null,null,null,null,null,null,null,null,null,null,null,null,null,null,null,null,null,null,null,null,null,null,null,null,null,null,null,null,null,null,null,null,null,null,null,null,null,null,null,null,null,null,null,null,null,null,null,null,null,null,null,null,null,null,null,null,null,null,null,null,null,null,null,null,null,null,null,null,null,null,null,null,null,null,null,{"$f":"IF('9 - Mit. Strategies Register'!A59=\"\",\"\",'9 - Mit. Strategies Register'!A59)","v":""},{"$f":"IF('9 - Mit. Strategies Register'!B59=\"\",\"\",'9 - Mit. Strategies Register'!B59)","v":""},{"$f":"IF('9 - Mit. Strategies Register'!D59=\"\",\"\",'9 - Mit. Strategies Register'!D59)","v":""},{"$f":"IF('9 - Mit. Strategies Register'!O59=\"\",\"\",'9 - Mit. Strategies Register'!O59)","v":""},{"$f":"IF('9 - Mit. Strategies Register'!P59=\"\",\"\",'9 - Mit. Strategies Register'!P59)","v":""},{"$f":"IF('9 - Mit. Strategies Register'!Q59=\"\",\"\",'9 - Mit. Strategies Register'!Q59)","v":""},{"$f":"IF('9 - Mit. Strategies Register'!R59=\"\",\"\",'9 - Mit. Strategies Register'!R59)","v":""},{"$f":"IF('9 - Mit. Strategies Register'!S59=\"\",\"\",'9 - Mit. Strategies Register'!S59)","v":""}]
[null,null,null,null,null,null,null,null,null,null,null,null,null,null,null,null,null,null,null,null,null,null,null,null,null,null,null,null,null,null,null,null,null,null,null,null,null,null,null,null,null,null,null,null,null,null,null,null,null,null,null,null,null,null,null,null,null,null,null,null,null,null,null,null,null,null,null,null,null,null,null,null,null,null,null,null,null,null,null,null,null,null,null,null,null,null,null,null,null,null,null,null,null,{"$f":"IF('9 - Mit. Strategies Register'!A60=\"\",\"\",'9 - Mit. Strategies Register'!A60)","v":""},{"$f":"IF('9 - Mit. Strategies Register'!B60=\"\",\"\",'9 - Mit. Strategies Register'!B60)","v":""},{"$f":"IF('9 - Mit. Strategies Register'!D60=\"\",\"\",'9 - Mit. Strategies Register'!D60)","v":""},{"$f":"IF('9 - Mit. Strategies Register'!O60=\"\",\"\",'9 - Mit. Strategies Register'!O60)","v":""},{"$f":"IF('9 - Mit. Strategies Register'!P60=\"\",\"\",'9 - Mit. Strategies Register'!P60)","v":""},{"$f":"IF('9 - Mit. Strategies Register'!Q60=\"\",\"\",'9 - Mit. Strategies Register'!Q60)","v":""},{"$f":"IF('9 - Mit. Strategies Register'!R60=\"\",\"\",'9 - Mit. Strategies Register'!R60)","v":""},{"$f":"IF('9 - Mit. Strategies Register'!S60=\"\",\"\",'9 - Mit. Strategies Register'!S60)","v":""}]
[null,null,null,null,null,null,null,null,null,null,null,null,null,null,null,null,null,null,null,null,null,null,null,null,null,null,null,null,null,null,null,null,null,null,null,null,null,null,null,null,null,null,null,null,null,null,null,null,null,null,null,null,null,null,null,null,null,null,null,null,null,null,null,null,null,null,null,null,null,null,null,null,null,null,null,null,null,null,null,null,null,null,null,null,null,null,null,null,null,null,null,null,null,{"$f":"IF('9 - Mit. Strategies Register'!A61=\"\",\"\",'9 - Mit. Strategies Register'!A61)","v":""},{"$f":"IF('9 - Mit. Strategies Register'!B61=\"\",\"\",'9 - Mit. Strategies Register'!B61)","v":""},{"$f":"IF('9 - Mit. Strategies Register'!D61=\"\",\"\",'9 - Mit. Strategies Register'!D61)","v":""},{"$f":"IF('9 - Mit. Strategies Register'!O61=\"\",\"\",'9 - Mit. Strategies Register'!O61)","v":""},{"$f":"IF('9 - Mit. Strategies Register'!P61=\"\",\"\",'9 - Mit. Strategies Register'!P61)","v":""},{"$f":"IF('9 - Mit. Strategies Register'!Q61=\"\",\"\",'9 - Mit. Strategies Register'!Q61)","v":""},{"$f":"IF('9 - Mit. Strategies Register'!R61=\"\",\"\",'9 - Mit. Strategies Register'!R61)","v":""},{"$f":"IF('9 - Mit. Strategies Register'!S61=\"\",\"\",'9 - Mit. Strategies Register'!S61)","v":""}]
[null,null,null,null,null,null,null,null,null,null,null,null,null,null,null,null,null,null,null,null,null,null,null,null,null,null,null,null,null,null,null,null,null,null,null,null,null,null,null,null,null,null,null,null,null,null,null,null,null,null,null,null,null,null,null,null,null,null,null,null,null,null,null,null,null,null,null,null,null,null,null,null,null,null,null,null,null,null,null,null,null,null,null,null,null,null,null,null,null,null,null,null,null,{"$f":"IF('9 - Mit. Strategies Register'!A62=\"\",\"\",'9 - Mit. Strategies Register'!A62)","v":""},{"$f":"IF('9 - Mit. Strategies Register'!B62=\"\",\"\",'9 - Mit. Strategies Register'!B62)","v":""},{"$f":"IF('9 - Mit. Strategies Register'!D62=\"\",\"\",'9 - Mit. Strategies Register'!D62)","v":""},{"$f":"IF('9 - Mit. Strategies Register'!O62=\"\",\"\",'9 - Mit. Strategies Register'!O62)","v":""},{"$f":"IF('9 - Mit. Strategies Register'!P62=\"\",\"\",'9 - Mit. Strategies Register'!P62)","v":""},{"$f":"IF('9 - Mit. Strategies Register'!Q62=\"\",\"\",'9 - Mit. Strategies Register'!Q62)","v":""},{"$f":"IF('9 - Mit. Strategies Register'!R62=\"\",\"\",'9 - Mit. Strategies Register'!R62)","v":""},{"$f":"IF('9 - Mit. Strategies Register'!S62=\"\",\"\",'9 - Mit. Strategies Register'!S62)","v":""}]
[null,null,null,null,null,null,null,null,null,null,null,null,null,null,null,null,null,null,null,null,null,null,null,null,null,null,null,null,null,null,null,null,null,null,null,null,null,null,null,null,null,null,null,null,null,null,null,null,null,null,null,null,null,null,null,null,null,null,null,null,null,null,null,null,null,null,null,null,null,null,null,null,null,null,null,null,null,null,null,null,null,null,null,null,null,null,null,null,null,null,null,null,null,{"$f":"IF('9 - Mit. Strategies Register'!A63=\"\",\"\",'9 - Mit. Strategies Register'!A63)","v":""},{"$f":"IF('9 - Mit. Strategies Register'!B63=\"\",\"\",'9 - Mit. Strategies Register'!B63)","v":""},{"$f":"IF('9 - Mit. Strategies Register'!D63=\"\",\"\",'9 - Mit. Strategies Register'!D63)","v":""},{"$f":"IF('9 - Mit. Strategies Register'!O63=\"\",\"\",'9 - Mit. Strategies Register'!O63)","v":""},{"$f":"IF('9 - Mit. Strategies Register'!P63=\"\",\"\",'9 - Mit. Strategies Register'!P63)","v":""},{"$f":"IF('9 - Mit. Strategies Register'!Q63=\"\",\"\",'9 - Mit. Strategies Register'!Q63)","v":""},{"$f":"IF('9 - Mit. Strategies Register'!R63=\"\",\"\",'9 - Mit. Strategies Register'!R63)","v":""},{"$f":"IF('9 - Mit. Strategies Register'!S63=\"\",\"\",'9 - Mit. Strategies Register'!S63)","v":""}]
[null,null,null,null,null,null,null,null,null,null,null,null,null,null,null,null,null,null,null,null,null,null,null,null,null,null,null,null,null,null,null,null,null,null,null,null,null,null,null,null,null,null,null,null,null,null,null,null,null,null,null,null,null,null,null,null,null,null,null,null,null,null,null,null,null,null,null,null,null,null,null,null,null,null,null,null,null,null,null,null,null,null,null,null,null,null,null,null,null,null,null,null,null,{"$f":"IF('9 - Mit. Strategies Register'!A64=\"\",\"\",'9 - Mit. Strategies Register'!A64)","v":""},{"$f":"IF('9 - Mit. Strategies Register'!B64=\"\",\"\",'9 - Mit. Strategies Register'!B64)","v":""},{"$f":"IF('9 - Mit. Strategies Register'!D64=\"\",\"\",'9 - Mit. Strategies Register'!D64)","v":""},{"$f":"IF('9 - Mit. Strategies Register'!O64=\"\",\"\",'9 - Mit. Strategies Register'!O64)","v":""},{"$f":"IF('9 - Mit. Strategies Register'!P64=\"\",\"\",'9 - Mit. Strategies Register'!P64)","v":""},{"$f":"IF('9 - Mit. Strategies Register'!Q64=\"\",\"\",'9 - Mit. Strategies Register'!Q64)","v":""},{"$f":"IF('9 - Mit. Strategies Register'!R64=\"\",\"\",'9 - Mit. Strategies Register'!R64)","v":""},{"$f":"IF('9 - Mit. Strategies Register'!S64=\"\",\"\",'9 - Mit. Strategies Register'!S64)","v":""}]
[null,null,null,null,null,null,null,null,null,null,null,null,null,null,null,null,null,null,null,null,null,null,null,null,null,null,null,null,null,null,null,null,null,null,null,null,null,null,null,null,null,null,null,null,null,null,null,null,null,null,null,null,null,null,null,null,null,null,null,null,null,null,null,null,null,null,null,null,null,null,null,null,null,null,null,null,null,null,null,null,null,null,null,null,null,null,null,null,null,null,null,null,null,{"$f":"IF('9 - Mit. Strategies Register'!A65=\"\",\"\",'9 - Mit. Strategies Register'!A65)","v":""},{"$f":"IF('9 - Mit. Strategies Register'!B65=\"\",\"\",'9 - Mit. Strategies Register'!B65)","v":""},{"$f":"IF('9 - Mit. Strategies Register'!D65=\"\",\"\",'9 - Mit. Strategies Register'!D65)","v":""},{"$f":"IF('9 - Mit. Strategies Register'!O65=\"\",\"\",'9 - Mit. Strategies Register'!O65)","v":""},{"$f":"IF('9 - Mit. Strategies Register'!P65=\"\",\"\",'9 - Mit. Strategies Register'!P65)","v":""},{"$f":"IF('9 - Mit. Strategies Register'!Q65=\"\",\"\",'9 - Mit. Strategies Register'!Q65)","v":""},{"$f":"IF('9 - Mit. Strategies Register'!R65=\"\",\"\",'9 - Mit. Strategies Register'!R65)","v":""},{"$f":"IF('9 - Mit. Strategies Register'!S65=\"\",\"\",'9 - Mit. Strategies Register'!S65)","v":""}]
[null,null,null,null,null,null,null,null,null,null,null,null,null,null,null,null,null,null,null,null,null,null,null,null,null,null,null,null,null,null,null,null,null,null,null,null,null,null,null,null,null,null,null,null,null,null,null,null,null,null,null,null,null,null,null,null,null,null,null,null,null,null,null,null,null,null,null,null,null,null,null,null,null,null,null,null,null,null,null,null,null,null,null,null,null,null,null,null,null,null,null,null,null,{"$f":"IF('9 - Mit. Strategies Register'!A66=\"\",\"\",'9 - Mit. Strategies Register'!A66)","v":""},{"$f":"IF('9 - Mit. Strategies Register'!B66=\"\",\"\",'9 - Mit. Strategies Register'!B66)","v":""},{"$f":"IF('9 - Mit. Strategies Register'!D66=\"\",\"\",'9 - Mit. Strategies Register'!D66)","v":""},{"$f":"IF('9 - Mit. Strategies Register'!O66=\"\",\"\",'9 - Mit. Strategies Register'!O66)","v":""},{"$f":"IF('9 - Mit. Strategies Register'!P66=\"\",\"\",'9 - Mit. Strategies Register'!P66)","v":""},{"$f":"IF('9 - Mit. Strategies Register'!Q66=\"\",\"\",'9 - Mit. Strategies Register'!Q66)","v":""},{"$f":"IF('9 - Mit. Strategies Register'!R66=\"\",\"\",'9 - Mit. Strategies Register'!R66)","v":""},{"$f":"IF('9 - Mit. Strategies Register'!S66=\"\",\"\",'9 - Mit. Strategies Register'!S66)","v":""}]
[null,null,null,null,null,null,null,null,null,null,null,null,null,null,null,null,null,null,null,null,null,null,null,null,null,null,null,null,null,null,null,null,null,null,null,null,null,null,null,null,null,null,null,null,null,null,null,null,null,null,null,null,null,null,null,null,null,null,null,null,null,null,null,null,null,null,null,null,null,null,null,null,null,null,null,null,null,null,null,null,null,null,null,null,null,null,null,null,null,null,null,null,null,{"$f":"IF('9 - Mit. Strategies Register'!A67=\"\",\"\",'9 - Mit. Strategies Register'!A67)","v":""},{"$f":"IF('9 - Mit. Strategies Register'!B67=\"\",\"\",'9 - Mit. Strategies Register'!B67)","v":""},{"$f":"IF('9 - Mit. Strategies Register'!D67=\"\",\"\",'9 - Mit. Strategies Register'!D67)","v":""},{"$f":"IF('9 - Mit. Strategies Register'!O67=\"\",\"\",'9 - Mit. Strategies Register'!O67)","v":""},{"$f":"IF('9 - Mit. Strategies Register'!P67=\"\",\"\",'9 - Mit. Strategies Register'!P67)","v":""},{"$f":"IF('9 - Mit. Strategies Register'!Q67=\"\",\"\",'9 - Mit. Strategies Register'!Q67)","v":""},{"$f":"IF('9 - Mit. Strategies Register'!R67=\"\",\"\",'9 - Mit. Strategies Register'!R67)","v":""},{"$f":"IF('9 - Mit. Strategies Register'!S67=\"\",\"\",'9 - Mit. Strategies Register'!S67)","v":""}]
[null,null,null,null,null,null,null,null,null,null,null,null,null,null,null,null,null,null,null,null,null,null,null,null,null,null,null,null,null,null,null,null,null,null,null,null,null,null,null,null,null,null,null,null,null,null,null,null,null,null,null,null,null,null,null,null,null,null,null,null,null,null,null,null,null,null,null,null,null,null,null,null,null,null,null,null,null,null,null,null,null,null,null,null,null,null,null,null,null,null,null,null,null,{"$f":"IF('9 - Mit. Strategies Register'!A68=\"\",\"\",'9 - Mit. Strategies Register'!A68)","v":""},{"$f":"IF('9 - Mit. Strategies Register'!B68=\"\",\"\",'9 - Mit. Strategies Register'!B68)","v":""},{"$f":"IF('9 - Mit. Strategies Register'!D68=\"\",\"\",'9 - Mit. Strategies Register'!D68)","v":""},{"$f":"IF('9 - Mit. Strategies Register'!O68=\"\",\"\",'9 - Mit. Strategies Register'!O68)","v":""},{"$f":"IF('9 - Mit. Strategies Register'!P68=\"\",\"\",'9 - Mit. Strategies Register'!P68)","v":""},{"$f":"IF('9 - Mit. Strategies Register'!Q68=\"\",\"\",'9 - Mit. Strategies Register'!Q68)","v":""},{"$f":"IF('9 - Mit. Strategies Register'!R68=\"\",\"\",'9 - Mit. Strategies Register'!R68)","v":""},{"$f":"IF('9 - Mit. Strategies Register'!S68=\"\",\"\",'9 - Mit. Strategies Register'!S68)","v":""}]
[null,null,null,null,null,null,null,null,null,null,null,null,null,null,null,null,null,null,null,null,null,null,null,null,null,null,null,null,null,null,null,null,null,null,null,null,null,null,null,null,null,null,null,null,null,null,null,null,null,null,null,null,null,null,null,null,null,null,null,null,null,null,null,null,null,null,null,null,null,null,null,null,null,null,null,null,null,null,null,null,null,null,null,null,null,null,null,null,null,null,null,null,null,{"$f":"IF('9 - Mit. Strategies Register'!A69=\"\",\"\",'9 - Mit. Strategies Register'!A69)","v":""},{"$f":"IF('9 - Mit. Strategies Register'!B69=\"\",\"\",'9 - Mit. Strategies Register'!B69)","v":""},{"$f":"IF('9 - Mit. Strategies Register'!D69=\"\",\"\",'9 - Mit. Strategies Register'!D69)","v":""},{"$f":"IF('9 - Mit. Strategies Register'!O69=\"\",\"\",'9 - Mit. Strategies Register'!O69)","v":""},{"$f":"IF('9 - Mit. Strategies Register'!P69=\"\",\"\",'9 - Mit. Strategies Register'!P69)","v":""},{"$f":"IF('9 - Mit. Strategies Register'!Q69=\"\",\"\",'9 - Mit. Strategies Register'!Q69)","v":""},{"$f":"IF('9 - Mit. Strategies Register'!R69=\"\",\"\",'9 - Mit. Strategies Register'!R69)","v":""},{"$f":"IF('9 - Mit. Strategies Register'!S69=\"\",\"\",'9 - Mit. Strategies Register'!S69)","v":""}]
[null,null,null,null,null,null,null,null,null,null,null,null,null,null,null,null,null,null,null,null,null,null,null,null,null,null,null,null,null,null,null,null,null,null,null,null,null,null,null,null,null,null,null,null,null,null,null,null,null,null,null,null,null,null,null,null,null,null,null,null,null,null,null,null,null,null,null,null,null,null,null,null,null,null,null,null,null,null,null,null,null,null,null,null,null,null,null,null,null,null,null,null,null,{"$f":"IF('9 - Mit. Strategies Register'!A70=\"\",\"\",'9 - Mit. Strategies Register'!A70)","v":""},{"$f":"IF('9 - Mit. Strategies Register'!B70=\"\",\"\",'9 - Mit. Strategies Register'!B70)","v":""},{"$f":"IF('9 - Mit. Strategies Register'!D70=\"\",\"\",'9 - Mit. Strategies Register'!D70)","v":""},{"$f":"IF('9 - Mit. Strategies Register'!O70=\"\",\"\",'9 - Mit. Strategies Register'!O70)","v":""},{"$f":"IF('9 - Mit. Strategies Register'!P70=\"\",\"\",'9 - Mit. Strategies Register'!P70)","v":""},{"$f":"IF('9 - Mit. Strategies Register'!Q70=\"\",\"\",'9 - Mit. Strategies Register'!Q70)","v":""},{"$f":"IF('9 - Mit. Strategies Register'!R70=\"\",\"\",'9 - Mit. Strategies Register'!R70)","v":""},{"$f":"IF('9 - Mit. Strategies Register'!S70=\"\",\"\",'9 - Mit. Strategies Register'!S70)","v":""}]
[null,null,null,null,null,null,null,null,null,null,null,null,null,null,null,null,null,null,null,null,null,null,null,null,null,null,null,null,null,null,null,null,null,null,null,null,null,null,null,null,null,null,null,null,null,null,null,null,null,null,null,null,null,null,null,null,null,null,null,null,null,null,null,null,null,null,null,null,null,null,null,null,null,null,null,null,null,null,null,null,null,null,null,null,null,null,null,null,null,null,null,null,null,{"$f":"IF('9 - Mit. Strategies Register'!A71=\"\",\"\",'9 - Mit. Strategies Register'!A71)","v":""},{"$f":"IF('9 - Mit. Strategies Register'!B71=\"\",\"\",'9 - Mit. Strategies Register'!B71)","v":""},{"$f":"IF('9 - Mit. Strategies Register'!D71=\"\",\"\",'9 - Mit. Strategies Register'!D71)","v":""},{"$f":"IF('9 - Mit. Strategies Register'!O71=\"\",\"\",'9 - Mit. Strategies Register'!O71)","v":""},{"$f":"IF('9 - Mit. Strategies Register'!P71=\"\",\"\",'9 - Mit. Strategies Register'!P71)","v":""},{"$f":"IF('9 - Mit. Strategies Register'!Q71=\"\",\"\",'9 - Mit. Strategies Register'!Q71)","v":""},{"$f":"IF('9 - Mit. Strategies Register'!R71=\"\",\"\",'9 - Mit. Strategies Register'!R71)","v":""},{"$f":"IF('9 - Mit. Strategies Register'!S71=\"\",\"\",'9 - Mit. Strategies Register'!S71)","v":""}]
[null,null,null,null,null,null,null,null,null,null,null,null,null,null,null,null,null,null,null,null,null,null,null,null,null,null,null,null,null,null,null,null,null,null,null,null,null,null,null,null,null,null,null,null,null,null,null,null,null,null,null,null,null,null,null,null,null,null,null,null,null,null,null,null,null,null,null,null,null,null,null,null,null,null,null,null,null,null,null,null,null,null,null,null,null,null,null,null,null,null,null,null,null,{"$f":"IF('9 - Mit. Strategies Register'!A72=\"\",\"\",'9 - Mit. Strategies Register'!A72)","v":""},{"$f":"IF('9 - Mit. Strategies Register'!B72=\"\",\"\",'9 - Mit. Strategies Register'!B72)","v":""},{"$f":"IF('9 - Mit. Strategies Register'!D72=\"\",\"\",'9 - Mit. Strategies Register'!D72)","v":""},{"$f":"IF('9 - Mit. Strategies Register'!O72=\"\",\"\",'9 - Mit. Strategies Register'!O72)","v":""},{"$f":"IF('9 - Mit. Strategies Register'!P72=\"\",\"\",'9 - Mit. Strategies Register'!P72)","v":""},{"$f":"IF('9 - Mit. Strategies Register'!Q72=\"\",\"\",'9 - Mit. Strategies Register'!Q72)","v":""},{"$f":"IF('9 - Mit. Strategies Register'!R72=\"\",\"\",'9 - Mit. Strategies Register'!R72)","v":""},{"$f":"IF('9 - Mit. Strategies Register'!S72=\"\",\"\",'9 - Mit. Strategies Register'!S72)","v":""}]
[null,null,null,null,null,null,null,null,null,null,null,null,null,null,null,null,null,null,null,null,null,null,null,null,null,null,null,null,null,null,null,null,null,null,null,null,null,null,null,null,null,null,null,null,null,null,null,null,null,null,null,null,null,null,null,null,null,null,null,null,null,null,null,null,null,null,null,null,null,null,null,null,null,null,null,null,null,null,null,null,null,null,null,null,null,null,null,null,null,null,null,null,null,{"$f":"IF('9 - Mit. Strategies Register'!A73=\"\",\"\",'9 - Mit. Strategies Register'!A73)","v":""},{"$f":"IF('9 - Mit. Strategies Register'!B73=\"\",\"\",'9 - Mit. Strategies Register'!B73)","v":""},{"$f":"IF('9 - Mit. Strategies Register'!D73=\"\",\"\",'9 - Mit. Strategies Register'!D73)","v":""},{"$f":"IF('9 - Mit. Strategies Register'!O73=\"\",\"\",'9 - Mit. Strategies Register'!O73)","v":""},{"$f":"IF('9 - Mit. Strategies Register'!P73=\"\",\"\",'9 - Mit. Strategies Register'!P73)","v":""},{"$f":"IF('9 - Mit. Strategies Register'!Q73=\"\",\"\",'9 - Mit. Strategies Register'!Q73)","v":""},{"$f":"IF('9 - Mit. Strategies Register'!R73=\"\",\"\",'9 - Mit. Strategies Register'!R73)","v":""},{"$f":"IF('9 - Mit. Strategies Register'!S73=\"\",\"\",'9 - Mit. Strategies Register'!S73)","v":""}]
[null,null,null,null,null,null,null,null,null,null,null,null,null,null,null,null,null,null,null,null,null,null,null,null,null,null,null,null,null,null,null,null,null,null,null,null,null,null,null,null,null,null,null,null,null,null,null,null,null,null,null,null,null,null,null,null,null,null,null,null,null,null,null,null,null,null,null,null,null,null,null,null,null,null,null,null,null,null,null,null,null,null,null,null,null,null,null,null,null,null,null,null,null,{"$f":"IF('9 - Mit. Strategies Register'!A74=\"\",\"\",'9 - Mit. Strategies Register'!A74)","v":""},{"$f":"IF('9 - Mit. Strategies Register'!B74=\"\",\"\",'9 - Mit. Strategies Register'!B74)","v":""},{"$f":"IF('9 - Mit. Strategies Register'!D74=\"\",\"\",'9 - Mit. Strategies Register'!D74)","v":""},{"$f":"IF('9 - Mit. Strategies Register'!O74=\"\",\"\",'9 - Mit. Strategies Register'!O74)","v":""},{"$f":"IF('9 - Mit. Strategies Register'!P74=\"\",\"\",'9 - Mit. Strategies Register'!P74)","v":""},{"$f":"IF('9 - Mit. Strategies Register'!Q74=\"\",\"\",'9 - Mit. Strategies Register'!Q74)","v":""},{"$f":"IF('9 - Mit. Strategies Register'!R74=\"\",\"\",'9 - Mit. Strategies Register'!R74)","v":""},{"$f":"IF('9 - Mit. Strategies Register'!S74=\"\",\"\",'9 - Mit. Strategies Register'!S74)","v":""}]
[null,null,null,null,null,null,null,null,null,null,null,null,null,null,null,null,null,null,null,null,null,null,null,null,null,null,null,null,null,null,null,null,null,null,null,null,null,null,null,null,null,null,null,null,null,null,null,null,null,null,null,null,null,null,null,null,null,null,null,null,null,null,null,null,null,null,null,null,null,null,null,null,null,null,null,null,null,null,null,null,null,null,null,null,null,null,null,null,null,null,null,null,null,{"$f":"IF('9 - Mit. Strategies Register'!A75=\"\",\"\",'9 - Mit. Strategies Register'!A75)","v":""},{"$f":"IF('9 - Mit. Strategies Register'!B75=\"\",\"\",'9 - Mit. Strategies Register'!B75)","v":""},{"$f":"IF('9 - Mit. Strategies Register'!D75=\"\",\"\",'9 - Mit. Strategies Register'!D75)","v":""},{"$f":"IF('9 - Mit. Strategies Register'!O75=\"\",\"\",'9 - Mit. Strategies Register'!O75)","v":""},{"$f":"IF('9 - Mit. Strategies Register'!P75=\"\",\"\",'9 - Mit. Strategies Register'!P75)","v":""},{"$f":"IF('9 - Mit. Strategies Register'!Q75=\"\",\"\",'9 - Mit. Strategies Register'!Q75)","v":""},{"$f":"IF('9 - Mit. Strategies Register'!R75=\"\",\"\",'9 - Mit. Strategies Register'!R75)","v":""},{"$f":"IF('9 - Mit. Strategies Register'!S75=\"\",\"\",'9 - Mit. Strategies Register'!S75)","v":""}]
[null,null,null,null,null,null,null,null,null,null,null,null,null,null,null,null,null,null,null,null,null,null,null,null,null,null,null,null,null,null,null,null,null,null,null,null,null,null,null,null,null,null,null,null,null,null,null,null,null,null,null,null,null,null,null,null,null,null,null,null,null,null,null,null,null,null,null,null,null,null,null,null,null,null,null,null,null,null,null,null,null,null,null,null,null,null,null,null,null,null,null,null,null,{"$f":"IF('9 - Mit. Strategies Register'!A76=\"\",\"\",'9 - Mit. Strategies Register'!A76)","v":""},{"$f":"IF('9 - Mit. Strategies Register'!B76=\"\",\"\",'9 - Mit. Strategies Register'!B76)","v":""},{"$f":"IF('9 - Mit. Strategies Register'!D76=\"\",\"\",'9 - Mit. Strategies Register'!D76)","v":""},{"$f":"IF('9 - Mit. Strategies Register'!O76=\"\",\"\",'9 - Mit. Strategies Register'!O76)","v":""},{"$f":"IF('9 - Mit. Strategies Register'!P76=\"\",\"\",'9 - Mit. Strategies Register'!P76)","v":""},{"$f":"IF('9 - Mit. Strategies Register'!Q76=\"\",\"\",'9 - Mit. Strategies Register'!Q76)","v":""},{"$f":"IF('9 - Mit. Strategies Register'!R76=\"\",\"\",'9 - Mit. Strategies Register'!R76)","v":""},{"$f":"IF('9 - Mit. Strategies Register'!S76=\"\",\"\",'9 - Mit. Strategies Register'!S76)","v":""}]
[null,null,null,null,null,null,null,null,null,null,null,null,null,null,null,null,null,null,null,null,null,null,null,null,null,null,null,null,null,null,null,null,null,null,null,null,null,null,null,null,null,null,null,null,null,null,null,null,null,null,null,null,null,null,null,null,null,null,null,null,null,null,null,null,null,null,null,null,null,null,null,null,null,null,null,null,null,null,null,null,null,null,null,null,null,null,null,null,null,null,null,null,null,{"$f":"IF('9 - Mit. Strategies Register'!A77=\"\",\"\",'9 - Mit. Strategies Register'!A77)","v":""},{"$f":"IF('9 - Mit. Strategies Register'!B77=\"\",\"\",'9 - Mit. Strategies Register'!B77)","v":""},{"$f":"IF('9 - Mit. Strategies Register'!D77=\"\",\"\",'9 - Mit. Strategies Register'!D77)","v":""},{"$f":"IF('9 - Mit. Strategies Register'!O77=\"\",\"\",'9 - Mit. Strategies Register'!O77)","v":""},{"$f":"IF('9 - Mit. Strategies Register'!P77=\"\",\"\",'9 - Mit. Strategies Register'!P77)","v":""},{"$f":"IF('9 - Mit. Strategies Register'!Q77=\"\",\"\",'9 - Mit. Strategies Register'!Q77)","v":""},{"$f":"IF('9 - Mit. Strategies Register'!R77=\"\",\"\",'9 - Mit. Strategies Register'!R77)","v":""},{"$f":"IF('9 - Mit. Strategies Register'!S77=\"\",\"\",'9 - Mit. Strategies Register'!S77)","v":""}]
[null,null,null,null,null,null,null,null,null,null,null,null,null,null,null,null,null,null,null,null,null,null,null,null,null,null,null,null,null,null,null,null,null,null,null,null,null,null,null,null,null,null,null,null,null,null,null,null,null,null,null,null,null,null,null,null,null,null,null,null,null,null,null,null,null,null,null,null,null,null,null,null,null,null,null,null,null,null,null,null,null,null,null,null,null,null,null,null,null,null,null,null,null,{"$f":"IF('9 - Mit. Strategies Register'!A78=\"\",\"\",'9 - Mit. Strategies Register'!A78)","v":""},{"$f":"IF('9 - Mit. Strategies Register'!B78=\"\",\"\",'9 - Mit. Strategies Register'!B78)","v":""},{"$f":"IF('9 - Mit. Strategies Register'!D78=\"\",\"\",'9 - Mit. Strategies Register'!D78)","v":""},{"$f":"IF('9 - Mit. Strategies Register'!O78=\"\",\"\",'9 - Mit. Strategies Register'!O78)","v":""},{"$f":"IF('9 - Mit. Strategies Register'!P78=\"\",\"\",'9 - Mit. Strategies Register'!P78)","v":""},{"$f":"IF('9 - Mit. Strategies Register'!Q78=\"\",\"\",'9 - Mit. Strategies Register'!Q78)","v":""},{"$f":"IF('9 - Mit. Strategies Register'!R78=\"\",\"\",'9 - Mit. Strategies Register'!R78)","v":""},{"$f":"IF('9 - Mit. Strategies Register'!S78=\"\",\"\",'9 - Mit. Strategies Register'!S78)","v":""}]
[null,null,null,null,null,null,null,null,null,null,null,null,null,null,null,null,null,null,null,null,null,null,null,null,null,null,null,null,null,null,null,null,null,null,null,null,null,null,null,null,null,null,null,null,null,null,null,null,null,null,null,null,null,null,null,null,null,null,null,null,null,null,null,null,null,null,null,null,null,null,null,null,null,null,null,null,null,null,null,null,null,null,null,null,null,null,null,null,null,null,null,null,null,{"$f":"IF('9 - Mit. Strategies Register'!A79=\"\",\"\",'9 - Mit. Strategies Register'!A79)","v":""},{"$f":"IF('9 - Mit. Strategies Register'!B79=\"\",\"\",'9 - Mit. Strategies Register'!B79)","v":""},{"$f":"IF('9 - Mit. Strategies Register'!D79=\"\",\"\",'9 - Mit. Strategies Register'!D79)","v":""},{"$f":"IF('9 - Mit. Strategies Register'!O79=\"\",\"\",'9 - Mit. Strategies Register'!O79)","v":""},{"$f":"IF('9 - Mit. Strategies Register'!P79=\"\",\"\",'9 - Mit. Strategies Register'!P79)","v":""},{"$f":"IF('9 - Mit. Strategies Register'!Q79=\"\",\"\",'9 - Mit. Strategies Register'!Q79)","v":""},{"$f":"IF('9 - Mit. Strategies Register'!R79=\"\",\"\",'9 - Mit. Strategies Register'!R79)","v":""},{"$f":"IF('9 - Mit. Strategies Register'!S79=\"\",\"\",'9 - Mit. Strategies Register'!S79)","v":""}]
[null,null,null,null,null,null,null,null,null,null,null,null,null,null,null,null,null,null,null,null,null,null,null,null,null,null,null,null,null,null,null,null,null,null,null,null,null,null,null,null,null,null,null,null,null,null,null,null,null,null,null,null,null,null,null,null,null,null,null,null,null,null,null,null,null,null,null,null,null,null,null,null,null,null,null,null,null,null,null,null,null,null,null,null,null,null,null,null,null,null,null,null,null,{"$f":"IF('9 - Mit. Strategies Register'!A80=\"\",\"\",'9 - Mit. Strategies Register'!A80)","v":""},{"$f":"IF('9 - Mit. Strategies Register'!B80=\"\",\"\",'9 - Mit. Strategies Register'!B80)","v":""},{"$f":"IF('9 - Mit. Strategies Register'!D80=\"\",\"\",'9 - Mit. Strategies Register'!D80)","v":""},{"$f":"IF('9 - Mit. Strategies Register'!O80=\"\",\"\",'9 - Mit. Strategies Register'!O80)","v":""},{"$f":"IF('9 - Mit. Strategies Register'!P80=\"\",\"\",'9 - Mit. Strategies Register'!P80)","v":""},{"$f":"IF('9 - Mit. Strategies Register'!Q80=\"\",\"\",'9 - Mit. Strategies Register'!Q80)","v":""},{"$f":"IF('9 - Mit. Strategies Register'!R80=\"\",\"\",'9 - Mit. Strategies Register'!R80)","v":""},{"$f":"IF('9 - Mit. Strategies Register'!S80=\"\",\"\",'9 - Mit. Strategies Register'!S80)","v":""}]
[null,null,null,null,null,null,null,null,null,null,null,null,null,null,null,null,null,null,null,null,null,null,null,null,null,null,null,null,null,null,null,null,null,null,null,null,null,null,null,null,null,null,null,null,null,null,null,null,null,null,null,null,null,null,null,null,null,null,null,null,null,null,null,null,null,null,null,null,null,null,null,null,null,null,null,null,null,null,null,null,null,null,null,null,null,null,null,null,null,null,null,null,null,{"$f":"IF('9 - Mit. Strategies Register'!A81=\"\",\"\",'9 - Mit. Strategies Register'!A81)","v":""},{"$f":"IF('9 - Mit. Strategies Register'!B81=\"\",\"\",'9 - Mit. Strategies Register'!B81)","v":""},{"$f":"IF('9 - Mit. Strategies Register'!D81=\"\",\"\",'9 - Mit. Strategies Register'!D81)","v":""},{"$f":"IF('9 - Mit. Strategies Register'!O81=\"\",\"\",'9 - Mit. Strategies Register'!O81)","v":""},{"$f":"IF('9 - Mit. Strategies Register'!P81=\"\",\"\",'9 - Mit. Strategies Register'!P81)","v":""},{"$f":"IF('9 - Mit. Strategies Register'!Q81=\"\",\"\",'9 - Mit. Strategies Register'!Q81)","v":""},{"$f":"IF('9 - Mit. Strategies Register'!R81=\"\",\"\",'9 - Mit. Strategies Register'!R81)","v":""},{"$f":"IF('9 - Mit. Strategies Register'!S81=\"\",\"\",'9 - Mit. Strategies Register'!S81)","v":""}]
[null,null,null,null,null,null,null,null,null,null,null,null,null,null,null,null,null,null,null,null,null,null,null,null,null,null,null,null,null,null,null,null,null,null,null,null,null,null,null,null,null,null,null,null,null,null,null,null,null,null,null,null,null,null,null,null,null,null,null,null,null,null,null,null,null,null,null,null,null,null,null,null,null,null,null,null,null,null,null,null,null,null,null,null,null,null,null,null,null,null,null,null,null,{"$f":"IF('9 - Mit. Strategies Register'!A82=\"\",\"\",'9 - Mit. Strategies Register'!A82)","v":""},{"$f":"IF('9 - Mit. Strategies Register'!B82=\"\",\"\",'9 - Mit. Strategies Register'!B82)","v":""},{"$f":"IF('9 - Mit. Strategies Register'!D82=\"\",\"\",'9 - Mit. Strategies Register'!D82)","v":""},{"$f":"IF('9 - Mit. Strategies Register'!O82=\"\",\"\",'9 - Mit. Strategies Register'!O82)","v":""},{"$f":"IF('9 - Mit. Strategies Register'!P82=\"\",\"\",'9 - Mit. Strategies Register'!P82)","v":""},{"$f":"IF('9 - Mit. Strategies Register'!Q82=\"\",\"\",'9 - Mit. Strategies Register'!Q82)","v":""},{"$f":"IF('9 - Mit. Strategies Register'!R82=\"\",\"\",'9 - Mit. Strategies Register'!R82)","v":""},{"$f":"IF('9 - Mit. Strategies Register'!S82=\"\",\"\",'9 - Mit. Strategies Register'!S82)","v":""}]
[null,null,null,null,null,null,null,null,null,null,null,null,null,null,null,null,null,null,null,null,null,null,null,null,null,null,null,null,null,null,null,null,null,null,null,null,null,null,null,null,null,null,null,null,null,null,null,null,null,null,null,null,null,null,null,null,null,null,null,null,null,null,null,null,null,null,null,null,null,null,null,null,null,null,null,null,null,null,null,null,null,null,null,null,null,null,null,null,null,null,null,null,null,{"$f":"IF('9 - Mit. Strategies Register'!A83=\"\",\"\",'9 - Mit. Strategies Register'!A83)","v":""},{"$f":"IF('9 - Mit. Strategies Register'!B83=\"\",\"\",'9 - Mit. Strategies Register'!B83)","v":""},{"$f":"IF('9 - Mit. Strategies Register'!D83=\"\",\"\",'9 - Mit. Strategies Register'!D83)","v":""},{"$f":"IF('9 - Mit. Strategies Register'!O83=\"\",\"\",'9 - Mit. Strategies Register'!O83)","v":""},{"$f":"IF('9 - Mit. Strategies Register'!P83=\"\",\"\",'9 - Mit. Strategies Register'!P83)","v":""},{"$f":"IF('9 - Mit. Strategies Register'!Q83=\"\",\"\",'9 - Mit. Strategies Register'!Q83)","v":""},{"$f":"IF('9 - Mit. Strategies Register'!R83=\"\",\"\",'9 - Mit. Strategies Register'!R83)","v":""},{"$f":"IF('9 - Mit. Strategies Register'!S83=\"\",\"\",'9 - Mit. Strategies Register'!S83)","v":""}]
[null,null,null,null,null,null,null,null,null,null,null,null,null,null,null,null,null,null,null,null,null,null,null,null,null,null,null,null,null,null,null,null,null,null,null,null,null,null,null,null,null,null,null,null,null,null,null,null,null,null,null,null,null,null,null,null,null,null,null,null,null,null,null,null,null,null,null,null,null,null,null,null,null,null,null,null,null,null,null,null,null,null,null,null,null,null,null,null,null,null,null,null,null,{"$f":"IF('9 - Mit. Strategies Register'!A84=\"\",\"\",'9 - Mit. Strategies Register'!A84)","v":""},{"$f":"IF('9 - Mit. Strategies Register'!B84=\"\",\"\",'9 - Mit. Strategies Register'!B84)","v":""},{"$f":"IF('9 - Mit. Strategies Register'!D84=\"\",\"\",'9 - Mit. Strategies Register'!D84)","v":""},{"$f":"IF('9 - Mit. Strategies Register'!O84=\"\",\"\",'9 - Mit. Strategies Register'!O84)","v":""},{"$f":"IF('9 - Mit. Strategies Register'!P84=\"\",\"\",'9 - Mit. Strategies Register'!P84)","v":""},{"$f":"IF('9 - Mit. Strategies Register'!Q84=\"\",\"\",'9 - Mit. Strategies Register'!Q84)","v":""},{"$f":"IF('9 - Mit. Strategies Register'!R84=\"\",\"\",'9 - Mit. Strategies Register'!R84)","v":""},{"$f":"IF('9 - Mit. Strategies Register'!S84=\"\",\"\",'9 - Mit. Strategies Register'!S84)","v":""}]
[null,null,null,null,null,null,null,null,null,null,null,null,null,null,null,null,null,null,null,null,null,null,null,null,null,null,null,null,null,null,null,null,null,null,null,null,null,null,null,null,null,null,null,null,null,null,null,null,null,null,null,null,null,null,null,null,null,null,null,null,null,null,null,null,null,null,null,null,null,null,null,null,null,null,null,null,null,null,null,null,null,null,null,null,null,null,null,null,null,null,null,null,null,{"$f":"IF('9 - Mit. Strategies Register'!A85=\"\",\"\",'9 - Mit. Strategies Register'!A85)","v":""},{"$f":"IF('9 - Mit. Strategies Register'!B85=\"\",\"\",'9 - Mit. Strategies Register'!B85)","v":""},{"$f":"IF('9 - Mit. Strategies Register'!D85=\"\",\"\",'9 - Mit. Strategies Register'!D85)","v":""},{"$f":"IF('9 - Mit. Strategies Register'!O85=\"\",\"\",'9 - Mit. Strategies Register'!O85)","v":""},{"$f":"IF('9 - Mit. Strategies Register'!P85=\"\",\"\",'9 - Mit. Strategies Register'!P85)","v":""},{"$f":"IF('9 - Mit. Strategies Register'!Q85=\"\",\"\",'9 - Mit. Strategies Register'!Q85)","v":""},{"$f":"IF('9 - Mit. Strategies Register'!R85=\"\",\"\",'9 - Mit. Strategies Register'!R85)","v":""},{"$f":"IF('9 - Mit. Strategies Register'!S85=\"\",\"\",'9 - Mit. Strategies Register'!S85)","v":""}]
[null,null,null,null,null,null,null,null,null,null,null,null,null,null,null,null,null,null,null,null,null,null,null,null,null,null,null,null,null,null,null,null,null,null,null,null,null,null,null,null,null,null,null,null,null,null,null,null,null,null,null,null,null,null,null,null,null,null,null,null,null,null,null,null,null,null,null,null,null,null,null,null,null,null,null,null,null,null,null,null,null,null,null,null,null,null,null,null,null,null,null,null,null,{"$f":"IF('9 - Mit. Strategies Register'!A86=\"\",\"\",'9 - Mit. Strategies Register'!A86)","v":""},{"$f":"IF('9 - Mit. Strategies Register'!B86=\"\",\"\",'9 - Mit. Strategies Register'!B86)","v":""},{"$f":"IF('9 - Mit. Strategies Register'!D86=\"\",\"\",'9 - Mit. Strategies Register'!D86)","v":""},{"$f":"IF('9 - Mit. Strategies Register'!O86=\"\",\"\",'9 - Mit. Strategies Register'!O86)","v":""},{"$f":"IF('9 - Mit. Strategies Register'!P86=\"\",\"\",'9 - Mit. Strategies Register'!P86)","v":""},{"$f":"IF('9 - Mit. Strategies Register'!Q86=\"\",\"\",'9 - Mit. Strategies Register'!Q86)","v":""},{"$f":"IF('9 - Mit. Strategies Register'!R86=\"\",\"\",'9 - Mit. Strategies Register'!R86)","v":""},{"$f":"IF('9 - Mit. Strategies Register'!S86=\"\",\"\",'9 - Mit. Strategies Register'!S86)","v":""}]
[null,null,null,null,null,null,null,null,null,null,null,null,null,null,null,null,null,null,null,null,null,null,null,null,null,null,null,null,null,null,null,null,null,null,null,null,null,null,null,null,null,null,null,null,null,null,null,null,null,null,null,null,null,null,null,null,null,null,null,null,null,null,null,null,null,null,null,null,null,null,null,null,null,null,null,null,null,null,null,null,null,null,null,null,null,null,null,null,null,null,null,null,null,{"$f":"IF('9 - Mit. Strategies Register'!A87=\"\",\"\",'9 - Mit. Strategies Register'!A87)","v":""},{"$f":"IF('9 - Mit. Strategies Register'!B87=\"\",\"\",'9 - Mit. Strategies Register'!B87)","v":""},{"$f":"IF('9 - Mit. Strategies Register'!D87=\"\",\"\",'9 - Mit. Strategies Register'!D87)","v":""},{"$f":"IF('9 - Mit. Strategies Register'!O87=\"\",\"\",'9 - Mit. Strategies Register'!O87)","v":""},{"$f":"IF('9 - Mit. Strategies Register'!P87=\"\",\"\",'9 - Mit. Strategies Register'!P87)","v":""},{"$f":"IF('9 - Mit. Strategies Register'!Q87=\"\",\"\",'9 - Mit. Strategies Register'!Q87)","v":""},{"$f":"IF('9 - Mit. Strategies Register'!R87=\"\",\"\",'9 - Mit. Strategies Register'!R87)","v":""},{"$f":"IF('9 - Mit. Strategies Register'!S87=\"\",\"\",'9 - Mit. Strategies Register'!S87)","v":""}]
[null,null,null,null,null,null,null,null,null,null,null,null,null,null,null,null,null,null,null,null,null,null,null,null,null,null,null,null,null,null,null,null,null,null,null,null,null,null,null,null,null,null,null,null,null,null,null,null,null,null,null,null,null,null,null,null,null,null,null,null,null,null,null,null,null,null,null,null,null,null,null,null,null,null,null,null,null,null,null,null,null,null,null,null,null,null,null,null,null,null,null,null,null,{"$f":"IF('9 - Mit. Strategies Register'!A88=\"\",\"\",'9 - Mit. Strategies Register'!A88)","v":""},{"$f":"IF('9 - Mit. Strategies Register'!B88=\"\",\"\",'9 - Mit. Strategies Register'!B88)","v":""},{"$f":"IF('9 - Mit. Strategies Register'!D88=\"\",\"\",'9 - Mit. Strategies Register'!D88)","v":""},{"$f":"IF('9 - Mit. Strategies Register'!O88=\"\",\"\",'9 - Mit. Strategies Register'!O88)","v":""},{"$f":"IF('9 - Mit. Strategies Register'!P88=\"\",\"\",'9 - Mit. Strategies Register'!P88)","v":""},{"$f":"IF('9 - Mit. Strategies Register'!Q88=\"\",\"\",'9 - Mit. Strategies Register'!Q88)","v":""},{"$f":"IF('9 - Mit. Strategies Register'!R88=\"\",\"\",'9 - Mit. Strategies Register'!R88)","v":""},{"$f":"IF('9 - Mit. Strategies Register'!S88=\"\",\"\",'9 - Mit. Strategies Register'!S88)","v":""}]
[null,null,null,null,null,null,null,null,null,null,null,null,null,null,null,null,null,null,null,null,null,null,null,null,null,null,null,null,null,null,null,null,null,null,null,null,null,null,null,null,null,null,null,null,null,null,null,null,null,null,null,null,null,null,null,null,null,null,null,null,null,null,null,null,null,null,null,null,null,null,null,null,null,null,null,null,null,null,null,null,null,null,null,null,null,null,null,null,null,null,null,null,null,{"$f":"IF('9 - Mit. Strategies Register'!A89=\"\",\"\",'9 - Mit. Strategies Register'!A89)","v":""},{"$f":"IF('9 - Mit. Strategies Register'!B89=\"\",\"\",'9 - Mit. Strategies Register'!B89)","v":""},{"$f":"IF('9 - Mit. Strategies Register'!D89=\"\",\"\",'9 - Mit. Strategies Register'!D89)","v":""},{"$f":"IF('9 - Mit. Strategies Register'!O89=\"\",\"\",'9 - Mit. Strategies Register'!O89)","v":""},{"$f":"IF('9 - Mit. Strategies Register'!P89=\"\",\"\",'9 - Mit. Strategies Register'!P89)","v":""},{"$f":"IF('9 - Mit. Strategies Register'!Q89=\"\",\"\",'9 - Mit. Strategies Register'!Q89)","v":""},{"$f":"IF('9 - Mit. Strategies Register'!R89=\"\",\"\",'9 - Mit. Strategies Register'!R89)","v":""},{"$f":"IF('9 - Mit. Strategies Register'!S89=\"\",\"\",'9 - Mit. Strategies Register'!S89)","v":""}]
[null,null,null,null,null,null,null,null,null,null,null,null,null,null,null,null,null,null,null,null,null,null,null,null,null,null,null,null,null,null,null,null,null,null,null,null,null,null,null,null,null,null,null,null,null,null,null,null,null,null,null,null,null,null,null,null,null,null,null,null,null,null,null,null,null,null,null,null,null,null,null,null,null,null,null,null,null,null,null,null,null,null,null,null,null,null,null,null,null,null,null,null,null,{"$f":"IF('9 - Mit. Strategies Register'!A90=\"\",\"\",'9 - Mit. Strategies Register'!A90)","v":""},{"$f":"IF('9 - Mit. Strategies Register'!B90=\"\",\"\",'9 - Mit. Strategies Register'!B90)","v":""},{"$f":"IF('9 - Mit. Strategies Register'!D90=\"\",\"\",'9 - Mit. Strategies Register'!D90)","v":""},{"$f":"IF('9 - Mit. Strategies Register'!O90=\"\",\"\",'9 - Mit. Strategies Register'!O90)","v":""},{"$f":"IF('9 - Mit. Strategies Register'!P90=\"\",\"\",'9 - Mit. Strategies Register'!P90)","v":""},{"$f":"IF('9 - Mit. Strategies Register'!Q90=\"\",\"\",'9 - Mit. Strategies Register'!Q90)","v":""},{"$f":"IF('9 - Mit. Strategies Register'!R90=\"\",\"\",'9 - Mit. Strategies Register'!R90)","v":""},{"$f":"IF('9 - Mit. Strategies Register'!S90=\"\",\"\",'9 - Mit. Strategies Register'!S90)","v":""}]
[null,null,null,null,null,null,null,null,null,null,null,null,null,null,null,null,null,null,null,null,null,null,null,null,null,null,null,null,null,null,null,null,null,null,null,null,null,null,null,null,null,null,null,null,null,null,null,null,null,null,null,null,null,null,null,null,null,null,null,null,null,null,null,null,null,null,null,null,null,null,null,null,null,null,null,null,null,null,null,null,null,null,null,null,null,null,null,null,null,null,null,null,null,{"$f":"IF('9 - Mit. Strategies Register'!A91=\"\",\"\",'9 - Mit. Strategies Register'!A91)","v":""},{"$f":"IF('9 - Mit. Strategies Register'!B91=\"\",\"\",'9 - Mit. Strategies Register'!B91)","v":""},{"$f":"IF('9 - Mit. Strategies Register'!D91=\"\",\"\",'9 - Mit. Strategies Register'!D91)","v":""},{"$f":"IF('9 - Mit. Strategies Register'!O91=\"\",\"\",'9 - Mit. Strategies Register'!O91)","v":""},{"$f":"IF('9 - Mit. Strategies Register'!P91=\"\",\"\",'9 - Mit. Strategies Register'!P91)","v":""},{"$f":"IF('9 - Mit. Strategies Register'!Q91=\"\",\"\",'9 - Mit. Strategies Register'!Q91)","v":""},{"$f":"IF('9 - Mit. Strategies Register'!R91=\"\",\"\",'9 - Mit. Strategies Register'!R91)","v":""},{"$f":"IF('9 - Mit. Strategies Register'!S91=\"\",\"\",'9 - Mit. Strategies Register'!S91)","v":""}]
[null,null,null,null,null,null,null,null,null,null,null,null,null,null,null,null,null,null,null,null,null,null,null,null,null,null,null,null,null,null,null,null,null,null,null,null,null,null,null,null,null,null,null,null,null,null,null,null,null,null,null,null,null,null,null,null,null,null,null,null,null,null,null,null,null,null,null,null,null,null,null,null,null,null,null,null,null,null,null,null,null,null,null,null,null,null,null,null,null,null,null,null,null,{"$f":"IF('9 - Mit. Strategies Register'!A92=\"\",\"\",'9 - Mit. Strategies Register'!A92)","v":""},{"$f":"IF('9 - Mit. Strategies Register'!B92=\"\",\"\",'9 - Mit. Strategies Register'!B92)","v":""},{"$f":"IF('9 - Mit. Strategies Register'!D92=\"\",\"\",'9 - Mit. Strategies Register'!D92)","v":""},{"$f":"IF('9 - Mit. Strategies Register'!O92=\"\",\"\",'9 - Mit. Strategies Register'!O92)","v":""},{"$f":"IF('9 - Mit. Strategies Register'!P92=\"\",\"\",'9 - Mit. Strategies Register'!P92)","v":""},{"$f":"IF('9 - Mit. Strategies Register'!Q92=\"\",\"\",'9 - Mit. Strategies Register'!Q92)","v":""},{"$f":"IF('9 - Mit. Strategies Register'!R92=\"\",\"\",'9 - Mit. Strategies Register'!R92)","v":""},{"$f":"IF('9 - Mit. Strategies Register'!S92=\"\",\"\",'9 - Mit. Strategies Register'!S92)","v":""}]
[null,null,null,null,null,null,null,null,null,null,null,null,null,null,null,null,null,null,null,null,null,null,null,null,null,null,null,null,null,null,null,null,null,null,null,null,null,null,null,null,null,null,null,null,null,null,null,null,null,null,null,null,null,null,null,null,null,null,null,null,null,null,null,null,null,null,null,null,null,null,null,null,null,null,null,null,null,null,null,null,null,null,null,null,null,null,null,null,null,null,null,null,null,{"$f":"IF('9 - Mit. Strategies Register'!A93=\"\",\"\",'9 - Mit. Strategies Register'!A93)","v":""},{"$f":"IF('9 - Mit. Strategies Register'!B93=\"\",\"\",'9 - Mit. Strategies Register'!B93)","v":""},{"$f":"IF('9 - Mit. Strategies Register'!D93=\"\",\"\",'9 - Mit. Strategies Register'!D93)","v":""},{"$f":"IF('9 - Mit. Strategies Register'!O93=\"\",\"\",'9 - Mit. Strategies Register'!O93)","v":""},{"$f":"IF('9 - Mit. Strategies Register'!P93=\"\",\"\",'9 - Mit. Strategies Register'!P93)","v":""},{"$f":"IF('9 - Mit. Strategies Register'!Q93=\"\",\"\",'9 - Mit. Strategies Register'!Q93)","v":""},{"$f":"IF('9 - Mit. Strategies Register'!R93=\"\",\"\",'9 - Mit. Strategies Register'!R93)","v":""},{"$f":"IF('9 - Mit. Strategies Register'!S93=\"\",\"\",'9 - Mit. Strategies Register'!S93)","v":""}]
[null,null,null,null,null,null,null,null,null,null,null,null,null,null,null,null,null,null,null,null,null,null,null,null,null,null,null,null,null,null,null,null,null,null,null,null,null,null,null,null,null,null,null,null,null,null,null,null,null,null,null,null,null,null,null,null,null,null,null,null,null,null,null,null,null,null,null,null,null,null,null,null,null,null,null,null,null,null,null,null,null,null,null,null,null,null,null,null,null,null,null,null,null,{"$f":"IF('9 - Mit. Strategies Register'!A94=\"\",\"\",'9 - Mit. Strategies Register'!A94)","v":""},{"$f":"IF('9 - Mit. Strategies Register'!B94=\"\",\"\",'9 - Mit. Strategies Register'!B94)","v":""},{"$f":"IF('9 - Mit. Strategies Register'!D94=\"\",\"\",'9 - Mit. Strategies Register'!D94)","v":""},{"$f":"IF('9 - Mit. Strategies Register'!O94=\"\",\"\",'9 - Mit. Strategies Register'!O94)","v":""},{"$f":"IF('9 - Mit. Strategies Register'!P94=\"\",\"\",'9 - Mit. Strategies Register'!P94)","v":""},{"$f":"IF('9 - Mit. Strategies Register'!Q94=\"\",\"\",'9 - Mit. Strategies Register'!Q94)","v":""},{"$f":"IF('9 - Mit. Strategies Register'!R94=\"\",\"\",'9 - Mit. Strategies Register'!R94)","v":""},{"$f":"IF('9 - Mit. Strategies Register'!S94=\"\",\"\",'9 - Mit. Strategies Register'!S94)","v":""}]
[null,null,null,null,null,null,null,null,null,null,null,null,null,null,null,null,null,null,null,null,null,null,null,null,null,null,null,null,null,null,null,null,null,null,null,null,null,null,null,null,null,null,null,null,null,null,null,null,null,null,null,null,null,null,null,null,null,null,null,null,null,null,null,null,null,null,null,null,null,null,null,null,null,null,null,null,null,null,null,null,null,null,null,null,null,null,null,null,null,null,null,null,null,{"$f":"IF('9 - Mit. Strategies Register'!A95=\"\",\"\",'9 - Mit. Strategies Register'!A95)","v":""},{"$f":"IF('9 - Mit. Strategies Register'!B95=\"\",\"\",'9 - Mit. Strategies Register'!B95)","v":""},{"$f":"IF('9 - Mit. Strategies Register'!D95=\"\",\"\",'9 - Mit. Strategies Register'!D95)","v":""},{"$f":"IF('9 - Mit. Strategies Register'!O95=\"\",\"\",'9 - Mit. Strategies Register'!O95)","v":""},{"$f":"IF('9 - Mit. Strategies Register'!P95=\"\",\"\",'9 - Mit. Strategies Register'!P95)","v":""},{"$f":"IF('9 - Mit. Strategies Register'!Q95=\"\",\"\",'9 - Mit. Strategies Register'!Q95)","v":""},{"$f":"IF('9 - Mit. Strategies Register'!R95=\"\",\"\",'9 - Mit. Strategies Register'!R95)","v":""},{"$f":"IF('9 - Mit. Strategies Register'!S95=\"\",\"\",'9 - Mit. Strategies Register'!S95)","v":""}]
[null,null,null,null,null,null,null,null,null,null,null,null,null,null,null,null,null,null,null,null,null,null,null,null,null,null,null,null,null,null,null,null,null,null,null,null,null,null,null,null,null,null,null,null,null,null,null,null,null,null,null,null,null,null,null,null,null,null,null,null,null,null,null,null,null,null,null,null,null,null,null,null,null,null,null,null,null,null,null,null,null,null,null,null,null,null,null,null,null,null,null,null,null,{"$f":"IF('9 - Mit. Strategies Register'!A96=\"\",\"\",'9 - Mit. Strategies Register'!A96)","v":""},{"$f":"IF('9 - Mit. Strategies Register'!B96=\"\",\"\",'9 - Mit. Strategies Register'!B96)","v":""},{"$f":"IF('9 - Mit. Strategies Register'!D96=\"\",\"\",'9 - Mit. Strategies Register'!D96)","v":""},{"$f":"IF('9 - Mit. Strategies Register'!O96=\"\",\"\",'9 - Mit. Strategies Register'!O96)","v":""},{"$f":"IF('9 - Mit. Strategies Register'!P96=\"\",\"\",'9 - Mit. Strategies Register'!P96)","v":""},{"$f":"IF('9 - Mit. Strategies Register'!Q96=\"\",\"\",'9 - Mit. Strategies Register'!Q96)","v":""},{"$f":"IF('9 - Mit. Strategies Register'!R96=\"\",\"\",'9 - Mit. Strategies Register'!R96)","v":""},{"$f":"IF('9 - Mit. Strategies Register'!S96=\"\",\"\",'9 - Mit. Strategies Register'!S96)","v":""}]
[null,null,null,null,null,null,null,null,null,null,null,null,null,null,null,null,null,null,null,null,null,null,null,null,null,null,null,null,null,null,null,null,null,null,null,null,null,null,null,null,null,null,null,null,null,null,null,null,null,null,null,null,null,null,null,null,null,null,null,null,null,null,null,null,null,null,null,null,null,null,null,null,null,null,null,null,null,null,null,null,null,null,null,null,null,null,null,null,null,null,null,null,null,{"$f":"IF('9 - Mit. Strategies Register'!A97=\"\",\"\",'9 - Mit. Strategies Register'!A97)","v":""},{"$f":"IF('9 - Mit. Strategies Register'!B97=\"\",\"\",'9 - Mit. Strategies Register'!B97)","v":""},{"$f":"IF('9 - Mit. Strategies Register'!D97=\"\",\"\",'9 - Mit. Strategies Register'!D97)","v":""},{"$f":"IF('9 - Mit. Strategies Register'!O97=\"\",\"\",'9 - Mit. Strategies Register'!O97)","v":""},{"$f":"IF('9 - Mit. Strategies Register'!P97=\"\",\"\",'9 - Mit. Strategies Register'!P97)","v":""},{"$f":"IF('9 - Mit. Strategies Register'!Q97=\"\",\"\",'9 - Mit. Strategies Register'!Q97)","v":""},{"$f":"IF('9 - Mit. Strategies Register'!R97=\"\",\"\",'9 - Mit. Strategies Register'!R97)","v":""},{"$f":"IF('9 - Mit. Strategies Register'!S97=\"\",\"\",'9 - Mit. Strategies Register'!S97)","v":""}]
[null,null,null,null,null,null,null,null,null,null,null,null,null,null,null,null,null,null,null,null,null,null,null,null,null,null,null,null,null,null,null,null,null,null,null,null,null,null,null,null,null,null,null,null,null,null,null,null,null,null,null,null,null,null,null,null,null,null,null,null,null,null,null,null,null,null,null,null,null,null,null,null,null,null,null,null,null,null,null,null,null,null,null,null,null,null,null,null,null,null,null,null,null,{"$f":"IF('9 - Mit. Strategies Register'!A98=\"\",\"\",'9 - Mit. Strategies Register'!A98)","v":""},{"$f":"IF('9 - Mit. Strategies Register'!B98=\"\",\"\",'9 - Mit. Strategies Register'!B98)","v":""},{"$f":"IF('9 - Mit. Strategies Register'!D98=\"\",\"\",'9 - Mit. Strategies Register'!D98)","v":""},{"$f":"IF('9 - Mit. Strategies Register'!O98=\"\",\"\",'9 - Mit. Strategies Register'!O98)","v":""},{"$f":"IF('9 - Mit. Strategies Register'!P98=\"\",\"\",'9 - Mit. Strategies Register'!P98)","v":""},{"$f":"IF('9 - Mit. Strategies Register'!Q98=\"\",\"\",'9 - Mit. Strategies Register'!Q98)","v":""},{"$f":"IF('9 - Mit. Strategies Register'!R98=\"\",\"\",'9 - Mit. Strategies Register'!R98)","v":""},{"$f":"IF('9 - Mit. Strategies Register'!S98=\"\",\"\",'9 - Mit. Strategies Register'!S98)","v":""}]
[null,null,null,null,null,null,null,null,null,null,null,null,null,null,null,null,null,null,null,null,null,null,null,null,null,null,null,null,null,null,null,null,null,null,null,null,null,null,null,null,null,null,null,null,null,null,null,null,null,null,null,null,null,null,null,null,null,null,null,null,null,null,null,null,null,null,null,null,null,null,null,null,null,null,null,null,null,null,null,null,null,null,null,null,null,null,null,null,null,null,null,null,null,{"$f":"IF('9 - Mit. Strategies Register'!A99=\"\",\"\",'9 - Mit. Strategies Register'!A99)","v":""},{"$f":"IF('9 - Mit. Strategies Register'!B99=\"\",\"\",'9 - Mit. Strategies Register'!B99)","v":""},{"$f":"IF('9 - Mit. Strategies Register'!D99=\"\",\"\",'9 - Mit. Strategies Register'!D99)","v":""},{"$f":"IF('9 - Mit. Strategies Register'!O99=\"\",\"\",'9 - Mit. Strategies Register'!O99)","v":""},{"$f":"IF('9 - Mit. Strategies Register'!P99=\"\",\"\",'9 - Mit. Strategies Register'!P99)","v":""},{"$f":"IF('9 - Mit. Strategies Register'!Q99=\"\",\"\",'9 - Mit. Strategies Register'!Q99)","v":""},{"$f":"IF('9 - Mit. Strategies Register'!R99=\"\",\"\",'9 - Mit. Strategies Register'!R99)","v":""},{"$f":"IF('9 - Mit. Strategies Register'!S99=\"\",\"\",'9 - Mit. Strategies Register'!S99)","v":""}]
[null,null,null,null,null,null,null,null,null,null,null,null,null,null,null,null,null,null,null,null,null,null,null,null,null,null,null,null,null,null,null,null,null,null,null,null,null,null,null,null,null,null,null,null,null,null,null,null,null,null,null,null,null,null,null,null,null,null,null,null,null,null,null,null,null,null,null,null,null,null,null,null,null,null,null,null,null,null,null,null,null,null,null,null,null,null,null,null,null,null,null,null,null,{"$f":"IF('9 - Mit. Strategies Register'!A100=\"\",\"\",'9 - Mit. Strategies Register'!A100)","v":""},{"$f":"IF('9 - Mit. Strategies Register'!B100=\"\",\"\",'9 - Mit. Strategies Register'!B100)","v":""},{"$f":"IF('9 - Mit. Strategies Register'!D100=\"\",\"\",'9 - Mit. Strategies Register'!D100)","v":""},{"$f":"IF('9 - Mit. Strategies Register'!O100=\"\",\"\",'9 - Mit. Strategies Register'!O100)","v":""},{"$f":"IF('9 - Mit. Strategies Register'!P100=\"\",\"\",'9 - Mit. Strategies Register'!P100)","v":""},{"$f":"IF('9 - Mit. Strategies Register'!Q100=\"\",\"\",'9 - Mit. Strategies Register'!Q100)","v":""},{"$f":"IF('9 - Mit. Strategies Register'!R100=\"\",\"\",'9 - Mit. Strategies Register'!R100)","v":""},{"$f":"IF('9 - Mit. Strategies Register'!S100=\"\",\"\",'9 - Mit. Strategies Register'!S100)","v":""}]
[null,null,null,null,null,null,null,null,null,null,null,null,null,null,null,null,null,null,null,null,null,null,null,null,null,null,null,null,null,null,null,null,null,null,null,null,null,null,null,null,null,null,null,null,null,null,null,null,null,null,null,null,null,null,null,null,null,null,null,null,null,null,null,null,null,null,null,null,null,null,null,null,null,null,null,null,null,null,null,null,null,null,null,null,null,null,null,null,null,null,null,null,null,{"$f":"IF('9 - Mit. Strategies Register'!A101=\"\",\"\",'9 - Mit. Strategies Register'!A101)","v":""},{"$f":"IF('9 - Mit. Strategies Register'!B101=\"\",\"\",'9 - Mit. Strategies Register'!B101)","v":""},{"$f":"IF('9 - Mit. Strategies Register'!D101=\"\",\"\",'9 - Mit. Strategies Register'!D101)","v":""},{"$f":"IF('9 - Mit. Strategies Register'!O101=\"\",\"\",'9 - Mit. Strategies Register'!O101)","v":""},{"$f":"IF('9 - Mit. Strategies Register'!P101=\"\",\"\",'9 - Mit. Strategies Register'!P101)","v":""},{"$f":"IF('9 - Mit. Strategies Register'!Q101=\"\",\"\",'9 - Mit. Strategies Register'!Q101)","v":""},{"$f":"IF('9 - Mit. Strategies Register'!R101=\"\",\"\",'9 - Mit. Strategies Register'!R101)","v":""},{"$f":"IF('9 - Mit. Strategies Register'!S101=\"\",\"\",'9 - Mit. Strategies Register'!S101)","v":""}]
[null,null,null,null,null,null,null,null,null,null,null,null,null,null,null,null,null,null,null,null,null,null,null,null,null,null,null,null,null,null,null,null,null,null,null,null,null,null,null,null,null,null,null,null,null,null,null,null,null,null,null,null,null,null,null,null,null,null,null,null,null,null,null,null,null,null,null,null,null,null,null,null,null,null,null,null,null,null,null,null,null,null,null,null,null,null,null,null,null,null,null,null,null,{"$f":"IF('9 - Mit. Strategies Register'!A102=\"\",\"\",'9 - Mit. Strategies Register'!A102)","v":""},{"$f":"IF('9 - Mit. Strategies Register'!B102=\"\",\"\",'9 - Mit. Strategies Register'!B102)","v":""},{"$f":"IF('9 - Mit. Strategies Register'!D102=\"\",\"\",'9 - Mit. Strategies Register'!D102)","v":""},{"$f":"IF('9 - Mit. Strategies Register'!O102=\"\",\"\",'9 - Mit. Strategies Register'!O102)","v":""},{"$f":"IF('9 - Mit. Strategies Register'!P102=\"\",\"\",'9 - Mit. Strategies Register'!P102)","v":""},{"$f":"IF('9 - Mit. Strategies Register'!Q102=\"\",\"\",'9 - Mit. Strategies Register'!Q102)","v":""},{"$f":"IF('9 - Mit. Strategies Register'!R102=\"\",\"\",'9 - Mit. Strategies Register'!R102)","v":""},{"$f":"IF('9 - Mit. Strategies Register'!S102=\"\",\"\",'9 - Mit. Strategies Register'!S102)","v":""}]
[null,null,null,null,null,null,null,null,null,null,null,null,null,null,null,null,null,null,null,null,null,null,null,null,null,null,null,null,null,null,null,null,null,null,null,null,null,null,null,null,null,null,null,null,null,null,null,null,null,null,null,null,null,null,null,null,null,null,null,null,null,null,null,null,null,null,null,null,null,null,null,null,null,null,null,null,null,null,null,null,null,null,null,null,null,null,null,null,null,null,null,null,null,{"$f":"IF('9 - Mit. Strategies Register'!A103=\"\",\"\",'9 - Mit. Strategies Register'!A103)","v":""},{"$f":"IF('9 - Mit. Strategies Register'!B103=\"\",\"\",'9 - Mit. Strategies Register'!B103)","v":""},{"$f":"IF('9 - Mit. Strategies Register'!D103=\"\",\"\",'9 - Mit. Strategies Register'!D103)","v":""},{"$f":"IF('9 - Mit. Strategies Register'!O103=\"\",\"\",'9 - Mit. Strategies Register'!O103)","v":""},{"$f":"IF('9 - Mit. Strategies Register'!P103=\"\",\"\",'9 - Mit. Strategies Register'!P103)","v":""},{"$f":"IF('9 - Mit. Strategies Register'!Q103=\"\",\"\",'9 - Mit. Strategies Register'!Q103)","v":""},{"$f":"IF('9 - Mit. Strategies Register'!R103=\"\",\"\",'9 - Mit. Strategies Register'!R103)","v":""},{"$f":"IF('9 - Mit. Strategies Register'!S103=\"\",\"\",'9 - Mit. Strategies Register'!S103)","v":""}]
[null,null,null,null,null,null,null,null,null,null,null,null,null,null,null,null,null,null,null,null,null,null,null,null,null,null,null,null,null,null,null,null,null,null,null,null,null,null,null,null,null,null,null,null,null,null,null,null,null,null,null,null,null,null,null,null,null,null,null,null,null,null,null,null,null,null,null,null,null,null,null,null,null,null,null,null,null,null,null,null,null,null,null,null,null,null,null,null,null,null,null,null,null,{"$f":"IF('9 - Mit. Strategies Register'!A104=\"\",\"\",'9 - Mit. Strategies Register'!A104)","v":""},{"$f":"IF('9 - Mit. Strategies Register'!B104=\"\",\"\",'9 - Mit. Strategies Register'!B104)","v":""},{"$f":"IF('9 - Mit. Strategies Register'!D104=\"\",\"\",'9 - Mit. Strategies Register'!D104)","v":""},{"$f":"IF('9 - Mit. Strategies Register'!O104=\"\",\"\",'9 - Mit. Strategies Register'!O104)","v":""},{"$f":"IF('9 - Mit. Strategies Register'!P104=\"\",\"\",'9 - Mit. Strategies Register'!P104)","v":""},{"$f":"IF('9 - Mit. Strategies Register'!Q104=\"\",\"\",'9 - Mit. Strategies Register'!Q104)","v":""},{"$f":"IF('9 - Mit. Strategies Register'!R104=\"\",\"\",'9 - Mit. Strategies Register'!R104)","v":""},{"$f":"IF('9 - Mit. Strategies Register'!S104=\"\",\"\",'9 - Mit. Strategies Register'!S104)","v":""}]
[null,null,null,null,null,null,null,null,null,null,null,null,null,null,null,null,null,null,null,null,null,null,null,null,null,null,null,null,null,null,null,null,null,null,null,null,null,null,null,null,null,null,null,null,null,null,null,null,null,null,null,null,null,null,null,null,null,null,null,null,null,null,null,null,null,null,null,null,null,null,null,null,null,null,null,null,null,null,null,null,null,null,null,null,null,null,null,null,null,null,null,null,null,{"$f":"IF('9 - Mit. Strategies Register'!A105=\"\",\"\",'9 - Mit. Strategies Register'!A105)","v":""},{"$f":"IF('9 - Mit. Strategies Register'!B105=\"\",\"\",'9 - Mit. Strategies Register'!B105)","v":""},{"$f":"IF('9 - Mit. Strategies Register'!D105=\"\",\"\",'9 - Mit. Strategies Register'!D105)","v":""},{"$f":"IF('9 - Mit. Strategies Register'!O105=\"\",\"\",'9 - Mit. Strategies Register'!O105)","v":""},{"$f":"IF('9 - Mit. Strategies Register'!P105=\"\",\"\",'9 - Mit. Strategies Register'!P105)","v":""},{"$f":"IF('9 - Mit. Strategies Register'!Q105=\"\",\"\",'9 - Mit. Strategies Register'!Q105)","v":""},{"$f":"IF('9 - Mit. Strategies Register'!R105=\"\",\"\",'9 - Mit. Strategies Register'!R105)","v":""},{"$f":"IF('9 - Mit. Strategies Register'!S105=\"\",\"\",'9 - Mit. Strategies Register'!S105)","v":""}]
[null,null,null,null,null,null,null,null,null,null,null,null,null,null,null,null,null,null,null,null,null,null,null,null,null,null,null,null,null,null,null,null,null,null,null,null,null,null,null,null,null,null,null,null,null,null,null,null,null,null,null,null,null,null,null,null,null,null,null,null,null,null,null,null,null,null,null,null,null,null,null,null,null,null,null,null,null,null,null,null,null,null,null,null,null,null,null,null,null,null,null,null,null,{"$f":"IF('9 - Mit. Strategies Register'!A106=\"\",\"\",'9 - Mit. Strategies Register'!A106)","v":""},{"$f":"IF('9 - Mit. Strategies Register'!B106=\"\",\"\",'9 - Mit. Strategies Register'!B106)","v":""},{"$f":"IF('9 - Mit. Strategies Register'!D106=\"\",\"\",'9 - Mit. Strategies Register'!D106)","v":""},{"$f":"IF('9 - Mit. Strategies Register'!O106=\"\",\"\",'9 - Mit. Strategies Register'!O106)","v":""},{"$f":"IF('9 - Mit. Strategies Register'!P106=\"\",\"\",'9 - Mit. Strategies Register'!P106)","v":""},{"$f":"IF('9 - Mit. Strategies Register'!Q106=\"\",\"\",'9 - Mit. Strategies Register'!Q106)","v":""},{"$f":"IF('9 - Mit. Strategies Register'!R106=\"\",\"\",'9 - Mit. Strategies Register'!R106)","v":""},{"$f":"IF('9 - Mit. Strategies Register'!S106=\"\",\"\",'9 - Mit. Strategies Register'!S106)","v":""}]
[null,null,null,null,null,null,null,null,null,null,null,null,null,null,null,null,null,null,null,null,null,null,null,null,null,null,null,null,null,null,null,null,null,null,null,null,null,null,null,null,null,null,null,null,null,null,null,null,null,null,null,null,null,null,null,null,null,null,null,null,null,null,null,null,null,null,null,null,null,null,null,null,null,null,null,null,null,null,null,null,null,null,null,null,null,null,null,null,null,null,null,null,null,{"$f":"IF('9 - Mit. Strategies Register'!A107=\"\",\"\",'9 - Mit. Strategies Register'!A107)","v":""},{"$f":"IF('9 - Mit. Strategies Register'!B107=\"\",\"\",'9 - Mit. Strategies Register'!B107)","v":""},{"$f":"IF('9 - Mit. Strategies Register'!D107=\"\",\"\",'9 - Mit. Strategies Register'!D107)","v":""},{"$f":"IF('9 - Mit. Strategies Register'!O107=\"\",\"\",'9 - Mit. Strategies Register'!O107)","v":""},{"$f":"IF('9 - Mit. Strategies Register'!P107=\"\",\"\",'9 - Mit. Strategies Register'!P107)","v":""},{"$f":"IF('9 - Mit. Strategies Register'!Q107=\"\",\"\",'9 - Mit. Strategies Register'!Q107)","v":""},{"$f":"IF('9 - Mit. Strategies Register'!R107=\"\",\"\",'9 - Mit. Strategies Register'!R107)","v":""},{"$f":"IF('9 - Mit. Strategies Register'!S107=\"\",\"\",'9 - Mit. Strategies Register'!S107)","v":""}]
[null,null,null,null,null,null,null,null,null,null,null,null,null,null,null,null,null,null,null,null,null,null,null,null,null,null,null,null,null,null,null,null,null,null,null,null,null,null,null,null,null,null,null,null,null,null,null,null,null,null,null,null,null,null,null,null,null,null,null,null,null,null,null,null,null,null,null,null,null,null,null,null,null,null,null,null,null,null,null,null,null,null,null,null,null,null,null,null,null,null,null,null,null,{"$f":"IF('9 - Mit. Strategies Register'!A108=\"\",\"\",'9 - Mit. Strategies Register'!A108)","v":""},{"$f":"IF('9 - Mit. Strategies Register'!B108=\"\",\"\",'9 - Mit. Strategies Register'!B108)","v":""},{"$f":"IF('9 - Mit. Strategies Register'!D108=\"\",\"\",'9 - Mit. Strategies Register'!D108)","v":""},{"$f":"IF('9 - Mit. Strategies Register'!O108=\"\",\"\",'9 - Mit. Strategies Register'!O108)","v":""},{"$f":"IF('9 - Mit. Strategies Register'!P108=\"\",\"\",'9 - Mit. Strategies Register'!P108)","v":""},{"$f":"IF('9 - Mit. Strategies Register'!Q108=\"\",\"\",'9 - Mit. Strategies Register'!Q108)","v":""},{"$f":"IF('9 - Mit. Strategies Register'!R108=\"\",\"\",'9 - Mit. Strategies Register'!R108)","v":""},{"$f":"IF('9 - Mit. Strategies Register'!S108=\"\",\"\",'9 - Mit. Strategies Register'!S108)","v":""},null,null,null,null,null,null,null,null,null,null,null,null,null,null,null,null,null,null,null,null,null,null,null,null,null,null,null,null,null,null,null,null,null,null,null,null,null,null,null,null,null,null,null,"PROJECT NOTES"]
[null,null,null,null,null,null,null,null,null,null,null,null,null,null,null,null,null,null,null,null,null,null,null,null,null,null,null,null,null,null,null,null,null,null,null,null,null,null,null,null,null,null,null,null,null,null,null,null,null,null,null,null,null,null,null,null,null,null,null,null,null,null,null,null,null,null,null,null,null,null,null,null,null,null,null,null,null,null,null,null,null,null,null,null,null,null,null,null,null,null,null,null,null,null,null,null,null,null,null,null,null,null,null,null,null,null,null,null,null,null,null,null,null,null,null,null,null,null,null,null,null,null,null,null,null,null,null,null,null,null,null,null,null,null,null,null,null,null,null,null,null,null,null,null,"Note #","Analysis Step","Note"]
[null,null,null,null,null,null,null,null,null,null,null,null,null,null,null,null,null,null,null,null,null,null,null,null,null,null,null,null,null,null,null,null,null,null,null,null,null,null,null,null,null,null,null,null,null,null,null,null,null,null,null,null,null,null,null,null,null,null,null,null,null,null,null,null,null,null,null,null,null,null,null,null,null,null,null,null,null,null,null,null,null,null,null,null,null,null,null,null,null,null,null,null,null,null,null,null,null,null,null,null,null,null,null,null,null,null,null,null,null,null,null,null,null,null,null,null,null,null,null,null,null,null,null,null,null,null,null,null,null,null,null,null,null,null,null,null,null,null,null,null,null,null,null,null,1]
[null,null,null,null,null,null,null,null,null,null,null,null,null,null,null,null,null,null,null,null,null,null,null,null,null,null,null,null,null,null,null,null,null,null,null,null,null,null,null,null,null,null,null,null,null,null,null,null,null,null,null,null,null,null,null,null,null,null,null,null,null,null,null,null,null,null,null,null,null,null,null,null,null,null,null,null,null,null,null,null,null,null,null,null,null,null,null,null,null,null,null,null,null,null,null,null,null,null,null,null,null,null,null,null,null,null,null,null,null,null,null,null,null,null,null,null,null,null,null,null,null,null,null,null,null,null,null,null,null,null,null,null,null,null,null,null,null,null,null,null,null,null,null,null,2]
[null,null,null,null,null,null,null,null,null,null,null,null,null,null,null,null,null,null,null,null,null,null,null,null,null,null,null,null,null,null,null,null,null,null,null,null,null,null,null,null,null,null,null,null,null,null,null,null,null,null,null,null,null,null,null,null,null,null,null,null,null,null,null,null,null,null,null,null,null,null,null,null,null,null,null,null,null,null,null,null,null,null,null,null,null,null,null,null,null,null,null,null,null,null,null,null,null,null,null,null,null,null,null,null,null,null,null,null,null,null,null,null,null,null,null,null,null,null,null,null,null,null,null,null,null,null,null,null,null,null,null,null,null,null,null,null,null,null,null,null,null,null,null,null,3]
[null,null,null,null,null,null,null,null,null,null,null,null,null,null,null,null,null,null,null,null,null,null,null,null,null,null,null,null,null,null,null,null,null,null,null,null,null,null,null,null,null,null,null,null,null,null,null,null,null,null,null,null,null,null,null,null,null,null,null,null,null,null,null,null,null,null,null,null,null,null,null,null,null,null,null,null,null,null,null,null,null,null,null,null,null,null,null,null,null,null,null,null,null,null,null,null,null,null,null,null,null,null,null,null,null,null,null,null,null,null,null,null,null,null,null,null,null,null,null,null,null,null,null,null,null,null,null,null,null,null,null,null,null,null,null,null,null,null,null,null,null,null,null,null,4]
[null,null,null,null,null,null,null,null,null,null,null,null,null,null,null,null,null,null,null,null,null,null,null,null,null,null,null,null,null,null,null,null,null,null,null,null,null,null,null,null,null,null,null,null,null,null,null,null,null,null,null,null,null,null,null,null,null,null,null,null,null,null,null,null,null,null,null,null,null,null,null,null,null,null,null,null,null,null,null,null,null,null,null,null,null,null,null,null,null,null,null,null,null,null,null,null,null,null,null,null,null,null,null,null,null,null,null,null,null,null,null,null,null,null,null,null,null,null,null,null,null,null,null,null,null,null,null,null,null,null,null,null,null,null,null,null,null,null,null,null,null,null,null,null,5]
[null,null,null,null,null,null,null,null,null,null,null,null,null,null,null,null,null,null,null,null,null,null,null,null,null,null,null,null,null,null,null,null,null,null,null,null,null,null,null,null,null,null,null,null,null,null,null,null,null,null,null,null,null,null,null,null,null,null,null,null,null,null,null,null,null,null,null,null,null,null,null,null,null,null,null,null,null,null,null,null,null,null,null,null,null,null,null,null,null,null,null,null,null,null,null,null,null,null,null,null,null,null,null,null,null,null,null,null,null,null,null,null,null,null,null,null,null,null,null,null,null,null,null,null,null,null,null,null,null,null,null,null,null,null,null,null,null,null,null,null,null,null,null,null,6]
[null,null,null,null,null,null,null,null,null,null,null,null,null,null,null,null,null,null,null,null,null,null,null,null,null,null,null,null,null,null,null,null,null,null,null,null,null,null,null,null,null,null,null,null,null,null,null,null,null,null,null,null,null,null,null,null,null,null,null,null,null,null,null,null,null,null,null,null,null,null,null,null,null,null,null,null,null,null,null,null,null,null,null,null,null,null,null,null,null,null,null,null,null,null,null,null,null,null,null,null,null,null,null,null,null,null,null,null,null,null,null,null,null,null,null,null,null,null,null,null,null,null,null,null,null,null,null,null,null,null,null,null,null,null,null,null,null,null,null,null,null,null,null,null,7]
[null,null,null,null,null,null,null,null,null,null,null,null,null,null,null,null,null,null,null,null,null,null,null,null,null,null,null,null,null,null,null,null,null,null,null,null,null,null,null,null,null,null,null,null,null,null,null,null,null,null,null,null,null,null,null,null,null,null,null,null,null,null,null,null,null,null,null,null,null,null,null,null,null,null,null,null,null,null,null,null,null,null,null,null,null,null,null,null,null,null,null,null,null,null,null,null,null,null,null,null,null,null,null,null,null,null,null,null,null,null,null,null,null,null,null,null,null,null,null,null,null,null,null,null,null,null,null,null,null,null,null,null,null,null,null,null,null,null,null,null,null,null,null,null,8]
[null,null,null,null,null,null,null,null,null,null,null,null,null,null,null,null,null,null,null,null,null,null,null,null,null,null,null,null,null,null,null,null,null,null,null,null,null,null,null,null,null,null,null,null,null,null,null,null,null,null,null,null,null,null,null,null,null,null,null,null,null,null,null,null,null,null,null,null,null,null,null,null,null,null,null,null,null,null,null,null,null,null,null,null,null,null,null,null,null,null,null,null,null,null,null,null,null,null,null,null,null,null,null,null,null,null,null,null,null,null,null,null,null,null,null,null,null,null,null,null,null,null,null,null,null,null,null,null,null,null,null,null,null,null,null,null,null,null,null,null,null,null,null,null,9]
[null,null,null,null,null,null,null,null,null,null,null,null,null,null,null,null,null,null,null,null,null,null,null,null,null,null,null,null,null,null,null,null,null,null,null,null,null,null,null,null,null,null,null,null,null,null,null,null,null,null,null,null,null,null,null,null,null,null,null,null,null,null,null,null,null,null,null,null,null,null,null,null,null,null,null,null,null,null,null,null,null,null,null,null,null,null,null,null,null,null,null,null,null,null,null,null,null,null,null,null,null,null,null,null,null,null,null,null,null,null,null,null,null,null,null,null,null,null,null,null,null,null,null,null,null,null,null,null,null,null,null,null,null,null,null,null,null,null,null,null,null,null,null,null,10]
[null,null,null,null,null,null,null,null,null,null,null,null,null,null,null,null,null,null,null,null,null,null,null,null,null,null,null,null,null,null,null,null,null,null,null,null,null,null,null,null,null,null,null,null,null,null,null,null,null,null,null,null,null,null,null,null,null,null,null,null,null,null,null,null,null,null,null,null,null,null,null,null,null,null,null,null,null,null,null,null,null,null,null,null,null,null,null,null,null,null,null,null,null,null,null,null,null,null,null,null,null,null,null,null,null,null,null,null,null,null,null,null,null,null,null,null,null,null,null,null,null,null,null,null,null,null,null,null,null,null,null,null,null,null,null,null,null,null,null,null,null,null,null,null,11]
[null,null,null,null,null,null,null,null,null,null,null,null,null,null,null,null,null,null,null,null,null,null,null,null,null,null,null,null,null,null,null,null,null,null,null,null,null,null,null,null,null,null,null,null,null,null,null,null,null,null,null,null,null,null,null,null,null,null,null,null,null,null,null,null,null,null,null,null,null,null,null,null,null,null,null,null,null,null,null,null,null,null,null,null,null,null,null,null,null,null,null,null,null,null,null,null,null,null,null,null,null,null,null,null,null,null,null,null,null,null,null,null,null,null,null,null,null,null,null,null,null,null,null,null,null,null,null,null,null,null,null,null,null,null,null,null,null,null,null,null,null,null,null,null,12]
[null,null,null,null,null,null,null,null,null,null,null,null,null,null,null,null,null,null,null,null,null,null,null,null,null,null,null,null,null,null,null,null,null,null,null,null,null,null,null,null,null,null,null,null,null,null,null,null,null,null,null,null,null,null,null,null,null,null,null,null,null,null,null,null,null,null,null,null,null,null,null,null,null,null,null,null,null,null,null,null,null,null,null,null,null,null,null,null,null,null,null,null,null,null,null,null,null,null,null,null,null,null,null,null,null,null,null,null,null,null,null,null,null,null,null,null,null,null,null,null,null,null,null,null,null,null,null,null,null,null,null,null,null,null,null,null,null,null,null,null,null,null,null,null,13]
[null,null,null,null,null,null,null,null,null,null,null,null,null,null,null,null,null,null,null,null,null,null,null,null,null,null,null,null,null,null,null,null,null,null,null,null,null,null,null,null,null,null,null,null,null,null,null,null,null,null,null,null,null,null,null,null,null,null,null,null,null,null,null,null,null,null,null,null,null,null,null,null,null,null,null,null,null,null,null,null,null,null,null,null,null,null,null,null,null,null,null,null,null,null,null,null,null,null,null,null,null,null,null,null,null,null,null,null,null,null,null,null,null,null,null,null,null,null,null,null,null,null,null,null,null,null,null,null,null,null,null,null,null,null,null,null,null,null,null,null,null,null,null,null,14]
[null,null,null,null,null,null,null,null,null,null,null,null,null,null,null,null,null,null,null,null,null,null,null,null,null,null,null,null,null,null,null,null,null,null,null,null,null,null,null,null,null,null,null,null,null,null,null,null,null,null,null,null,null,null,null,null,null,null,null,null,null,null,null,null,null,null,null,null,null,null,null,null,null,null,null,null,null,null,null,null,null,null,null,null,null,null,null,null,null,null,null,null,null,null,null,null,null,null,null,null,null,null,null,null,null,null,null,null,null,null,null,null,null,null,null,null,null,null,null,null,null,null,null,null,null,null,null,null,null,null,null,null,null,null,null,null,null,null,null,null,null,null,null,null,15]
[null,null,null,null,null,null,null,null,null,null,null,null,null,null,null,null,null,null,null,null,null,null,null,null,null,null,null,null,null,null,null,null,null,null,null,null,null,null,null,null,null,null,null,null,null,null,null,null,null,null,null,null,null,null,null,null,null,null,null,null,null,null,null,null,null,null,null,null,null,null,null,null,null,null,null,null,null,null,null,null,null,null,null,null,null,null,null,null,null,null,null,null,null,null,null,null,null,null,null,null,null,null,null,null,null,null,null,null,null,null,null,null,null,null,null,null,null,null,null,null,null,null,null,null,null,null,null,null,null,null,null,null,null,null,null,null,null,null,null,null,null,null,null,null,16]
[null,null,null,null,null,null,null,null,null,null,null,null,null,null,null,null,null,null,null,null,null,null,null,null,null,null,null,null,null,null,null,null,null,null,null,null,null,null,null,null,null,null,null,null,null,null,null,null,null,null,null,null,null,null,null,null,null,null,null,null,null,null,null,null,null,null,null,null,null,null,null,null,null,null,null,null,null,null,null,null,null,null,null,null,null,null,null,null,null,null,null,null,null,null,null,null,null,null,null,null,null,null,null,null,null,null,null,null,null,null,null,null,null,null,null,null,null,null,null,null,null,null,null,null,null,null,null,null,null,null,null,null,null,null,null,null,null,null,null,null,null,null,null,null,17]
[null,null,null,null,null,null,null,null,null,null,null,null,null,null,null,null,null,null,null,null,null,null,null,null,null,null,null,null,null,null,null,null,null,null,null,null,null,null,null,null,null,null,null,null,null,null,null,null,null,null,null,null,null,null,null,null,null,null,null,null,null,null,null,null,null,null,null,null,null,null,null,null,null,null,null,null,null,null,null,null,null,null,null,null,null,null,null,null,null,null,null,null,null,null,null,null,null,null,null,null,null,null,null,null,null,null,null,null,null,null,null,null,null,null,null,null,null,null,null,null,null,null,null,null,null,null,null,null,null,null,null,null,null,null,null,null,null,null,null,null,null,null,null,null,18]
[null,null,null,null,null,null,null,null,null,null,null,null,null,null,null,null,null,null,null,null,null,null,null,null,null,null,null,null,null,null,null,null,null,null,null,null,null,null,null,null,null,null,null,null,null,null,null,null,null,null,null,null,null,null,null,null,null,null,null,null,null,null,null,null,null,null,null,null,null,null,null,null,null,null,null,null,null,null,null,null,null,null,null,null,null,null,null,null,null,null,null,null,null,null,null,null,null,null,null,null,null,null,null,null,null,null,null,null,null,null,null,null,null,null,null,null,null,null,null,null,null,null,null,null,null,null,null,null,null,null,null,null,null,null,null,null,null,null,null,null,null,null,null,null,19]
[null,null,null,null,null,null,null,null,null,null,null,null,null,null,null,null,null,null,null,null,null,null,null,null,null,null,null,null,null,null,null,null,null,null,null,null,null,null,null,null,null,null,null,null,null,null,null,null,null,null,null,null,null,null,null,null,null,null,null,null,null,null,null,null,null,null,null,null,null,null,null,null,null,null,null,null,null,null,null,null,null,null,null,null,null,null,null,null,null,null,null,null,null,null,null,null,null,null,null,null,null,null,null,null,null,null,null,null,null,null,null,null,null,null,null,null,null,null,null,null,null,null,null,null,null,null,null,null,null,null,null,null,null,null,null,null,null,null,null,null,null,null,null,null,20]
[null,null,null,null,null,null,null,null,null,null,null,null,null,null,null,null,null,null,null,null,null,null,null,null,null,null,null,null,null,null,null,null,null,null,null,null,null,null,null,null,null,null,null,null,null,null,null,null,null,null,null,null,null,null,null,null,null,null,null,null,null,null,null,null,null,null,null,null,null,null,null,null,null,null,null,null,null,null,null,null,null,null,null,null,null,null,null,null,null,null,null,null,null,null,null,null,null,null,null,null,null,null,null,null,null,null,null,null,null,null,null,null,null,null,null,null,null,null,null,null,null,null,null,null,null,null,null,null,null,null,null,null,null,null,null,null,null,null,null,null,null,null,null,null,21]
[null,null,null,null,null,null,null,null,null,null,null,null,null,null,null,null,null,null,null,null,null,null,null,null,null,null,null,null,null,null,null,null,null,null,null,null,null,null,null,null,null,null,null,null,null,null,null,null,null,null,null,null,null,null,null,null,null,null,null,null,null,null,null,null,null,null,null,null,null,null,null,null,null,null,null,null,null,null,null,null,null,null,null,null,null,null,null,null,null,null,null,null,null,null,null,null,null,null,null,null,null,null,null,null,null,null,null,null,null,null,null,null,null,null,null,null,null,null,null,null,null,null,null,null,null,null,null,null,null,null,null,null,null,null,null,null,null,null,null,null,null,null,null,null,22]
[null,null,null,null,null,null,null,null,null,null,null,null,null,null,null,null,null,null,null,null,null,null,null,null,null,null,null,null,null,null,null,null,null,null,null,null,null,null,null,null,null,null,null,null,null,null,null,null,null,null,null,null,null,null,null,null,null,null,null,null,null,null,null,null,null,null,null,null,null,null,null,null,null,null,null,null,null,null,null,null,null,null,null,null,null,null,null,null,null,null,null,null,null,null,null,null,null,null,null,null,null,null,null,null,null,null,null,null,null,null,null,null,null,null,null,null,null,null,null,null,null,null,null,null,null,null,null,null,null,null,null,null,null,null,null,null,null,null,null,null,null,null,null,null,23]
[null,null,null,null,null,null,null,null,null,null,null,null,null,null,null,null,null,null,null,null,null,null,null,null,null,null,null,null,null,null,null,null,null,null,null,null,null,null,null,null,null,null,null,null,null,null,null,null,null,null,null,null,null,null,null,null,null,null,null,null,null,null,null,null,null,null,null,null,null,null,null,null,null,null,null,null,null,null,null,null,null,null,null,null,null,null,null,null,null,null,null,null,null,null,null,null,null,null,null,null,null,null,null,null,null,null,null,null,null,null,null,null,null,null,null,null,null,null,null,null,null,null,null,null,null,null,null,null,null,null,null,null,null,null,null,null,null,null,null,null,null,null,null,null,24]
[null,null,null,null,null,null,null,null,null,null,null,null,null,null,null,null,null,null,null,null,null,null,null,null,null,null,null,null,null,null,null,null,null,null,null,null,null,null,null,null,null,null,null,null,null,null,null,null,null,null,null,null,null,null,null,null,null,null,null,null,null,null,null,null,null,null,null,null,null,null,null,null,null,null,null,null,null,null,null,null,null,null,null,null,null,null,null,null,null,null,null,null,null,null,null,null,null,null,null,null,null,null,null,null,null,null,null,null,null,null,null,null,null,null,null,null,null,null,null,null,null,null,null,null,null,null,null,null,null,null,null,null,null,null,null,null,null,null,null,null,null,null,null,null,25]
[null,null,null,null,null,null,null,null,null,null,null,null,null,null,null,null,null,null,null,null,null,null,null,null,null,null,null,null,null,null,null,null,null,null,null,null,null,null,null,null,null,null,null,null,null,null,null,null,null,null,null,null,null,null,null,null,null,null,null,null,null,null,null,null,null,null,null,null,null,null,null,null,null,null,null,null,null,null,null,null,null,null,null,null,null,null,null,null,null,null,null,null,null,null,null,null,null,null,null,null,null,null,null,null,null,null,null,null,null,null,null,null,null,null,null,null,null,null,null,null,null,null,null,null,null,null,null,null,null,null,null,null,null,null,null,null,null,null,null,null,null,null,null,null,26]
[null,null,null,null,null,null,null,null,null,null,null,null,null,null,null,null,null,null,null,null,null,null,null,null,null,null,null,null,null,null,null,null,null,null,null,null,null,null,null,null,null,null,null,null,null,null,null,null,null,null,null,null,null,null,null,null,null,null,null,null,null,null,null,null,null,null,null,null,null,null,null,null,null,null,null,null,null,null,null,null,null,null,null,null,null,null,null,null,null,null,null,null,null,null,null,null,null,null,null,null,null,null,null,null,null,null,null,null,null,null,null,null,null,null,null,null,null,null,null,null,null,null,null,null,null,null,null,null,null,null,null,null,null,null,null,null,null,null,null,null,null,null,null,null,27]
[null,null,null,null,null,null,null,null,null,null,null,null,null,null,null,null,null,null,null,null,null,null,null,null,null,null,null,null,null,null,null,null,null,null,null,null,null,null,null,null,null,null,null,null,null,null,null,null,null,null,null,null,null,null,null,null,null,null,null,null,null,null,null,null,null,null,null,null,null,null,null,null,null,null,null,null,null,null,null,null,null,null,null,null,null,null,null,null,null,null,null,null,null,null,null,null,null,null,null,null,null,null,null,null,null,null,null,null,null,null,null,null,null,null,null,null,null,null,null,null,null,null,null,null,null,null,null,null,null,null,null,null,null,null,null,null,null,null,null,null,null,null,null,null,28]
[null,null,null,null,null,null,null,null,null,null,null,null,null,null,null,null,null,null,null,null,null,null,null,null,null,null,null,null,null,null,null,null,null,null,null,null,null,null,null,null,null,null,null,null,null,null,null,null,null,null,null,null,null,null,null,null,null,null,null,null,null,null,null,null,null,null,null,null,null,null,null,null,null,null,null,null,null,null,null,null,null,null,null,null,null,null,null,null,null,null,null,null,null,null,null,null,null,null,null,null,null,null,null,null,null,null,null,null,null,null,null,null,null,null,null,null,null,null,null,null,null,null,null,null,null,null,null,null,null,null,null,null,null,null,null,null,null,null,null,null,null,null,null,null,29]
[null,null,null,null,null,null,null,null,null,null,null,null,null,null,null,null,null,null,null,null,null,null,null,null,null,null,null,null,null,null,null,null,null,null,null,null,null,null,null,null,null,null,null,null,null,null,null,null,null,null,null,null,null,null,null,null,null,null,null,null,null,null,null,null,null,null,null,null,null,null,null,null,null,null,null,null,null,null,null,null,null,null,null,null,null,null,null,null,null,null,null,null,null,null,null,null,null,null,null,null,null,null,null,null,null,null,null,null,null,null,null,null,null,null,null,null,null,null,null,null,null,null,null,null,null,null,null,null,null,null,null,null,null,null,null,null,null,null,null,null,null,null,null,null,30]
[null,null,null,null,null,null,null,null,null,null,null,null,null,null,null,null,null,null,null,null,null,null,null,null,null,null,null,null,null,null,null,null,null,null,null,null,null,null,null,null,null,null,null,null,null,null,null,null,null,null,null,null,null,null,null,null,null,null,null,null,null,null,null,null,null,null,null,null,null,null,null,null,null,null,null,null,null,null,null,null,null,null,null,null,null,null,null,null,null,null,null,null,null,null,null,null,null,null,null,null,null,null,null,null,null,null,null,null,null,null,null,null,null,null,null,null,null,null,null,null,null,null,null,null,null,null,null,null,null,null,null,null,null,null,null,null,null,null,null,null,null,null,null,null,31]
[null,null,null,null,null,null,null,null,null,null,null,null,null,null,null,null,null,null,null,null,null,null,null,null,null,null,null,null,null,null,null,null,null,null,null,null,null,null,null,null,null,null,null,null,null,null,null,null,null,null,null,null,null,null,null,null,null,null,null,null,null,null,null,null,null,null,null,null,null,null,null,null,null,null,null,null,null,null,null,null,null,null,null,null,null,null,null,null,null,null,null,null,null,null,null,null,null,null,null,null,null,null,null,null,null,null,null,null,null,null,null,null,null,null,null,null,null,null,null,null,null,null,null,null,null,null,null,null,null,null,null,null,null,null,null,null,null,null,null,null,null,null,null,null,32]
[null,null,null,null,null,null,null,null,null,null,null,null,null,null,null,null,null,null,null,null,null,null,null,null,null,null,null,null,null,null,null,null,null,null,null,null,null,null,null,null,null,null,null,null,null,null,null,null,null,null,null,null,null,null,null,null,null,null,null,null,null,null,null,null,null,null,null,null,null,null,null,null,null,null,null,null,null,null,null,null,null,null,null,null,null,null,null,null,null,null,null,null,null,null,null,null,null,null,null,null,null,null,null,null,null,null,null,null,null,null,null,null,null,null,null,null,null,null,null,null,null,null,null,null,null,null,null,null,null,null,null,null,null,null,null,null,null,null,null,null,null,null,null,null,33]
[null,null,null,null,null,null,null,null,null,null,null,null,null,null,null,null,null,null,null,null,null,null,null,null,null,null,null,null,null,null,null,null,null,null,null,null,null,null,null,null,null,null,null,null,null,null,null,null,null,null,null,null,null,null,null,null,null,null,null,null,null,null,null,null,null,null,null,null,null,null,null,null,null,null,null,null,null,null,null,null,null,null,null,null,null,null,null,null,null,null,null,null,null,null,null,null,null,null,null,null,null,null,null,null,null,null,null,null,null,null,null,null,null,null,null,null,null,null,null,null,null,null,null,null,null,null,null,null,null,null,null,null,null,null,null,null,null,null,null,null,null,null,null,null,34]
[null,null,null,null,null,null,null,null,null,null,null,null,null,null,null,null,null,null,null,null,null,null,null,null,null,null,null,null,null,null,null,null,null,null,null,null,null,null,null,null,null,null,null,null,null,null,null,null,null,null,null,null,null,null,null,null,null,null,null,null,null,null,null,null,null,null,null,null,null,null,null,null,null,null,null,null,null,null,null,null,null,null,null,null,null,null,null,null,null,null,null,null,null,null,null,null,null,null,null,null,null,null,null,null,null,null,null,null,null,null,null,null,null,null,null,null,null,null,null,null,null,null,null,null,null,null,null,null,null,null,null,null,null,null,null,null,null,null,null,null,null,null,null,null,35]
[null,null,null,null,null,null,null,null,null,null,null,null,null,null,null,null,null,null,null,null,null,null,null,null,null,null,null,null,null,null,null,null,null,null,null,null,null,null,null,null,null,null,null,null,null,null,null,null,null,null,null,null,null,null,null,null,null,null,null,null,null,null,null,null,null,null,null,null,null,null,null,null,null,null,null,null,null,null,null,null,null,null,null,null,null,null,null,null,null,null,null,null,null,null,null,null,null,null,null,null,null,null,null,null,null,null,null,null,null,null,null,null,null,null,null,null,null,null,null,null,null,null,null,null,null,null,null,null,null,null,null,null,null,null,null,null,null,null,null,null,null,null,null,null,36]
[null,null,null,null,null,null,null,null,null,null,null,null,null,null,null,null,null,null,null,null,null,null,null,null,null,null,null,null,null,null,null,null,null,null,null,null,null,null,null,null,null,null,null,null,null,null,null,null,null,null,null,null,null,null,null,null,null,null,null,null,null,null,null,null,null,null,null,null,null,null,null,null,null,null,null,null,null,null,null,null,null,null,null,null,null,null,null,null,null,null,null,null,null,null,null,null,null,null,null,null,null,null,null,null,null,null,null,null,null,null,null,null,null,null,null,null,null,null,null,null,null,null,null,null,null,null,null,null,null,null,null,null,null,null,null,null,null,null,null,null,null,null,null,null,37]
[null,null,null,null,null,null,null,null,null,null,null,null,null,null,null,null,null,null,null,null,null,null,null,null,null,null,null,null,null,null,null,null,null,null,null,null,null,null,null,null,null,null,null,null,null,null,null,null,null,null,null,null,null,null,null,null,null,null,null,null,null,null,null,null,null,null,null,null,null,null,null,null,null,null,null,null,null,null,null,null,null,null,null,null,null,null,null,null,null,null,null,null,null,null,null,null,null,null,null,null,null,null,null,null,null,null,null,null,null,null,null,null,null,null,null,null,null,null,null,null,null,null,null,null,null,null,null,null,null,null,null,null,null,null,null,null,null,null,null,null,null,null,null,null,38]
[null,null,null,null,null,null,null,null,null,null,null,null,null,null,null,null,null,null,null,null,null,null,null,null,null,null,null,null,null,null,null,null,null,null,null,null,null,null,null,null,null,null,null,null,null,null,null,null,null,null,null,null,null,null,null,null,null,null,null,null,null,null,null,null,null,null,null,null,null,null,null,null,null,null,null,null,null,null,null,null,null,null,null,null,null,null,null,null,null,null,null,null,null,null,null,null,null,null,null,null,null,null,null,null,null,null,null,null,null,null,null,null,null,null,null,null,null,null,null,null,null,null,null,null,null,null,null,null,null,null,null,null,null,null,null,null,null,null,null,null,null,null,null,null,39]
[null,null,null,null,null,null,null,null,null,null,null,null,null,null,null,null,null,null,null,null,null,null,null,null,null,null,null,null,null,null,null,null,null,null,null,null,null,null,null,null,null,null,null,null,null,null,null,null,null,null,null,null,null,null,null,null,null,null,null,null,null,null,null,null,null,null,null,null,null,null,null,null,null,null,null,null,null,null,null,null,null,null,null,null,null,null,null,null,null,null,null,null,null,null,null,null,null,null,null,null,null,null,null,null,null,null,null,null,null,null,null,null,null,null,null,null,null,null,null,null,null,null,null,null,null,null,null,null,null,null,null,null,null,null,null,null,null,null,null,null,null,null,null,null,40]
[null,null,null,null,null,null,null,null,null,null,null,null,null,null,null,null,null,null,null,null,null,null,null,null,null,null,null,null,null,null,null,null,null,null,null,null,null,null,null,null,null,null,null,null,null,null,null,null,null,null,null,null,null,null,null,null,null,null,null,null,null,null,null,null,null,null,null,null,null,null,null,null,null,null,null,null,null,null,null,null,null,null,null,null,null,null,null,null,null,null,null,null,null,null,null,null,null,null,null,null,null,null,null,null,null,null,null,null,null,null,null,null,null,null,null,null,null,null,null,null,null,null,null,null,null,null,null,null,null,null,null,null,null,null,null,null,null,null,null,null,null,null,null,null,41]
[null,null,null,null,null,null,null,null,null,null,null,null,null,null,null,null,null,null,null,null,null,null,null,null,null,null,null,null,null,null,null,null,null,null,null,null,null,null,null,null,null,null,null,null,null,null,null,null,null,null,null,null,null,null,null,null,null,null,null,null,null,null,null,null,null,null,null,null,null,null,null,null,null,null,null,null,null,null,null,null,null,null,null,null,null,null,null,null,null,null,null,null,null,null,null,null,null,null,null,null,null,null,null,null,null,null,null,null,null,null,null,null,null,null,null,null,null,null,null,null,null,null,null,null,null,null,null,null,null,null,null,null,null,null,null,null,null,null,null,null,null,null,null,null,42]
[null,null,null,null,null,null,null,null,null,null,null,null,null,null,null,null,null,null,null,null,null,null,null,null,null,null,null,null,null,null,null,null,null,null,null,null,null,null,null,null,null,null,null,null,null,null,null,null,null,null,null,null,null,null,null,null,null,null,null,null,null,null,null,null,null,null,null,null,null,null,null,null,null,null,null,null,null,null,null,null,null,null,null,null,null,null,null,null,null,null,null,null,null,null,null,null,null,null,null,null,null,null,null,null,null,null,null,null,null,null,null,null,null,null,null,null,null,null,null,null,null,null,null,null,null,null,null,null,null,null,null,null,null,null,null,null,null,null,null,null,null,null,null,null,43]
[null,null,null,null,null,null,null,null,null,null,null,null,null,null,null,null,null,null,null,null,null,null,null,null,null,null,null,null,null,null,null,null,null,null,null,null,null,null,null,null,null,null,null,null,null,null,null,null,null,null,null,null,null,null,null,null,null,null,null,null,null,null,null,null,null,null,null,null,null,null,null,null,null,null,null,null,null,null,null,null,null,null,null,null,null,null,null,null,null,null,null,null,null,null,null,null,null,null,null,null,null,null,null,null,null,null,null,null,null,null,null,null,null,null,null,null,null,null,null,null,null,null,null,null,null,null,null,null,null,null,null,null,null,null,null,null,null,null,null,null,null,null,null,null,44]
[null,null,null,null,null,null,null,null,null,null,null,null,null,null,null,null,null,null,null,null,null,null,null,null,null,null,null,null,null,null,null,null,null,null,null,null,null,null,null,null,null,null,null,null,null,null,null,null,null,null,null,null,null,null,null,null,null,null,null,null,null,null,null,null,null,null,null,null,null,null,null,null,null,null,null,null,null,null,null,null,null,null,null,null,null,null,null,null,null,null,null,null,null,null,null,null,null,null,null,null,null,null,null,null,null,null,null,null,null,null,null,null,null,null,null,null,null,null,null,null,null,null,null,null,null,null,null,null,null,null,null,null,null,null,null,null,null,null,null,null,null,null,null,null,45]
[null,null,null,null,null,null,null,null,null,null,null,null,null,null,null,null,null,null,null,null,null,null,null,null,null,null,null,null,null,null,null,null,null,null,null,null,null,null,null,null,null,null,null,null,null,null,null,null,null,null,null,null,null,null,null,null,null,null,null,null,null,null,null,null,null,null,null,null,null,null,null,null,null,null,null,null,null,null,null,null,null,null,null,null,null,null,null,null,null,null,null,null,null,null,null,null,null,null,null,null,null,null,null,null,null,null,null,null,null,null,null,null,null,null,null,null,null,null,null,null,null,null,null,null,null,null,null,null,null,null,null,null,null,null,null,null,null,null,null,null,null,null,null,null,46]
[null,null,null,null,null,null,null,null,null,null,null,null,null,null,null,null,null,null,null,null,null,null,null,null,null,null,null,null,null,null,null,null,null,null,null,null,null,null,null,null,null,null,null,null,null,null,null,null,null,null,null,null,null,null,null,null,null,null,null,null,null,null,null,null,null,null,null,null,null,null,null,null,null,null,null,null,null,null,null,null,null,null,null,null,null,null,null,null,null,null,null,null,null,null,null,null,null,null,null,null,null,null,null,null,null,null,null,null,null,null,null,null,null,null,null,null,null,null,null,null,null,null,null,null,null,null,null,null,null,null,null,null,null,null,null,null,null,null,null,null,null,null,null,null,47]
[null,null,null,null,null,null,null,null,null,null,null,null,null,null,null,null,null,null,null,null,null,null,null,null,null,null,null,null,null,null,null,null,null,null,null,null,null,null,null,null,null,null,null,null,null,null,null,null,null,null,null,null,null,null,null,null,null,null,null,null,null,null,null,null,null,null,null,null,null,null,null,null,null,null,null,null,null,null,null,null,null,null,null,null,null,null,null,null,null,null,null,null,null,null,null,null,null,null,null,null,null,null,null,null,null,null,null,null,null,null,null,null,null,null,null,null,null,null,null,null,null,null,null,null,null,null,null,null,null,null,null,null,null,null,null,null,null,null,null,null,null,null,null,null,48]
[null,null,null,null,null,null,null,null,null,null,null,null,null,null,null,null,null,null,null,null,null,null,null,null,null,null,null,null,null,null,null,null,null,null,null,null,null,null,null,null,null,null,null,null,null,null,null,null,null,null,null,null,null,null,null,null,null,null,null,null,null,null,null,null,null,null,null,null,null,null,null,null,null,null,null,null,null,null,null,null,null,null,null,null,null,null,null,null,null,null,null,null,null,null,null,null,null,null,null,null,null,null,null,null,null,null,null,null,null,null,null,null,null,null,null,null,null,null,null,null,null,null,null,null,null,null,null,null,null,null,null,null,null,null,null,null,null,null,null,null,null,null,null,null,49]
[null,null,null,null,null,null,null,null,null,null,null,null,null,null,null,null,null,null,null,null,null,null,null,null,null,null,null,null,null,null,null,null,null,null,null,null,null,null,null,null,null,null,null,null,null,null,null,null,null,null,null,null,null,null,null,null,null,null,null,null,null,null,null,null,null,null,null,null,null,null,null,null,null,null,null,null,null,null,null,null,null,null,null,null,null,null,null,null,null,null,null,null,null,null,null,null,null,null,null,null,null,null,null,null,null,null,null,null,null,null,null,null,null,null,null,null,null,null,null,null,null,null,null,null,null,null,null,null,null,null,null,null,null,null,null,null,null,null,null,null,null,null,null,null,50]
[null,null,null,null,null,null,null,null,null,null,null,null,null,null,null,null,null,null,null,null,null,null,null,null,null,null,null,null,null,null,null,null,null,null,null,null,null,null,null,null,null,null,null,null,null,null,null,null,null,null,null,null,null,null,null,null,null,null,null,null,null,null,null,null,null,null,null,null,null,null,null,null,null,null,null,null,null,null,null,null,null,null,null,null,null,null,null,null,null,null,null,null,null,null,null,null,null,null,null,null,null,null,null,null,null,null,null,null,null,null,null,null,null,null,null,null,null,null,null,null,null,null,null,null,null,null,null,null,null,null,null,null,null,null,null,null,null,null,null,null,null,null,null,null,51]
[null,null,null,null,null,null,null,null,null,null,null,null,null,null,null,null,null,null,null,null,null,null,null,null,null,null,null,null,null,null,null,null,null,null,null,null,null,null,null,null,null,null,null,null,null,null,null,null,null,null,null,null,null,null,null,null,null,null,null,null,null,null,null,null,null,null,null,null,null,null,null,null,null,null,null,null,null,null,null,null,null,null,null,null,null,null,null,null,null,null,null,null,null,null,null,null,null,null,null,null,null,null,null,null,null,null,null,null,null,null,null,null,null,null,null,null,null,null,null,null,null,null,null,null,null,null,null,null,null,null,null,null,null,null,null,null,null,null,null,null,null,null,null,null,52]
[null,null,null,null,null,null,null,null,null,null,null,null,null,null,null,null,null,null,null,null,null,null,null,null,null,null,null,null,null,null,null,null,null,null,null,null,null,null,null,null,null,null,null,null,null,null,null,null,null,null,null,null,null,null,null,null,null,null,null,null,null,null,null,null,null,null,null,null,null,null,null,null,null,null,null,null,null,null,null,null,null,null,null,null,null,null,null,null,null,null,null,null,null,null,null,null,null,null,null,null,null,null,null,null,null,null,null,null,null,null,null,null,null,null,null,null,null,null,null,null,null,null,null,null,null,null,null,null,null,null,null,null,null,null,null,null,null,null,null,null,null,null,null,null,53]
[null,null,null,null,null,null,null,null,null,null,null,null,null,null,null,null,null,null,null,null,null,null,null,null,null,null,null,null,null,null,null,null,null,null,null,null,null,null,null,null,null,null,null,null,null,null,null,null,null,null,null,null,null,null,null,null,null,null,null,null,null,null,null,null,null,null,null,null,null,null,null,null,null,null,null,null,null,null,null,null,null,null,null,null,null,null,null,null,null,null,null,null,null,null,null,null,null,null,null,null,null,null,null,null,null,null,null,null,null,null,null,null,null,null,null,null,null,null,null,null,null,null,null,null,null,null,null,null,null,null,null,null,null,null,null,null,null,null,null,null,null,null,null,null,54]
[null,null,null,null,null,null,null,null,null,null,null,null,null,null,null,null,null,null,null,null,null,null,null,null,null,null,null,null,null,null,null,null,null,null,null,null,null,null,null,null,null,null,null,null,null,null,null,null,null,null,null,null,null,null,null,null,null,null,null,null,null,null,null,null,null,null,null,null,null,null,null,null,null,null,null,null,null,null,null,null,null,null,null,null,null,null,null,null,null,null,null,null,null,null,null,null,null,null,null,null,null,null,null,null,null,null,null,null,null,null,null,null,null,null,null,null,null,null,null,null,null,null,null,null,null,null,null,null,null,null,null,null,null,null,null,null,null,null,null,null,null,null,null,null,55]
[null,null,null,null,null,null,null,null,null,null,null,null,null,null,null,null,null,null,null,null,null,null,null,null,null,null,null,null,null,null,null,null,null,null,null,null,null,null,null,null,null,null,null,null,null,null,null,null,null,null,null,null,null,null,null,null,null,null,null,null,null,null,null,null,null,null,null,null,null,null,null,null,null,null,null,null,null,null,null,null,null,null,null,null,null,null,null,null,null,null,null,null,null,null,null,null,null,null,null,null,null,null,null,null,null,null,null,null,null,null,null,null,null,null,null,null,null,null,null,null,null,null,null,null,null,null,null,null,null,null,null,null,null,null,null,null,null,null,null,null,null,null,null,null,56]
[null,null,null,null,null,null,null,null,null,null,null,null,null,null,null,null,null,null,null,null,null,null,null,null,null,null,null,null,null,null,null,null,null,null,null,null,null,null,null,null,null,null,null,null,null,null,null,null,null,null,null,null,null,null,null,null,null,null,null,null,null,null,null,null,null,null,null,null,null,null,null,null,null,null,null,null,null,null,null,null,null,null,null,null,null,null,null,null,null,null,null,null,null,null,null,null,null,null,null,null,null,null,null,null,null,null,null,null,null,null,null,null,null,null,null,null,null,null,null,null,null,null,null,null,null,null,null,null,null,null,null,null,null,null,null,null,null,null,null,null,null,null,null,null,57]
[null,null,null,null,null,null,null,null,null,null,null,null,null,null,null,null,null,null,null,null,null,null,null,null,null,null,null,null,null,null,null,null,null,null,null,null,null,null,null,null,null,null,null,null,null,null,null,null,null,null,null,null,null,null,null,null,null,null,null,null,null,null,null,null,null,null,null,null,null,null,null,null,null,null,null,null,null,null,null,null,null,null,null,null,null,null,null,null,null,null,null,null,null,null,null,null,null,null,null,null,null,null,null,null,null,null,null,null,null,null,null,null,null,null,null,null,null,null,null,null,null,null,null,null,null,null,null,null,null,null,null,null,null,null,null,null,null,null,null,null,null,null,null,null,58]
[null,null,null,null,null,null,null,null,null,null,null,null,null,null,null,null,null,null,null,null,null,null,null,null,null,null,null,null,null,null,null,null,null,null,null,null,null,null,null,null,null,null,null,null,null,null,null,null,null,null,null,null,null,null,null,null,null,null,null,null,null,null,null,null,null,null,null,null,null,null,null,null,null,null,null,null,null,null,null,null,null,null,null,null,null,null,null,null,null,null,null,null,null,null,null,null,null,null,null,null,null,null,null,null,null,null,null,null,null,null,null,null,null,null,null,null,null,null,null,null,null,null,null,null,null,null,null,null,null,null,null,null,null,null,null,null,null,null,null,null,null,null,null,null,59]
[null,null,null,null,null,null,null,null,null,null,null,null,null,null,null,null,null,null,null,null,null,null,null,null,null,null,null,null,null,null,null,null,null,null,null,null,null,null,null,null,null,null,null,null,null,null,null,null,null,null,null,null,null,null,null,null,null,null,null,null,null,null,null,null,null,null,null,null,null,null,null,null,null,null,null,null,null,null,null,null,null,null,null,null,null,null,null,null,null,null,null,null,null,null,null,null,null,null,null,null,null,null,null,null,null,null,null,null,null,null,null,null,null,null,null,null,null,null,null,null,null,null,null,null,null,null,null,null,null,null,null,null,null,null,null,null,null,null,null,null,null,null,null,null,60]
[null,null,null,null,null,null,null,null,null,null,null,null,null,null,null,null,null,null,null,null,null,null,null,null,null,null,null,null,null,null,null,null,null,null,null,null,null,null,null,null,null,null,null,null,null,null,null,null,null,null,null,null,null,null,null,null,null,null,null,null,null,null,null,null,null,null,null,null,null,null,null,null,null,null,null,null,null,null,null,null,null,null,null,null,null,null,null,null,null,null,null,null,null,null,null,null,null,null,null,null,null,null,null,null,null,null,null,null,null,null,null,null,null,null,null,null,null,null,null,null,null,null,null,null,null,null,null,null,null,null,null,null,null,null,null,null,null,null,null,null,null,null,null,null,61]
[null,null,null,null,null,null,null,null,null,null,null,null,null,null,null,null,null,null,null,null,null,null,null,null,null,null,null,null,null,null,null,null,null,null,null,null,null,null,null,null,null,null,null,null,null,null,null,null,null,null,null,null,null,null,null,null,null,null,null,null,null,null,null,null,null,null,null,null,null,null,null,null,null,null,null,null,null,null,null,null,null,null,null,null,null,null,null,null,null,null,null,null,null,null,null,null,null,null,null,null,null,null,null,null,null,null,null,null,null,null,null,null,null,null,null,null,null,null,null,null,null,null,null,null,null,null,null,null,null,null,null,null,null,null,null,null,null,null,null,null,null,null,null,null,62]
[null,null,null,null,null,null,null,null,null,null,null,null,null,null,null,null,null,null,null,null,null,null,null,null,null,null,null,null,null,null,null,null,null,null,null,null,null,null,null,null,null,null,null,null,null,null,null,null,null,null,null,null,null,null,null,null,null,null,null,null,null,null,null,null,null,null,null,null,null,null,null,null,null,null,null,null,null,null,null,null,null,null,null,null,null,null,null,null,null,null,null,null,null,null,null,null,null,null,null,null,null,null,null,null,null,null,null,null,null,null,null,null,null,null,null,null,null,null,null,null,null,null,null,null,null,null,null,null,null,null,null,null,null,null,null,null,null,null,null,null,null,null,null,null,63]
[null,null,null,null,null,null,null,null,null,null,null,null,null,null,null,null,null,null,null,null,null,null,null,null,null,null,null,null,null,null,null,null,null,null,null,null,null,null,null,null,null,null,null,null,null,null,null,null,null,null,null,null,null,null,null,null,null,null,null,null,null,null,null,null,null,null,null,null,null,null,null,null,null,null,null,null,null,null,null,null,null,null,null,null,null,null,null,null,null,null,null,null,null,null,null,null,null,null,null,null,null,null,null,null,null,null,null,null,null,null,null,null,null,null,null,null,null,null,null,null,null,null,null,null,null,null,null,null,null,null,null,null,null,null,null,null,null,null,null,null,null,null,null,null,64]
[null,null,null,null,null,null,null,null,null,null,null,null,null,null,null,null,null,null,null,null,null,null,null,null,null,null,null,null,null,null,null,null,null,null,null,null,null,null,null,null,null,null,null,null,null,null,null,null,null,null,null,null,null,null,null,null,null,null,null,null,null,null,null,null,null,null,null,null,null,null,null,null,null,null,null,null,null,null,null,null,null,null,null,null,null,null,null,null,null,null,null,null,null,null,null,null,null,null,null,null,null,null,null,null,null,null,null,null,null,null,null,null,null,null,null,null,null,null,null,null,null,null,null,null,null,null,null,null,null,null,null,null,null,null,null,null,null,null,null,null,null,null,null,null,65]
[null,null,null,null,null,null,null,null,null,null,null,null,null,null,null,null,null,null,null,null,null,null,null,null,null,null,null,null,null,null,null,null,null,null,null,null,null,null,null,null,null,null,null,null,null,null,null,null,null,null,null,null,null,null,null,null,null,null,null,null,null,null,null,null,null,null,null,null,null,null,null,null,null,null,null,null,null,null,null,null,null,null,null,null,null,null,null,null,null,null,null,null,null,null,null,null,null,null,null,null,null,null,null,null,null,null,null,null,null,null,null,null,null,null,null,null,null,null,null,null,null,null,null,null,null,null,null,null,null,null,null,null,null,null,null,null,null,null,null,null,null,null,null,null,66]
[null,null,null,null,null,null,null,null,null,null,null,null,null,null,null,null,null,null,null,null,null,null,null,null,null,null,null,null,null,null,null,null,null,null,null,null,null,null,null,null,null,null,null,null,null,null,null,null,null,null,null,null,null,null,null,null,null,null,null,null,null,null,null,null,null,null,null,null,null,null,null,null,null,null,null,null,null,null,null,null,null,null,null,null,null,null,null,null,null,null,null,null,null,null,null,null,null,null,null,null,null,null,null,null,null,null,null,null,null,null,null,null,null,null,null,null,null,null,null,null,null,null,null,null,null,null,null,null,null,null,null,null,null,null,null,null,null,null,null,null,null,null,null,null,67]
[null,null,null,null,null,null,null,null,null,null,null,null,null,null,null,null,null,null,null,null,null,null,null,null,null,null,null,null,null,null,null,null,null,null,null,null,null,null,null,null,null,null,null,null,null,null,null,null,null,null,null,null,null,null,null,null,null,null,null,null,null,null,null,null,null,null,null,null,null,null,null,null,null,null,null,null,null,null,null,null,null,null,null,null,null,null,null,null,null,null,null,null,null,null,null,null,null,null,null,null,null,null,null,null,null,null,null,null,null,null,null,null,null,null,null,null,null,null,null,null,null,null,null,null,null,null,null,null,null,null,null,null,null,null,null,null,null,null,null,null,null,null,null,null,68]
[null,null,null,null,null,null,null,null,null,null,null,null,null,null,null,null,null,null,null,null,null,null,null,null,null,null,null,null,null,null,null,null,null,null,null,null,null,null,null,null,null,null,null,null,null,null,null,null,null,null,null,null,null,null,null,null,null,null,null,null,null,null,null,null,null,null,null,null,null,null,null,null,null,null,null,null,null,null,null,null,null,null,null,null,null,null,null,null,null,null,null,null,null,null,null,null,null,null,null,null,null,null,null,null,null,null,null,null,null,null,null,null,null,null,null,null,null,null,null,null,null,null,null,null,null,null,null,null,null,null,null,null,null,null,null,null,null,null,null,null,null,null,null,null,69]
[null,null,null,null,null,null,null,null,null,null,null,null,null,null,null,null,null,null,null,null,null,null,null,null,null,null,null,null,null,null,null,null,null,null,null,null,null,null,null,null,null,null,null,null,null,null,null,null,null,null,null,null,null,null,null,null,null,null,null,null,null,null,null,null,null,null,null,null,null,null,null,null,null,null,null,null,null,null,null,null,null,null,null,null,null,null,null,null,null,null,null,null,null,null,null,null,null,null,null,null,null,null,null,null,null,null,null,null,null,null,null,null,null,null,null,null,null,null,null,null,null,null,null,null,null,null,null,null,null,null,null,null,null,null,null,null,null,null,null,null,null,null,null,null,70]
[null,null,null,null,null,null,null,null,null,null,null,null,null,null,null,null,null,null,null,null,null,null,null,null,null,null,null,null,null,null,null,null,null,null,null,null,null,null,null,null,null,null,null,null,null,null,null,null,null,null,null,null,null,null,null,null,null,null,null,null,null,null,null,null,null,null,null,null,null,null,null,null,null,null,null,null,null,null,null,null,null,null,null,null,null,null,null,null,null,null,null,null,null,null,null,null,null,null,null,null,null,null,null,null,null,null,null,null,null,null,null,null,null,null,null,null,null,null,null,null,null,null,null,null,null,null,null,null,null,null,null,null,null,null,null,null,null,null,null,null,null,null,null,null,71]
[null,null,null,null,null,null,null,null,null,null,null,null,null,null,null,null,null,null,null,null,null,null,null,null,null,null,null,null,null,null,null,null,null,null,null,null,null,null,null,null,null,null,null,null,null,null,null,null,null,null,null,null,null,null,null,null,null,null,null,null,null,null,null,null,null,null,null,null,null,null,null,null,null,null,null,null,null,null,null,null,null,null,null,null,null,null,null,null,null,null,null,null,null,null,null,null,null,null,null,null,null,null,null,null,null,null,null,null,null,null,null,null,null,null,null,null,null,null,null,null,null,null,null,null,null,null,null,null,null,null,null,null,null,null,null,null,null,null,null,null,null,null,null,null,72]
[null,null,null,null,null,null,null,null,null,null,null,null,null,null,null,null,null,null,null,null,null,null,null,null,null,null,null,null,null,null,null,null,null,null,null,null,null,null,null,null,null,null,null,null,null,null,null,null,null,null,null,null,null,null,null,null,null,null,null,null,null,null,null,null,null,null,null,null,null,null,null,null,null,null,null,null,null,null,null,null,null,null,null,null,null,null,null,null,null,null,null,null,null,null,null,null,null,null,null,null,null,null,null,null,null,null,null,null,null,null,null,null,null,null,null,null,null,null,null,null,null,null,null,null,null,null,null,null,null,null,null,null,null,null,null,null,null,null,null,null,null,null,null,null,73]
[null,null,null,null,null,null,null,null,null,null,null,null,null,null,null,null,null,null,null,null,null,null,null,null,null,null,null,null,null,null,null,null,null,null,null,null,null,null,null,null,null,null,null,null,null,null,null,null,null,null,null,null,null,null,null,null,null,null,null,null,null,null,null,null,null,null,null,null,null,null,null,null,null,null,null,null,null,null,null,null,null,null,null,null,null,null,null,null,null,null,null,null,null,null,null,null,null,null,null,null,null,null,null,null,null,null,null,null,null,null,null,null,null,null,null,null,null,null,null,null,null,null,null,null,null,null,null,null,null,null,null,null,null,null,null,null,null,null,null,null,null,null,null,null,74]
[null,null,null,null,null,null,null,null,null,null,null,null,null,null,null,null,null,null,null,null,null,null,null,null,null,null,null,null,null,null,null,null,null,null,null,null,null,null,null,null,null,null,null,null,null,null,null,null,null,null,null,null,null,null,null,null,null,null,null,null,null,null,null,null,null,null,null,null,null,null,null,null,null,null,null,null,null,null,null,null,null,null,null,null,null,null,null,null,null,null,null,null,null,null,null,null,null,null,null,null,null,null,null,null,null,null,null,null,null,null,null,null,null,null,null,null,null,null,null,null,null,null,null,null,null,null,null,null,null,null,null,null,null,null,null,null,null,null,null,null,null,null,null,null,75]
[null,null,null,null,null,null,null,null,null,null,null,null,null,null,null,null,null,null,null,null,null,null,null,null,null,null,null,null,null,null,null,null,null,null,null,null,null,null,null,null,null,null,null,null,null,null,null,null,null,null,null,null,null,null,null,null,null,null,null,null,null,null,null,null,null,null,null,null,null,null,null,null,null,null,null,null,null,null,null,null,null,null,null,null,null,null,null,null,null,null,null,null,null,null,null,null,null,null,null,null,null,null,null,null,null,null,null,null,null,null,null,null,null,null,null,null,null,null,null,null,null,null,null,null,null,null,null,null,null,null,null,null,null,null,null,null,null,null,null,null,null,null,null,null,76]
[null,null,null,null,null,null,null,null,null,null,null,null,null,null,null,null,null,null,null,null,null,null,null,null,null,null,null,null,null,null,null,null,null,null,null,null,null,null,null,null,null,null,null,null,null,null,null,null,null,null,null,null,null,null,null,null,null,null,null,null,null,null,null,null,null,null,null,null,null,null,null,null,null,null,null,null,null,null,null,null,null,null,null,null,null,null,null,null,null,null,null,null,null,null,null,null,null,null,null,null,null,null,null,null,null,null,null,null,null,null,null,null,null,null,null,null,null,null,null,null,null,null,null,null,null,null,null,null,null,null,null,null,null,null,null,null,null,null,null,null,null,null,null,null,77]
[null,null,null,null,null,null,null,null,null,null,null,null,null,null,null,null,null,null,null,null,null,null,null,null,null,null,null,null,null,null,null,null,null,null,null,null,null,null,null,null,null,null,null,null,null,null,null,null,null,null,null,null,null,null,null,null,null,null,null,null,null,null,null,null,null,null,null,null,null,null,null,null,null,null,null,null,null,null,null,null,null,null,null,null,null,null,null,null,null,null,null,null,null,null,null,null,null,null,null,null,null,null,null,null,null,null,null,null,null,null,null,null,null,null,null,null,null,null,null,null,null,null,null,null,null,null,null,null,null,null,null,null,null,null,null,null,null,null,null,null,null,null,null,null,78]
[null,null,null,null,null,null,null,null,null,null,null,null,null,null,null,null,null,null,null,null,null,null,null,null,null,null,null,null,null,null,null,null,null,null,null,null,null,null,null,null,null,null,null,null,null,null,null,null,null,null,null,null,null,null,null,null,null,null,null,null,null,null,null,null,null,null,null,null,null,null,null,null,null,null,null,null,null,null,null,null,null,null,null,null,null,null,null,null,null,null,null,null,null,null,null,null,null,null,null,null,null,null,null,null,null,null,null,null,null,null,null,null,null,null,null,null,null,null,null,null,null,null,null,null,null,null,null,null,null,null,null,null,null,null,null,null,null,null,null,null,null,null,null,null,79]
[null,null,null,null,null,null,null,null,null,null,null,null,null,null,null,null,null,null,null,null,null,null,null,null,null,null,null,null,null,null,null,null,null,null,null,null,null,null,null,null,null,null,null,null,null,null,null,null,null,null,null,null,null,null,null,null,null,null,null,null,null,null,null,null,null,null,null,null,null,null,null,null,null,null,null,null,null,null,null,null,null,null,null,null,null,null,null,null,null,null,null,null,null,null,null,null,null,null,null,null,null,null,null,null,null,null,null,null,null,null,null,null,null,null,null,null,null,null,null,null,null,null,null,null,null,null,null,null,null,null,null,null,null,null,null,null,null,null,null,null,null,null,null,null,80]